{"text_format":"3","workbook":"xlsx","n_sheets":6,"sheets":["Main","Future Intra","Cash Intra","MidCap Intra","Bulk Deals","Call Tracker (Equity & F&O)"],"not_rendered":{"images":4,"defined_names":1},"read":"whole","date_system":"1900"}

{"sheet":"Main","index":0,"n_rows":27,"n_cols":11,"rows_kept":27}
[null,"                                                                                                 "]
{"$rows_empty":8}
[null,"2021-09-30"]
[]
[null,"Sheet No.","Template Name","Summary"]
[null,1,"Future Intra","For Intraday trading in F&O segment"]
[null,2,"Cash Intra","For Intraday trading in cash market segment"]
[null,3,"Mid-cap Intra","For Intraday trading in Mid-cap stocks"]
[null,4,"Bulk Deals","Reveals Bulk Deals carried on NSE & BSE"]
[null,5,"Call Tracker"]
{"$rows_empty":9}
[{"$nulls":10},"`"]

{"sheet":"Future Intra","index":1,"n_rows":218,"n_cols":16,"rows_kept":218,"merged":[[8,0,9,0],[8,1,9,1],[8,2,9,2],[8,3,9,3],[8,6,8,8],[8,9,8,11]]}
[]
[]
[]
[]
[{"$nulls":12},"Back to Main Page"]
["FOR INTRA DAY TRADING",{"$nulls":10},{"$f":"Main!B10","v":"2021-09-30"}]
[]
[]
["Sr.no","Sector","Scrip","Expiry Date","CLOSE RATE","Pivot Point","Supports",null,null,"Resistances"]
[{"$nulls":4},"Point","Point","S1","S2","S3","R1","R2","R3","HIGH","LOW","OI","% Change in OI"]
[1,"Index","BANKNIFTY","2021-09-30",{"v":37878.5,"d":"37878.50"},{"v":37773.333333333336,"d":"37773.33"},{"v":37497.81666666667,"d":"37497.82"},{"v":37117.13333333334,"d":"37117.13"},{"v":36841.616666666676,"d":"36841.62"},{"v":38154.01666666667,"d":"38154.02"},{"v":38429.53333333333,"d":"38429.53"},{"v":38810.21666666667,"d":"38810.22"},38048.85,37392.65,2248700,{"v":0.1594374766367187,"d":"15.94%"}]
[2,"Index","NIFTY","2021-09-30",{"v":17708,"d":"17708.00"},{"v":17705.033333333336,"d":"17705.03"},{"v":17616.016666666674,"d":"17616.02"},{"v":17524.033333333336,"d":"17524.03"},{"v":17435.016666666674,"d":"17435.02"},{"v":17797.016666666674,"d":"17797.02"},{"v":17886.033333333336,"d":"17886.03"},{"v":17978.016666666674,"d":"17978.02"},17794.05,17613.05,15353100,{"v":1.8237994407885078E-3,"d":"0.18%"}]
[3,"Index","FINNIFTY","2021-09-30",18412.85,18393.25,{"v":18324.6,"d":"18324.60"},18236.35,{"v":18167.699999999997,"d":"18167.70"},{"v":18481.5,"d":"18481.50"},18550.15,{"v":18638.4,"d":"18638.40"},18461.9,18305,3880,{"v":-0.0761904761904762,"d":"-7.62%"}]
[4,"Chemical","AARTIIND","2021-09-30",{"v":938.2,"d":"938.20"},{"v":931.6333333333333,"d":"931.63"},{"v":920.7166666666667,"d":"920.72"},{"v":903.2333333333333,"d":"903.23"},{"v":892.3166666666667,"d":"892.32"},{"v":949.1166666666667,"d":"949.12"},{"v":960.0333333333334,"d":"960.03"},{"v":977.5166666666667,"d":"977.52"},942.55,914.15,3245300,{"v":-0.01623292965730482,"d":"-1.62%"}]
[5,"Textile","ABFRL","2021-09-30",231.75,{"v":228.1833333333333,"d":"228.18"},{"v":222.76666666666662,"d":"222.77"},{"v":213.7833333333333,"d":"213.78"},{"v":208.36666666666662,"d":"208.37"},{"v":237.16666666666663,"d":"237.17"},{"v":242.58333333333331,"d":"242.58"},{"v":251.56666666666663,"d":"251.57"},233.6,219.2,13527800,{"v":-9.706889988580129E-3,"d":"-0.97%"}]
[6,"Cement","ACC","2021-09-30",{"v":2274.1,"d":"2274.10"},2271.15,{"v":2250.7000000000003,"d":"2250.70"},{"v":2227.3,"d":"2227.30"},{"v":2206.8500000000004,"d":"2206.85"},2294.55,{"v":2315,"d":"2315.00"},{"v":2338.4,"d":"2338.40"},2291.6,2247.75,3047000,{"v":-0.015349814186459847,"d":"-1.53%"}]
[7,"Others","ADANIENT","2021-09-30",{"v":1487.1,"d":"1487.10"},{"v":1484.0166666666667,"d":"1484.02"},{"v":1468.0333333333333,"d":"1468.03"},{"v":1448.9666666666667,"d":"1448.97"},{"v":1432.9833333333333,"d":"1432.98"},{"v":1503.0833333333333,"d":"1503.08"},{"v":1519.0666666666664,"d":"1519.07"},{"v":1538.1333333333332,"d":"1538.13"},1500,1464.95,27235000,{"v":-0.008085369851039808,"d":"-0.81%"}]
[8,"Others","ADANIPORTS","2021-09-30",{"v":740.7,"d":"740.70"},{"v":741.5,"d":"741.50"},734.55,{"v":728.4,"d":"728.40"},{"v":721.4499999999999,"d":"721.45"},747.65,{"v":754.6,"d":"754.60"},760.75,748.45,735.35,91231250,{"v":-0.00627672031152139,"d":"-0.63%"}]
[9,"Pharma","ALKEM","2021-09-30",{"v":3946.7,"d":"3946.70"},{"v":3965.4500000000003,"d":"3965.45"},{"v":3891.6500000000005,"d":"3891.65"},{"v":3836.6000000000004,"d":"3836.60"},{"v":3762.8000000000006,"d":"3762.80"},{"v":4020.5000000000005,"d":"4020.50"},{"v":4094.3000000000006,"d":"4094.30"},4149.35,4039.25,3910.4,393400,{"v":-0.05296100144439095,"d":"-5.30%"}]
[10,"Automobile","AMARAJABAT","2021-09-30",{"v":758.8,"d":"758.80"},{"v":755.3333333333334,"d":"755.33"},{"v":746.7166666666667,"d":"746.72"},{"v":734.6333333333333,"d":"734.63"},{"v":726.0166666666667,"d":"726.02"},{"v":767.4166666666667,"d":"767.42"},{"v":776.0333333333333,"d":"776.03"},{"v":788.1166666666668,"d":"788.12"},763.95,743.25,8832000,{"v":-0.05276705276705277,"d":"-5.28%"}]
{"$rows_left_out":183}
{"sheet":"Cash Intra","index":2,"n_rows":246,"n_cols":13,"rows_kept":246,"merged":[[7,0,8,0],[7,1,8,1],[7,2,8,2],[7,3,8,3],[7,4,7,6],[7,7,7,9]]}
[]
[]
[]
[]
[{"$nulls":12},"Back to Main Page"]
["FOR INTRA DAY TRADING",{"$nulls":9},{"$f":"Main!B10","v":"2021-09-30"}]
[]
["Sr.no",null,"CLOSE RATE","Pivot Point","Supports",null,null,"Resistances"]
[{"$nulls":4},"S1","S2","S3","R1","R2","R3","HIGH","LOW","Total Trade Quanity in Lakhs"]
[1,"Nifty 50",17711.3,{"v":17700.4,"d":"17700.40"},{"v":17619.050000000003,"d":"17619.05"},{"v":17526.800000000003,"d":"17526.80"},{"v":17445.450000000004,"d":"17445.45"},17792.65,{"v":17874,"d":"17874.00"},17966.25,17781.75,17608.15]
[2,"Nifty Bank",37743,{"v":37679.166666666664,"d":"37679.17"},{"v":37434.88333333333,"d":"37434.88"},{"v":37126.76666666667,"d":"37126.77"},{"v":36882.48333333334,"d":"36882.48"},{"v":37987.283333333326,"d":"37987.28"},{"v":38231.566666666666,"d":"38231.57"},{"v":38539.68333333332,"d":"38539.68"},37923.45,37371.05]
[3,"Nifty CPSE",2371.95,{"v":2340.9666666666667,"d":"2340.97"},{"v":2294.0833333333335,"d":"2294.08"},{"v":2216.2166666666667,"d":"2216.22"},{"v":2169.3333333333335,"d":"2169.33"},{"v":2418.8333333333335,"d":"2418.83"},{"v":2465.7166666666667,"d":"2465.72"},{"v":2543.5833333333335,"d":"2543.58"},2387.85,2263.1]
[4,"Nifty Infra",5043.9,{"v":5034.966666666667,"d":"5034.97"},{"v":5010.383333333334,"d":"5010.38"},{"v":4976.866666666667,"d":"4976.87"},{"v":4952.283333333334,"d":"4952.28"},{"v":5068.4833333333345,"d":"5068.48"},{"v":5093.066666666667,"d":"5093.07"},{"v":5126.583333333335,"d":"5126.58"},5059.55,5001.45]
[5,"Nifty IT",35282.65,{"v":35198.3,"d":"35198.30"},{"v":34818.3,"d":"34818.30"},34353.95,33973.95,{"v":35662.65000000001,"d":"35662.65"},{"v":36042.65000000001,"d":"36042.65"},{"v":36507.000000000015,"d":"36507.00"},35578.3,34733.95]
[6,"Nifty PSE",4113.7,{"v":4072.6499999999996,"d":"4072.65"},{"v":4015.6499999999996,"d":"4015.65"},{"v":3917.6,"d":"3917.60"},{"v":3860.6,"d":"3860.60"},{"v":4170.699999999999,"d":"4170.70"},{"v":4227.699999999999,"d":"4227.70"},{"v":4325.749999999999,"d":"4325.75"},4129.65,3974.6]
[7,"Nifty Midcap 50",8257.95,{"v":8219.616666666667,"d":"8219.62"},{"v":8135.683333333334,"d":"8135.68"},{"v":8013.416666666668,"d":"8013.42"},{"v":7929.483333333335,"d":"7929.48"},{"v":8341.883333333333,"d":"8341.88"},{"v":8425.816666666664,"d":"8425.82"},{"v":8548.083333333332,"d":"8548.08"},8303.55,8097.35]
[8,"ACC",2271.1,2269.85,2246.35,{"v":2221.6,"d":"2221.60"},{"v":2198.1,"d":"2198.10"},{"v":2294.6,"d":"2294.60"},{"v":2318.1,"d":"2318.10"},2342.85,2293.35,2245.1,5.18866]
[9,"AUBANK",1158.9,{"v":1150.1333333333334,"d":"1150.13"},{"v":1121.2666666666669,"d":"1121.27"},{"v":1083.6333333333334,"d":"1083.63"},{"v":1054.7666666666669,"d":"1054.77"},{"v":1187.7666666666669,"d":"1187.77"},{"v":1216.6333333333332,"d":"1216.63"},{"v":1254.2666666666669,"d":"1254.27"},1179,1112.5,38.2643]
[10,"AARTIIND",937.65,{"v":932,"d":"932.00"},{"v":922,"d":"922.00"},906.35,896.35,947.65,957.65,{"v":973.3,"d":"973.30"},942,916.35,9.80092]
[11,"ABBOTINDIA",19555.8,{"v":19922.533333333333,"d":"19922.53"},{"v":18834.266666666666,"d":"18834.27"},{"v":18112.733333333334,"d":"18112.73"},{"v":17024.466666666667,"d":"17024.47"},{"v":20644.066666666666,"d":"20644.07"},{"v":21732.33333333333,"d":"21732.33"},{"v":22453.866666666665,"d":"22453.87"},21010.8,19201,0.6512]
{"$rows_left_out":227}
{"sheet":"MidCap Intra","index":3,"n_rows":537,"n_cols":13,"rows_kept":537,"merged":[[0,0,0,1],[8,0,9,0],[8,1,9,1],[8,2,9,2],[8,3,9,3],[8,4,8,6],[8,7,8,9]]}
[]
[]
[]
[]
[{"$nulls":11},"Back To Main Page"]
["FOR INTRA DAY TRADING",{"$nulls":9},{"$f":"Main!B10","v":"2021-09-30"}]
[null,null," "]
[]
["Sr.no","Scrip","CLOSE RATE","Pivot Point","Supports",null,null,"Resistances"]
[{"$nulls":4},"S1","S2","S3","R1","R2","R3","HIGH","LOW","Total Trade Quanity in Lakhs"]
[1,"3MINDIA",24685.65,{"v":24660.333333333332,"d":"24660.33"},{"v":24525.316666666666,"d":"24525.32"},{"v":24364.983333333334,"d":"24364.98"},{"v":24229.966666666667,"d":"24229.97"},{"v":24820.666666666664,"d":"24820.67"},{"v":24955.683333333334,"d":"24955.68"},{"v":25116.016666666663,"d":"25116.02"},24795.35,24500,0.01158]
[2,"ABB",1820.55,{"v":1818.8166666666666,"d":"1818.82"},{"v":1798.8333333333333,"d":"1798.83"},{"v":1777.1166666666666,"d":"1777.12"},{"v":1757.1333333333332,"d":"1757.13"},{"v":1840.5333333333333,"d":"1840.53"},{"v":1860.5166666666669,"d":"1860.52"},{"v":1882.2333333333333,"d":"1882.23"},1838.8,1797.1,1.52524]
[3,"POWERINDIA",2410.35,{"v":2420.1666666666665,"d":"2420.17"},{"v":2265.333333333333,"d":"2265.33"},{"v":2120.3166666666666,"d":"2120.32"},{"v":1965.4833333333331,"d":"1965.48"},{"v":2565.183333333333,"d":"2565.18"},{"v":2720.016666666666,"d":"2720.02"},{"v":2865.033333333333,"d":"2865.03"},2575,2275.15,4.25566]
[4,"ACC",2271.1,2269.85,2246.35,{"v":2221.6,"d":"2221.60"},{"v":2198.1,"d":"2198.10"},{"v":2294.6,"d":"2294.60"},{"v":2318.1,"d":"2318.10"},2342.85,2293.35,2245.1,5.18866]
[5,"AIAENG",1921,{"v":1932.3166666666666,"d":"1932.32"},{"v":1904.6833333333332,"d":"1904.68"},{"v":1888.3666666666666,"d":"1888.37"},{"v":1860.7333333333331,"d":"1860.73"},{"v":1948.6333333333332,"d":"1948.63"},{"v":1976.2666666666664,"d":"1976.27"},{"v":1992.5833333333333,"d":"1992.58"},1959.95,1916,0.18358]
[6,"APLAPOLLO",829.45,{"v":831.4833333333332,"d":"831.48"},{"v":817.9666666666665,"d":"817.97"},{"v":806.4833333333332,"d":"806.48"},{"v":792.9666666666665,"d":"792.97"},{"v":842.9666666666665,"d":"842.97"},{"v":856.4833333333331,"d":"856.48"},{"v":867.9666666666665,"d":"867.97"},845,820,8.80113]
[7,"AUBANK",1158.9,{"v":1150.1333333333334,"d":"1150.13"},{"v":1121.2666666666669,"d":"1121.27"},{"v":1083.6333333333334,"d":"1083.63"},{"v":1054.7666666666669,"d":"1054.77"},{"v":1187.7666666666669,"d":"1187.77"},{"v":1216.6333333333332,"d":"1216.63"},{"v":1254.2666666666669,"d":"1254.27"},1179,1112.5,38.2643]
[8,"AARTIDRUGS",608.8,{"v":609.4333333333333,"d":"609.43"},{"v":604.8666666666666,"d":"604.87"},{"v":600.9333333333333,"d":"600.93"},{"v":596.3666666666666,"d":"596.37"},{"v":613.3666666666666,"d":"613.37"},{"v":617.9333333333334,"d":"617.93"},{"v":621.8666666666666,"d":"621.87"},614,605.5,1.18604]
[9,"AARTIIND",937.65,{"v":932,"d":"932.00"},{"v":922,"d":"922.00"},906.35,896.35,947.65,957.65,{"v":973.3,"d":"973.30"},942,916.35,9.80092]
[10,"AAVAS",2612.45,{"v":2611.5166666666664,"d":"2611.52"},{"v":2575.933333333333,"d":"2575.93"},{"v":2539.4166666666665,"d":"2539.42"},{"v":2503.833333333333,"d":"2503.83"},{"v":2648.033333333333,"d":"2648.03"},{"v":2683.616666666667,"d":"2683.62"},{"v":2720.1333333333328,"d":"2720.13"},2647.1,2575,0.51188]
{"$rows_left_out":518}
{"sheet":"Bulk Deals","index":4,"n_rows":100,"n_cols":8,"rows_kept":100,"merged":[[4,0,4,1],[4,2,4,3],[6,1,6,2]]}
[" "]
[]
[]
[]
[]
[{"$nulls":4},"Back To Main Page"]
["Subject :","BULK DEAL",null,{"$f":"Main!B10","v":"2021-09-30"}]
[]
["Date","Scrip code","Scrip Name","Client Name","Buy / Sell","Quantity Traded","Trade Price / Wt.Avg.trade price","Exchange  "]
["2021-09-29",538812,"AANCHALISP","ALPHA LEON ENTERPRISES LLP","BUY",{"v":120582,"d":"120,582"},8.09,"BSE"]
["2021-09-29",532701,"CELLA","NEELIMA KARLAPUDI","SELL",{"v":112503,"d":"112,503"},5.07,"BSE"]
["2021-09-29",523100,"COSMOFE","ALPHA LEON ENTERPRISES LLP","BUY",{"v":81002,"d":"81,002"},128.57,"BSE"]
["2021-09-29",523100,"COSMOFE","ALPHA LEON ENTERPRISES LLP","SELL",{"v":127294,"d":"127,294"},130.8,"BSE"]
["2021-09-29",530079,"FAZE3Q","AJAY ANAND","BUY",{"v":250000,"d":"250,000"},288.2,"BSE"]
["2021-09-29",530079,"FAZE3Q","SALIM PYARALI GOVANI","SELL",{"v":734184,"d":"734,184"},288.92,"BSE"]
["2021-09-29",530079,"FAZE3Q","ASHISH RAMESHCHANDRA KACHOLIA","BUY",{"v":450000,"d":"450,000"},288.8,"BSE"]
["2021-09-29",539839,"FRANKLIN","NATURAL INVESTMENT MANAGEMENT PVT LTD","BUY",{"v":96000,"d":"96,000"},7.15,"BSE"]
["2021-09-29",542918,"GIANLIFE","RAJASTHAN GLOBAL SECURITIES PRIVATE LIMITED","BUY",{"v":24000,"d":"24,000"},89.5,"BSE"]
["2021-09-29",542918,"GIANLIFE","PRAVINCHAND BHAYACHANDBHAI PATEL","SELL",{"v":30000,"d":"30,000"},89.5,"BSE"]
["2021-09-29",542918,"GIANLIFE","ALPHA LEON ENTERPRISES LLP","SELL",{"v":30000,"d":"30,000"},93.26,"BSE"]
{"$rows_left_out":81}
{"sheet":"Call Tracker (Equity & F&O)","index":5,"n_rows":387,"n_cols":18,"rows_kept":387,"merged":[[107,0,108,0],[107,1,108,1],[107,12,108,12],[107,13,108,13],[107,14,108,14],[107,15,108,15],[152,0,153,0],[152,1,153,1],[152,9,153,9],[152,12,153,12],[152,13,153,13],[152,14,153,14],[152,15,153,15],[173,0,174,0],[173,1,174,1],[173,9,174,9],[173,12,174,12],[173,13,174,13],[173,14,174,14],[173,15,174,15],[181,0,182,0],[181,1,182,1],[181,9,182,9],[181,12,182,12],[181,13,182,13],[181,14,182,14],[181,15,182,15]]}
[]
[]
[]
[]
[{"$nulls":12},"Back To Main Page"]
["Retail Research Technical Calls & Fundamental Performance Report for the month of Sep-2021"]
[{"$nulls":12},{"$f":"Main!B10","v":"2021-09-30"}]
[null,"Positional  Call"]
["Sr.no","Date",null,"Company","Rec","Rec Price","Stop Loss***","Call Closed At","Target","Remark","Profit / Loss per Share","All charges","Net Gain / Loss  %","Status","Closed Date","Market Closing Price"]
[1,"2021-07-19",null,"IGL","Buy",547.5,510,{"v":568,"d":"568.00"},"620-640","Profit of Rs.20.5/-",{"$f":"H10-F10","v":20.5},{"$f":"(F10*-0.7)/100","v":{"v":-3.8325,"d":"-3.83"}},{"$f":"(K10+L10)/F10","v":{"v":0.030442922374429224,"d":"3.04%"}},"Successful","2021-09-06",null,null,"H"]
[2,"2021-07-20",null,"IOC","Buy",104.5,96.5,{"v":111.5,"d":"111.50"},"120-122","Profit of Rs.7/-",{"$f":"H11-F11","v":7},{"$f":"(F11*-0.7)/100","v":{"v":-0.7314999999999999,"d":"-0.73"}},{"$f":"(K11+L11)/F11","v":{"v":0.05998564593301436,"d":"6.00%"}},"Successful","2021-09-03",null,null,"H"]
[3,"2021-07-30",null,"AMARAJABAT","Buy",715,675,{"v":730,"d":"730.00"},"780-800","Profit of Rs.15/-",{"$f":"H12-F12","v":15},{"v":-5.004999999999999,"d":"-5.01"},{"$f":"(K12+L12)/F12","v":{"v":0.01397902097902098,"d":"1.40%"}},"Successful","2021-09-03",null,null,"H"]
[4,"2021-08-13",null,"MCX","Buy",1500,1415,{"v":1607.5,"d":"1,607.50"},"1650-1680","Profit of Rs.107.5/-",107.5,{"v":-10.5,"d":"-10.50"},{"v":0.06466666666666666,"d":"6.47%"},"Successful","2021-09-03",null,null,"H"]
[5,"2021-09-03",null,"ALKYLAMINE","Buy",4085,3900,{"v":3900,"d":"3,900.00"},"4400-4500","Loss of Rs.185/-",-185,{"v":-28.595,"d":"-28.60"},{"v":-0.05228763769889841,"d":"-5.23%"},"Unsuccessful","2021-09-16",null,null,"H"]
[6,"2021-09-03",null,"JBCHEPHARM","Buy",1670,1570,{"v":1785,"d":"1,785.00"},"1840-1880","Profit of Rs.115/-",{"$f":"H15-F15","v":115},{"$f":"(F15*-0.7)/100","v":-11.69},{"$f":"(K15+L15)/F15","v":{"v":0.0618622754491018,"d":"6.19%"}},"Successful","2021-09-07",null,null,"H"]
[7,"2021-09-08",null,"GLAXO","Buy",1500,1395,{"v":1600,"d":"1,600.00"},"1650-1700","Profit of Rs.100/-",100,{"v":-10.5,"d":"-10.50"},{"v":0.059666666666666666,"d":"5.97%"},"Successful","2021-09-16",null,null,"H"]
[8,"2021-09-13",null,"HDFCAMC","Buy",3205,3000,{"v":3125,"d":"3,125.00"},"3500-3600","Loss of Rs.80/-",{"$f":"H17-F17","v":-80},{"$f":"(F17*-0.7)/100","v":{"v":-22.435,"d":"-22.44"}},{"$f":"(K17+L17)/F17","v":{"v":-0.0319609984399376,"d":"-3.20%"}},"Unsuccessful","2021-09-29",null,null,"N"]
[9,"2021-09-15",null,"AKZOINDIA","Buy","2185-2205",2080,null,"2400-2500","Open",{"$nulls":5},{"$f":"VLOOKUP(D18,'MidCap Intra'!B11:C511,2,0)","v":2258.3},null,"H"]
[10,"2021-09-17",null,"BANKBARODA","Buy",84,78,78.85,"90-92","Loss of Rs.5.15/-",{"$f":"H19-F19","v":-5.150000000000006},{"$f":"(F19*-0.7)/100","v":{"v":-0.588,"d":"-0.59"}},{"$f":"(K19+L19)/F19","v":{"v":-0.06830952380952388,"d":"-6.83%"}},"Unsuccessful","2021-09-16",null,null,"H"]
[11,"2021-09-21",null,"GLAXO","Buy","1500-1520",1395,null,"1680-1720","Open",{"$nulls":5},{"$f":"VLOOKUP(D20,'MidCap Intra'!B13:C513,2,0)","v":1484.25},null,"H"]
{"$rows_left_out":350}