{"text_format":"3","workbook":"xlsx","n_sheets":9,"sheets":["Main","Future Intra","Cash Intra","MidCap Intra","Bulk Deals","Call Tracker (Equity & F&O)","Sheet2","Sheet1","Sheet3"],"not_rendered":{"images":4,"defined_names":4},"read":"whole","date_system":"1900"}

{"sheet":"Main","index":0,"n_rows":17,"n_cols":4,"rows_kept":17}
[null,"                                                                                                 "]
{"$rows_empty":8}
[null,"2019-01-31"]
[]
[null,"Sheet No.","Template Name","Summary"]
[null,1,"Future Intra","For Intraday trading in F&O segment"]
[null,2,"Cash Intra","For Intraday trading in cash market segment"]
[null,3,"Mid-cap Intra","For Intraday trading in Mid-cap stocks"]
[null,4,"Bulk Deals","Reveals Bulk Deals carried on NSE & BSE"]
[null,5,"Call Tracker"]

{"sheet":"Future Intra","index":1,"n_rows":240,"n_cols":15,"rows_kept":240,"merged":[[8,0,9,0],[8,1,9,1],[8,2,9,2],[8,5,8,7],[8,8,8,10]]}
[]
[]
[]
[]
[{"$nulls":12},"Back to Main Page"]
["FOR INTRA DAY TRADING",{"$nulls":10},{"$f":"Main!B10","v":"2019-01-31"}]
[]
[]
["Sr.no","Sector","Scrip","CLOSE RATE","Pivot Point","Supports",null,null,"Resistances"]
[null,"Sector",null,"Point","Point","S1","S2","S3","R1","R2","R3","HIGH","LOW","OI","% Change in OI"]
[1,"Index","BANKNIFTY",{"v":26820.9,"d":"26820.90"},{"v":26808.3,"d":"26808.30"},{"v":26699.1,"d":"26699.10"},{"v":26577.3,"d":"26577.30"},{"v":26468.1,"d":"26468.10"},{"v":26930.1,"d":"26930.10"},{"v":27039.300000000003,"d":"27039.30"},{"v":27161.1,"d":"27161.10"},26917.5,26686.5,1821300,{"v":-0.031717846206192585,"d":"-3.17%"}]
[2,"Index","NIFTY",{"v":10642.9,"d":"10642.90"},{"v":10654.300000000001,"d":"10654.30"},{"v":10594.600000000002,"d":"10594.60"},{"v":10546.300000000001,"d":"10546.30"},{"v":10486.600000000002,"d":"10486.60"},{"v":10702.600000000002,"d":"10702.60"},{"v":10762.300000000003,"d":"10762.30"},{"v":10810.600000000002,"d":"10810.60"},10714,10606,29753250,{"v":0.019639189963733938,"d":"1.96%"}]
[3,"Index","NIFTYIT",{"v":15239,"d":"15239.00"},{"v":15253.333333333334,"d":"15253.33"},{"v":15137.666666666668,"d":"15137.67"},{"v":15036.333333333334,"d":"15036.33"},{"v":14920.666666666668,"d":"14920.67"},{"v":15354.666666666668,"d":"15354.67"},{"v":15470.333333333336,"d":"15470.33"},{"v":15571.666666666668,"d":"15571.67"},15369,15152,22350,{"v":-0.08401639344262295,"d":"-8.40%"}]
[4,"Cement","ACC",{"v":1387.1,"d":"1387.10"},{"v":1373.5166666666667,"d":"1373.52"},{"v":1353.6333333333332,"d":"1353.63"},{"v":1320.1666666666665,"d":"1320.17"},{"v":1300.283333333333,"d":"1300.28"},{"v":1406.9833333333333,"d":"1406.98"},{"v":1426.866666666667,"d":"1426.87"},{"v":1460.3333333333335,"d":"1460.33"},1393.4,1340.05,1619200,{"v":-0.0707070707070707,"d":"-7.07%"}]
[5,"Others","ADANIENT",{"v":140.5,"d":"140.50"},139.65,{"v":137.45000000000002,"d":"137.45"},{"v":134.4,"d":"134.40"},{"v":132.20000000000002,"d":"132.20"},{"v":142.70000000000002,"d":"142.70"},{"v":144.9,"d":"144.90"},{"v":147.95000000000002,"d":"147.95"},141.85,136.6,42292000,{"v":-0.0516638263521392,"d":"-5.17%"}]
[6,"Others","ADANIPORTS",338.35,{"v":340.34999999999997,"d":"340.35"},{"v":333.69999999999993,"d":"333.70"},{"v":329.04999999999995,"d":"329.05"},{"v":322.3999999999999,"d":"322.40"},{"v":344.99999999999994,"d":"345.00"},{"v":351.6499999999999,"d":"351.65"},{"v":356.29999999999995,"d":"356.30"},347,335.7,25897500,{"v":0.04267740312028183,"d":"4.27%"}]
[7,"Power","ADANIPOWER",44.45,{"v":44.31666666666666,"d":"44.32"},{"v":43.23333333333333,"d":"43.23"},{"v":42.016666666666666,"d":"42.02"},{"v":40.93333333333333,"d":"40.93"},{"v":45.533333333333324,"d":"45.53"},{"v":46.61666666666667,"d":"46.62"},{"v":47.83333333333332,"d":"47.83"},45.4,43.1,168720000,{"v":-0.05848214285714286,"d":"-5.85%"}]
[8,"Pharma","AJANTPHARM",{"v":1083.2,"d":"1083.20"},1083.05,1063.25,{"v":1043.3,"d":"1043.30"},{"v":1023.5,"d":"1023.50"},{"v":1103,"d":"1103.00"},{"v":1122.7999999999997,"d":"1122.80"},1142.75,1102.85,1063.1,678500,{"v":-0.05038488453463961,"d":"-5.04%"}]
[9,"Banking","ALBK",44.65,{"v":44.4,"d":"44.40"},43.65,42.65,{"v":41.9,"d":"41.90"},{"v":45.4,"d":"45.40"},46.15,47.15,45.15,43.4,17407000,{"v":-0.11147976111479761,"d":"-11.15%"}]
[10,"Automobile","AMARAJABAT",752.15,{"v":754.6666666666666,"d":"754.67"},{"v":744.5833333333333,"d":"744.58"},{"v":737.0166666666667,"d":"737.02"},{"v":726.9333333333333,"d":"726.93"},{"v":762.2333333333332,"d":"762.23"},{"v":772.3166666666665,"d":"772.32"},{"v":779.8833333333332,"d":"779.88"},764.75,747.1,1251600,{"v":0.007323943661971831,"d":"0.73%"}]
{"$rows_left_out":211}
{"sheet":"Cash Intra","index":2,"n_rows":247,"n_cols":13,"rows_kept":247,"merged":[[7,0,8,0],[7,1,8,1],[7,2,8,2],[7,3,8,3],[7,4,7,6],[7,7,7,9]]}
[]
[]
[]
[]
[{"$nulls":12},"Back to Main Page"]
["FOR INTRA DAY TRADING",{"$nulls":9},{"$f":"Main!B10","v":"2019-01-31"}]
[]
["Sr.no","Scrip","CLOSE RATE","Pivot Point","Supports",null,null,"Resistances"]
[null,null,"Point",null,"S1","S2","S3","R1","R2","R3","HIGH","LOW","Total Trade Quanity in Lakhs"]
[1,"Nifty 50",10651.8,{"v":10658.283333333333,"d":"10658.28"},{"v":10606.366666666665,"d":"10606.37"},{"v":10560.933333333332,"d":"10560.93"},{"v":10509.016666666665,"d":"10509.02"},{"v":10703.716666666665,"d":"10703.72"},{"v":10755.633333333333,"d":"10755.63"},{"v":10801.066666666666,"d":"10801.07"},10710.2,10612.85]
[2,"Nifty Bank",26825.5,{"v":26811.816666666666,"d":"26811.82"},{"v":26707.38333333333,"d":"26707.38"},{"v":26589.266666666666,"d":"26589.27"},{"v":26484.833333333332,"d":"26484.83"},{"v":26929.93333333333,"d":"26929.93"},{"v":27034.366666666665,"d":"27034.37"},{"v":27152.48333333333,"d":"27152.48"},26916.25,26693.7]
[3,"Nifty CPSE",1963.9,{"v":1964.9000000000003,"d":"1964.90"},{"v":1955.1000000000006,"d":"1955.10"},{"v":1946.3000000000002,"d":"1946.30"},{"v":1936.5000000000005,"d":"1936.50"},{"v":1973.7000000000007,"d":"1973.70"},{"v":1983.5000000000005,"d":"1983.50"},{"v":1992.3000000000009,"d":"1992.30"},1974.7,1956.1]
[4,"Nifty Infra",2949.2,{"v":2952.8333333333335,"d":"2952.83"},{"v":2937.716666666667,"d":"2937.72"},{"v":2926.2333333333336,"d":"2926.23"},{"v":2911.1166666666672,"d":"2911.12"},{"v":2964.316666666667,"d":"2964.32"},{"v":2979.433333333333,"d":"2979.43"},{"v":2990.916666666667,"d":"2990.92"},2967.95,2941.35]
[5,"Nifty IT",15255.2,15276.35,15171.25,{"v":15087.3,"d":"15087.30"},{"v":14982.199999999999,"d":"14982.20"},{"v":15360.300000000001,"d":"15360.30"},{"v":15465.400000000003,"d":"15465.40"},{"v":15549.350000000002,"d":"15549.35"},15381.45,15192.4]
[6,"Nifty PSE",3178.85,{"v":3176.2166666666667,"d":"3176.22"},{"v":3164.3333333333335,"d":"3164.33"},{"v":3149.8166666666666,"d":"3149.82"},{"v":3137.9333333333334,"d":"3137.93"},{"v":3190.7333333333336,"d":"3190.73"},{"v":3202.616666666667,"d":"3202.62"},{"v":3217.1333333333337,"d":"3217.13"},3188.1,3161.7]
[7,"Nifty Midcap 50",4661.4,{"v":4651.966666666666,"d":"4651.97"},{"v":4631.4333333333325,"d":"4631.43"},{"v":4601.466666666666,"d":"4601.47"},{"v":4580.9333333333325,"d":"4580.93"},{"v":4681.9333333333325,"d":"4681.93"},{"v":4702.466666666667,"d":"4702.47"},{"v":4732.4333333333325,"d":"4732.43"},4672.5,4622]
[8,"ABB",1264.65,1265.45,{"v":1242.2,"d":"1242.20"},1219.75,{"v":1196.5,"d":"1196.50"},{"v":1287.9,"d":"1287.90"},1311.15,{"v":1333.6000000000001,"d":"1333.60"},1288.7,1243,0.74899]
[9,"ACC",1386.6,{"v":1373.6666666666667,"d":"1373.67"},{"v":1352.3333333333335,"d":"1352.33"},{"v":1318.0666666666668,"d":"1318.07"},{"v":1296.7333333333336,"d":"1296.73"},{"v":1407.9333333333334,"d":"1407.93"},{"v":1429.2666666666669,"d":"1429.27"},{"v":1463.5333333333333,"d":"1463.53"},1395,1339.4,5.72247]
[10,"AIAENG",1625.05,{"v":1623.3666666666668,"d":"1623.37"},{"v":1601.7333333333336,"d":"1601.73"},{"v":1578.4166666666667,"d":"1578.42"},{"v":1556.7833333333335,"d":"1556.78"},{"v":1646.6833333333336,"d":"1646.68"},{"v":1668.3166666666668,"d":"1668.32"},{"v":1691.6333333333337,"d":"1691.63"},1645,1600.05,0.19738]
[11,"AUBANK",586.8,{"v":587.7333333333332,"d":"587.73"},{"v":580.6666666666665,"d":"580.67"},{"v":574.5333333333333,"d":"574.53"},{"v":567.4666666666666,"d":"567.47"},{"v":593.8666666666664,"d":"593.87"},{"v":600.9333333333333,"d":"600.93"},{"v":607.0666666666664,"d":"607.07"},594.8,581.6,2.4835]
{"$rows_left_out":228}
{"sheet":"MidCap Intra","index":3,"n_rows":510,"n_cols":13,"rows_kept":510,"merged":[[0,0,0,1],[8,0,9,0],[8,1,9,1],[8,2,9,2],[8,3,9,3],[8,4,8,6],[8,7,8,9]]}
[]
[]
[]
[]
[{"$nulls":11},"Back To Main Page"]
["FOR INTRA DAY TRADING",{"$nulls":9},{"$f":"Main!B10","v":"2019-01-31"}]
[null,null," "]
[]
["Sr.no","Scrip","CLOSE RATE","Pivot Point","Supports",null,null,"Resistances"]
[null,null,"Point",null,"S1","S2","S3","R1","R2","R3","HIGH","LOW","Total Trade Quanity in Lakhs"]
[1,"3MINDIA",20146.45,{"v":20159.483333333334,"d":"20159.48"},{"v":20019.016666666666,"d":"20019.02"},{"v":19891.583333333332,"d":"19891.58"},{"v":19751.116666666665,"d":"19751.12"},{"v":20286.916666666668,"d":"20286.92"},{"v":20427.383333333335,"d":"20427.38"},{"v":20554.81666666667,"d":"20554.82"},20299.95,20032.05,0.02197]
[2,"8KMILES",120,{"v":118.68333333333334,"d":"118.68"},{"v":117.36666666666667,"d":"117.37"},{"v":114.73333333333333,"d":"114.73"},{"v":113.41666666666667,"d":"113.42"},{"v":121.31666666666668,"d":"121.32"},{"v":122.63333333333334,"d":"122.63"},{"v":125.26666666666668,"d":"125.27"},120,116.05,0.78243]
[3,"AARTIIND",1600.6,{"v":1589.8666666666668,"d":"1589.87"},{"v":1570.7333333333336,"d":"1570.73"},{"v":1540.8666666666668,"d":"1540.87"},{"v":1521.7333333333336,"d":"1521.73"},{"v":1619.7333333333336,"d":"1619.73"},{"v":1638.8666666666668,"d":"1638.87"},{"v":1668.7333333333336,"d":"1668.73"},1609,1560,1.91966]
[4,"ABAN",66.25,{"v":65.91666666666667,"d":"65.92"},{"v":65.13333333333334,"d":"65.13"},{"v":64.01666666666667,"d":"64.02"},{"v":63.233333333333334,"d":"63.23"},{"v":67.03333333333335,"d":"67.03"},{"v":67.81666666666668,"d":"67.82"},{"v":68.93333333333335,"d":"68.93"},66.7,64.8,3.53788]
[5,"ABB",1264.65,1265.45,{"v":1242.2,"d":"1242.20"},1219.75,{"v":1196.5,"d":"1196.50"},{"v":1287.9,"d":"1287.90"},1311.15,{"v":1333.6000000000001,"d":"1333.60"},1288.7,1243,0.74899]
[6,"ABCAPITAL",82.3,{"v":82.73333333333333,"d":"82.73"},{"v":81.56666666666666,"d":"81.57"},{"v":80.83333333333333,"d":"80.83"},{"v":79.66666666666666,"d":"79.67"},{"v":83.46666666666667,"d":"83.47"},{"v":84.63333333333333,"d":"84.63"},{"v":85.36666666666667,"d":"85.37"},83.9,82,14.351]
[7,"ABFRL",208.5,{"v":207.66666666666666,"d":"207.67"},{"v":204.0333333333333,"d":"204.03"},{"v":199.56666666666663,"d":"199.57"},{"v":195.93333333333328,"d":"195.93"},{"v":212.13333333333333,"d":"212.13"},{"v":215.7666666666667,"d":"215.77"},{"v":220.23333333333335,"d":"220.23"},211.3,203.2,8.59652]
[8,"ACC",1386.6,{"v":1373.6666666666667,"d":"1373.67"},{"v":1352.3333333333335,"d":"1352.33"},{"v":1318.0666666666668,"d":"1318.07"},{"v":1296.7333333333336,"d":"1296.73"},{"v":1407.9333333333334,"d":"1407.93"},{"v":1429.2666666666669,"d":"1429.27"},{"v":1463.5333333333333,"d":"1463.53"},1395,1339.4,5.72247]
[9,"ADANIPORTS",338.15,{"v":340.93333333333334,"d":"340.93"},{"v":332.81666666666666,"d":"332.82"},{"v":327.48333333333335,"d":"327.48"},{"v":319.3666666666667,"d":"319.37"},{"v":346.26666666666665,"d":"346.27"},{"v":354.3833333333333,"d":"354.38"},{"v":359.71666666666664,"d":"359.72"},349.05,335.6,76.72859]
[10,"ADANIPOWER",44.5,{"v":44.18333333333334,"d":"44.18"},{"v":43.116666666666674,"d":"43.12"},{"v":41.733333333333334,"d":"41.73"},{"v":40.66666666666667,"d":"40.67"},{"v":45.56666666666668,"d":"45.57"},{"v":46.63333333333334,"d":"46.63"},{"v":48.01666666666668,"d":"48.02"},45.25,42.8,163.23067]
{"$rows_left_out":491}
{"sheet":"Bulk Deals","index":4,"n_rows":64,"n_cols":8,"rows_kept":64,"merged":[[4,0,4,1],[4,2,4,3],[6,1,6,2]]}
[" "]
[]
[]
[]
[]
[{"$nulls":4},"Back To Main Page"]
["Subject :","BULK DEAL",null,{"$f":"Main!B10","v":"2019-01-31"}]
[]
["Date","Scrip code","Scrip Name","Client Name","Buy / Sell","Quantity Traded","Trade Price / Wt.Avg.trade price","Exchange  "]
["2019-01-30",539122,"BODHTREE","VANDANA DAGA","BUY",{"v":203400,"d":"203,400"},42.5,"BSE"]
["2019-01-30",530067,"CSLFINANCE","AJAY RELAN","BUY",{"v":33000,"d":"33,000"},318.91,"BSE"]
["2019-01-30",530067,"CSLFINANCE","RADHIKA SHARMA","SELL",{"v":33000,"d":"33,000"},318.91,"BSE"]
["2019-01-30",539009,"GBLIL","BUDDHADEB LAHA","SELL",{"v":61360,"d":"61,360"},98.55,"BSE"]
["2019-01-30",539009,"GBLIL","HIGHGROWTH VINCOM PRIVATE LIMITED","SELL",{"v":44900,"d":"44,900"},98.65,"BSE"]
["2019-01-30",539009,"GBLIL","SUNIL LAXMINARAYAN JHA","BUY",{"v":46030,"d":"46,030"},99.54,"BSE"]
["2019-01-30",539009,"GBLIL","RAKHIBEN PARESHBHAI PATEL","BUY",{"v":52807,"d":"52,807"},99.65,"BSE"]
["2019-01-30",539009,"GBLIL","SUNIL LAXMINARAYAN JHA","SELL",{"v":20242,"d":"20,242"},98.6,"BSE"]
["2019-01-30",539009,"GBLIL","RAKHIBEN PARESHBHAI PATEL","SELL",{"v":24000,"d":"24,000"},98.59,"BSE"]
["2019-01-30",539009,"GBLIL","GLORIOUS VINCOM PRIVATE LIMITED","BUY",{"v":140569,"d":"140,569"},99.77,"BSE"]
["2019-01-30",539009,"GBLIL","GLORIOUS VINCOM PRIVATE LIMITED","SELL",{"v":145135,"d":"145,135"},98.91,"BSE"]
{"$rows_left_out":45}
{"sheet":"Call Tracker (Equity & F&O)","index":5,"n_rows":453,"n_cols":18,"rows_kept":453,"merged":[[30,0,31,0],[30,1,31,1],[30,2,31,2],[30,9,31,9],[30,11,31,11],[30,12,31,12],[30,13,31,13],[30,14,31,14],[32,0,33,0],[32,1,33,1],[32,2,33,2],[32,9,33,9],[32,11,33,11],[32,12,33,12],[32,13,33,13],[32,14,33,14]]}
[]
[]
[]
[]
[{"$nulls":12},"Back To Main Page"]
["Retail Research Technical Calls & Fundamental Performance Report for the month of January -2019 "]
[{"$nulls":12},{"$f":"Main!B10","v":"2019-01-31"}]
[null,"Positional  Call"]
["Sr.no","Date",null,"Company","Rec","Rec Price","Stop Loss***","Call Closed At","Target","Remark","Profit / Loss per Share","Gain / Loss  %","Status","Closed Date","NSE Closed Price"]
[1,"2018-12-21",null,"TATAGLOBAL","Buy{}",217,209,217,"235-240","Neutral",{"$f":"H10-F10","v":0},{"$f":"K10/F10","v":{"v":0,"d":"0.00%"}},"Neutral","2019-01-25",{"$nulls":3},"H"]
[2,"2018-12-24",null,"JSWSTEEL","Buy",299.5,289,285.5,"320-325","Loss of Rs.14/-",-14,{"v":-0.04674457429048414,"d":"-4.67%"},"Unsuccessful","2019-01-03",{"$nulls":3},"H"]
[3,"2018-12-24",null,"TATAPOWER","Buy",77.3,73.7,73.5,"83-84","Loss of Rs.3.8/-",{"$f":"H12-F12","v":-3.799999999999997},{"$f":"K12/F12","v":{"v":-0.04915912031047862,"d":"-4.92%"}},"Unsuccessful","2019-01-28",{"$nulls":3},"R"]
[4,"2018-12-27",null,"TVSMOTOR","Buy",552.5,519,571.75,"600-620","Profit of Rs.19.25/-",{"$f":"H13-F13","v":19.25},{"$f":"K13/F13","v":{"v":0.03484162895927602,"d":"3.48%"}},"Successful","2019-01-02",{"$nulls":3},"H"]
[5,"2019-01-01",null,"ASHOKLEY","Buy",101,96,94.5,"110-112","Loss of Rs.6.5/-",-6.5,{"v":-0.06435643564356436,"d":"-6.44%"},"Unsuccessful","2019-01-07",{"$nulls":3},"R"]
[6,"2019-01-03",null,"PEL","Buy",2345,2222.2,2210,"2565-2585","Loss of Rs.135/-",{"$f":"H15-F15","v":-135},{"$f":"K15/F15","v":{"v":-0.057569296375266525,"d":"-5.76%"}},"Unsuccessful","2019-01-28",{"$nulls":3},"R"]
[7,"2019-01-04",null,"M&M","Buy",719,688,688,"770-780","Loss of Rs.31/-",{"$f":"H16-F16","v":-31},{"$f":"K16/F16","v":{"v":-0.043115438108484005,"d":"-4.31%"}},"Unsuccessful","2019-01-25",{"$nulls":3},"H"]
[8,"2019-01-16",null,"BHARTIARTL","Sell",339,356.6,324.75,"310-305","Profit of Rs.14.25/-",{"$f":"F17-H17","v":14.25},{"$f":"K17/F17","v":{"v":0.0420353982300885,"d":"4.20%"}},"Successful","2019-01-18",{"$nulls":3},"R"]
[9,"2019-01-18",null,"TORNTPHARM","Sell",1905,1990,1847.5,"1780-1740","Profit of Rs.57.50/-",{"$f":"F18-H18","v":57.5},{"$f":"K18/F18","v":{"v":0.030183727034120734,"d":"3.02%"}},"Successful","2019-01-28",{"$nulls":3},"H"]
[10,"2019-01-24",null,"ITC","Buy","279-281",268,null,305,"Open",{"$nulls":4},{"$f":"VLOOKUP(D19,Sheet2!A10:M1505,6,0)","v":275.5},null,null,"R"]
[11,"2019-01-25",null,"UBL","Sell",1435,1510,1392.5,"1300-1280","Part Profit of Rs.42.50/-",{"$f":"F20-H20","v":42.5},{"$f":"K20/F20","v":{"v":0.029616724738675958,"d":"2.96%"}},"Successful","2019-01-28",{"$nulls":3},"H"]
{"$rows_left_out":301}
{"sheet":"Sheet2","index":6,"n_rows":1628,"n_cols":14,"rows_kept":1628,"hidden":true}
["SYMBOL","SERIES","OPEN","HIGH","LOW","CLOSE","LAST","PREVCLOSE","TOTTRDQTY","TOTTRDVAL","TIMESTAMP","TOTALTRADES","ISIN","ISIN"]
["20MICRONS","EQ",37.95,39.2,37.45,38,38,37.8,15054,574126.25,"2019-01-30",271,"INE144J01027"]
["21STCENMGM","EQ",21.95,21.95,21.95,21.95,21.95,22.35,101,2216.95,"2019-01-30",3,"INE253B01015"]
["3IINFOTECH","EQ",3.3,3.45,3.3,3.3,3.35,3.3,2502318,8398940.65,"2019-01-30",680,"INE748C01020"]
["3MINDIA","EQ",20052.3,20299.95,20032.05,20146.45,20170,20082.75,2197,44228742.05,"2019-01-30",277,"INE470A01017"]
["3PLAND","EQ",11.4,11.4,10,10.5,10.5,10.75,2508,26387.3,"2019-01-30",14,"INE105C01023"]
["5PAISA","EQ",241.35,247,241.35,244.1,246.9,241.35,2264,553095.6,"2019-01-30",175,"INE618L01018"]
["63MOONS","EQ",81.65,96.9,81.5,91.75,91.55,82.1,1361538,123570199.25,"2019-01-30",15997,"INE111B01023"]
["8KMILES","EQ",120,120,116.05,120,120,114.3,78243,9377781.85,"2019-01-30",598,"INE650K01021"]
["A2ZINFRA","EQ",9.5,9.9,9.5,9.9,9.9,9.45,152132,1477163.75,"2019-01-30",387,"INE619I01012"]
["AARTIDRUGS","EQ",582,608,571.5,591.25,590.3,585.35,19396,11276050.15,"2019-01-30",1235,"INE767A01016"]
["AARTIIND","EQ",1560,1609,1560,1600.6,1608,1550,191966,305515913.35,"2019-01-30",15455,"INE769A01020"]
["AARVEEDEN","EQ",23.5,24,23.1,23.5,23.5,23.45,6133,143343.15,"2019-01-30",183,"INE273D01019"]
["AAVAS","EQ",828.05,837.7,828,830.75,831.7,828.65,80331,66705721.15,"2019-01-30",417,"INE216P01012"]
["ABAN","EQ",65.7,66.7,64.8,66.25,66.45,65.55,353788,23276493.65,"2019-01-30",4405,"INE421A01028"]
["ABB","EQ",1260.2,1288.7,1243,1264.65,1262,1258.9,74899,94706027.4,"2019-01-30",3803,"INE117A01022"]
["ABBOTINDIA","EQ",8079.95,8080.9,8010.3,8042.25,8074.95,8048,2067,16623311.45,"2019-01-30",632,"INE358A01014"]
["ABCAPITAL","EQ",82.8,83.9,82,82.3,82.05,82.7,1435100,118941162.2,"2019-01-30",14580,"INE674K01013"]
["ABFRL","EQ",203.2,211.3,203.2,208.5,208.9,203,859652,179070953.95,"2019-01-30",16311,"INE647O01011"]
["ABMINTLTD","EQ",15.65,15.65,15.65,15.65,15.65,16.45,1,15.65,"2019-01-30",1,"INE251C01017"]
{"$rows_left_out":1609}
{"sheet":"Sheet1","index":7,"n_rows":0,"n_cols":0,"rows_kept":0,"hidden":true}

{"sheet":"Sheet3","index":8,"n_rows":0,"n_cols":0,"rows_kept":0,"hidden":true}