{"text_format":"3","workbook":"xlsx","n_sheets":10,"sheets":["Main","Future Intra","Cash Intra","MidCap Intra","Bulk Deals","Call Tracker (Equity & F&O)","Call Tracker (Currency)","Sheet2","Sheet1","Sheet3"],"not_rendered":{"images":4,"defined_names":4},"read":"whole","date_system":"1900"}

{"sheet":"Main","index":0,"n_rows":17,"n_cols":4,"rows_kept":17}
[null,"                                                                                                 "]
{"$rows_empty":8}
[null,"2018-05-30"]
[]
[null,"Sheet No.","Template Name","Summary"]
[null,1,"Future Intra","For Intraday trading in F&O segment"]
[null,2,"Cash Intra","For Intraday trading in cash market segment"]
[null,3,"Mid-cap Intra","For Intraday trading in Mid-cap stocks"]
[null,4,"Bulk Deals","Reveals Bulk Deals carried on NSE & BSE"]
[null,5,"Call Tracker"]

{"sheet":"Future Intra","index":1,"n_rows":250,"n_cols":15,"rows_kept":250,"merged":[[8,0,9,0],[8,1,9,1],[8,2,9,2],[8,5,8,7],[8,8,8,10]]}
[]
[]
[]
[]
[{"$nulls":12},"Back to Main Page"]
["FOR INTRA DAY TRADING",{"$nulls":10},{"$f":"Main!B10","v":"2018-05-30"}]
[]
[]
["Sr.no","Sector","Scrip","CLOSE RATE","Pivot Point","Supports",null,null,"Resistances"]
[null,"Sector",null,"Point","Point","S1","S2","S3","R1","R2","R3","HIGH","LOW","OI","% Change in OI"]
[1,"Index","BANKNIFTY",26183.75,{"v":26279.11666666667,"d":"26279.12"},{"v":26048.433333333338,"d":"26048.43"},{"v":25913.11666666667,"d":"25913.12"},{"v":25682.433333333338,"d":"25682.43"},{"v":26414.433333333338,"d":"26414.43"},{"v":26645.116666666672,"d":"26645.12"},{"v":26780.433333333338,"d":"26780.43"},26509.8,26143.8,2851160,{"v":-0.0886669905643491,"d":"-8.87%"}]
[2,"Index","NIFTY",10615.55,{"v":10638.533333333333,"d":"10638.53"},{"v":10573.066666666666,"d":"10573.07"},{"v":10530.583333333332,"d":"10530.58"},{"v":10465.116666666665,"d":"10465.12"},{"v":10681.016666666666,"d":"10681.02"},{"v":10746.483333333334,"d":"10746.48"},{"v":10788.966666666667,"d":"10788.97"},10704,10596.05,27057000,{"v":0.07224804726974428,"d":"7.22%"}]
[3,"Index","NIFTYCPSE",{"v":2627.4,"d":"2627.40"},{"v":875.8000000000001,"d":"875.80"},{"v":1751.6000000000001,"d":"1751.60"},{"v":875.8000000000001,"d":"875.80"},{"v":1751.6000000000001,"d":"1751.60"},{"v":1751.6000000000001,"d":"1751.60"},{"v":875.8000000000001,"d":"875.80"},{"v":1751.6000000000001,"d":"1751.60"},0,0,0,{"v":0,"d":"0.00%"}]
[4,"Index","NIFTYINFRA",{"v":3441.1,"d":"3441.10"},{"v":1147.0333333333333,"d":"1147.03"},{"v":2294.0666666666666,"d":"2294.07"},{"v":1147.0333333333333,"d":"1147.03"},{"v":2294.0666666666666,"d":"2294.07"},{"v":2294.0666666666666,"d":"2294.07"},{"v":1147.0333333333333,"d":"1147.03"},{"v":2294.0666666666666,"d":"2294.07"},0,0,0,{"v":0,"d":"0.00%"}]
[5,"Index","NIFTYIT",{"v":13533,"d":"13533.00"},{"v":13528,"d":"13528.00"},{"v":13461,"d":"13461.00"},{"v":13389,"d":"13389.00"},{"v":13322,"d":"13322.00"},{"v":13600,"d":"13600.00"},{"v":13667,"d":"13667.00"},{"v":13739,"d":"13739.00"},13595,13456,53800,{"v":-0.006463527239150508,"d":"-0.65%"}]
[6,"Index","NIFTYMID50",5060.25,{"v":5061.766666666666,"d":"5061.77"},{"v":5023.533333333333,"d":"5023.53"},{"v":4986.816666666667,"d":"4986.82"},{"v":4948.583333333333,"d":"4948.58"},{"v":5098.483333333333,"d":"5098.48"},{"v":5136.716666666666,"d":"5136.72"},{"v":5173.4333333333325,"d":"5173.43"},5100,5025.05,591600,{"v":-3.3795201081446432E-4,"d":"-0.03%"}]
[7,"Index","NIFTYPSE",4077.45,{"v":1359.1499999999999,"d":"1359.15"},{"v":2718.2999999999997,"d":"2718.30"},{"v":1359.1499999999999,"d":"1359.15"},{"v":2718.2999999999997,"d":"2718.30"},{"v":2718.2999999999997,"d":"2718.30"},{"v":1359.1499999999999,"d":"1359.15"},{"v":2718.2999999999997,"d":"2718.30"},0,0,0,{"v":0,"d":"0.00%"}]
[8,"Cement","ACC",1310.05,{"v":1316.1166666666668,"d":"1316.12"},{"v":1296.2333333333336,"d":"1296.23"},{"v":1282.4166666666667,"d":"1282.42"},{"v":1262.5333333333335,"d":"1262.53"},{"v":1329.9333333333336,"d":"1329.93"},{"v":1349.8166666666668,"d":"1349.82"},{"v":1363.6333333333337,"d":"1363.63"},1336,1302.3,3965200,{"v":0.12878615349578684,"d":"12.88%"}]
[9,"Others","ADANIENT",123.55,{"v":125.18333333333334,"d":"125.18"},{"v":121.06666666666666,"d":"121.07"},{"v":118.58333333333333,"d":"118.58"},{"v":114.46666666666665,"d":"114.47"},{"v":127.66666666666667,"d":"127.67"},{"v":131.78333333333336,"d":"131.78"},{"v":134.26666666666668,"d":"134.27"},129.3,122.7,12736000,{"v":0.06417112299465241,"d":"6.42%"}]
[10,"Others","ADANIPORTS",{"v":376.7,"d":"376.70"},{"v":377.90000000000003,"d":"377.90"},{"v":372.80000000000007,"d":"372.80"},{"v":368.90000000000003,"d":"368.90"},{"v":363.80000000000007,"d":"363.80"},{"v":381.80000000000007,"d":"381.80"},{"v":386.9000000000001,"d":"386.90"},{"v":390.80000000000007,"d":"390.80"},383,374,18930000,{"v":0.04154057771664374,"d":"4.15%"}]
{"$rows_left_out":224}
{"sheet":"Cash Intra","index":2,"n_rows":248,"n_cols":13,"rows_kept":248,"merged":[[7,0,8,0],[7,1,8,1],[7,2,8,2],[7,3,8,3],[7,4,7,6],[7,7,7,9]]}
[]
[]
[]
[]
[{"$nulls":12},"Back to Main Page"]
["FOR INTRA DAY TRADING",{"$nulls":9},{"$f":"Main!B10","v":"2018-05-30"}]
[]
["Sr.no","Scrip","CLOSE RATE","Pivot Point","Supports",null,null,"Resistances"]
[null,null,"Point",null,"S1","S2","S3","R1","R2","R3","HIGH","LOW","Total Trade Quanity in Lakhs"]
[1,"Nifty 50",10633.3,{"v":10655.550000000001,"d":"10655.55"},{"v":10593.850000000002,"d":"10593.85"},{"v":10554.400000000001,"d":"10554.40"},{"v":10492.700000000003,"d":"10492.70"},{"v":10695.000000000002,"d":"10695.00"},{"v":10756.700000000003,"d":"10756.70"},{"v":10796.150000000001,"d":"10796.15"},10717.25,10616.1]
[2,"Nifty Bank",26254.8,26348.95,26126.95,{"v":25999.1,"d":"25999.10"},{"v":25777.1,"d":"25777.10"},{"v":26476.800000000003,"d":"26476.80"},{"v":26698.800000000003,"d":"26698.80"},{"v":26826.650000000005,"d":"26826.65"},26570.95,26221.1]
[3,"Nifty CPSE",2398.55,{"v":2396.9500000000003,"d":"2396.95"},{"v":2383.6000000000004,"d":"2383.60"},2368.65,{"v":2355.3,"d":"2355.30"},{"v":2411.9000000000005,"d":"2411.90"},2425.25,{"v":2440.2000000000007,"d":"2440.20"},2410.3,2382]
[4,"Nifty Infra",3351.55,{"v":3365.9666666666667,"d":"3365.97"},{"v":3331.6833333333334,"d":"3331.68"},{"v":3311.8166666666666,"d":"3311.82"},{"v":3277.5333333333333,"d":"3277.53"},{"v":3385.8333333333335,"d":"3385.83"},{"v":3420.1166666666672,"d":"3420.12"},{"v":3439.9833333333336,"d":"3439.98"},3400.25,3346.1]
[5,"Nifty IT",13561.05,{"v":13558.133333333331,"d":"13558.13"},{"v":13484.966666666664,"d":"13484.97"},{"v":13408.883333333331,"d":"13408.88"},{"v":13335.716666666664,"d":"13335.72"},{"v":13634.216666666664,"d":"13634.22"},{"v":13707.383333333331,"d":"13707.38"},{"v":13783.466666666664,"d":"13783.47"},13631.3,13482.05]
[6,"Nifty PSE",3828.95,{"v":3830.966666666667,"d":"3830.97"},{"v":3812.533333333334,"d":"3812.53"},{"v":3796.1166666666672,"d":"3796.12"},{"v":3777.6833333333343,"d":"3777.68"},{"v":3847.383333333334,"d":"3847.38"},{"v":3865.8166666666666,"d":"3865.82"},{"v":3882.233333333334,"d":"3882.23"},3849.4,3814.55]
[7,"Nifty Midcap 50",5047.35,5056.95,{"v":5012,"d":"5012.00"},{"v":4976.650000000001,"d":"4976.65"},{"v":4931.700000000001,"d":"4931.70"},{"v":5092.299999999999,"d":"5092.30"},{"v":5137.249999999998,"d":"5137.25"},{"v":5172.5999999999985,"d":"5172.60"},5101.9,5021.6]
[8,"ABB",1225.9,{"v":1216.6333333333334,"d":"1216.63"},{"v":1202.1166666666668,"d":"1202.12"},{"v":1178.3333333333333,"d":"1178.33"},{"v":1163.8166666666666,"d":"1163.82"},{"v":1240.416666666667,"d":"1240.42"},{"v":1254.9333333333338,"d":"1254.93"},{"v":1278.7166666666672,"d":"1278.72"},1231.15,1192.85,0.39185]
[9,"ACC",1310,{"v":1316.3,"d":"1316.30"},{"v":1294.8999999999999,"d":"1294.90"},{"v":1279.8,"d":"1279.80"},{"v":1258.3999999999999,"d":"1258.40"},{"v":1331.3999999999999,"d":"1331.40"},{"v":1352.8,"d":"1352.80"},{"v":1367.8999999999999,"d":"1367.90"},1337.7,1301.2,8.94054]
[10,"AIAENG",1583.45,{"v":1595.8,"d":"1595.80"},{"v":1565.6499999999999,"d":"1565.65"},1547.85,{"v":1517.6999999999998,"d":"1517.70"},{"v":1613.6,"d":"1613.60"},1643.75,1661.55,1625.95,1578,0.82619]
[11,"AUBANK",683.35,{"v":683.9166666666666,"d":"683.92"},{"v":677.8333333333333,"d":"677.83"},{"v":672.3166666666666,"d":"672.32"},{"v":666.2333333333332,"d":"666.23"},{"v":689.4333333333333,"d":"689.43"},{"v":695.5166666666665,"d":"695.52"},{"v":701.0333333333333,"d":"701.03"},690,678.4,1.03637]
{"$rows_left_out":229}
{"sheet":"MidCap Intra","index":3,"n_rows":511,"n_cols":13,"rows_kept":511,"merged":[[0,0,0,1],[8,0,9,0],[8,1,9,1],[8,2,9,2],[8,3,9,3],[8,4,8,6],[8,7,8,9]]}
[]
[]
[]
[]
[{"$nulls":11},"Back To Main Page"]
["FOR INTRA DAY TRADING",{"$nulls":9},{"$f":"Main!B10","v":"2018-05-30"}]
[null,null," "]
[]
["Sr.no","Scrip","CLOSE RATE","Pivot Point","Supports",null,null,"Resistances"]
[null,null,"Point",null,"S1","S2","S3","R1","R2","R3","HIGH","LOW","Total Trade Quanity in Lakhs"]
[1,"3MINDIA",19983.5,{"v":19939.333333333332,"d":"19939.33"},{"v":19838.716666666664,"d":"19838.72"},{"v":19693.93333333333,"d":"19693.93"},{"v":19593.316666666662,"d":"19593.32"},{"v":20084.116666666665,"d":"20084.12"},{"v":20184.733333333334,"d":"20184.73"},{"v":20329.516666666666,"d":"20329.52"},20039.95,19794.55,0.0124]
[2,"8KMILES",638.1,636.65,{"v":625.3,"d":"625.30"},{"v":612.5,"d":"612.50"},601.15,{"v":649.4499999999999,"d":"649.45"},{"v":660.8000000000001,"d":"660.80"},{"v":673.5999999999999,"d":"673.60"},648,623.85,2.36383]
[3,"AARTIIND",1208.9,{"v":1214.3,"d":"1214.30"},{"v":1199.6,"d":"1199.60"},{"v":1190.3,"d":"1190.30"},{"v":1175.6,"d":"1175.60"},{"v":1223.6,"d":"1223.60"},{"v":1238.3000000000002,"d":"1238.30"},{"v":1247.6,"d":"1247.60"},1229,1205,0.25555]
[4,"ABAN",155.8,{"v":156.23333333333335,"d":"156.23"},{"v":153.7166666666667,"d":"153.72"},{"v":151.63333333333335,"d":"151.63"},{"v":149.1166666666667,"d":"149.12"},{"v":158.3166666666667,"d":"158.32"},{"v":160.83333333333334,"d":"160.83"},{"v":162.91666666666669,"d":"162.92"},158.75,154.15,5.42073]
[5,"ABB",1225.9,{"v":1216.6333333333334,"d":"1216.63"},{"v":1202.1166666666668,"d":"1202.12"},{"v":1178.3333333333333,"d":"1178.33"},{"v":1163.8166666666666,"d":"1163.82"},{"v":1240.416666666667,"d":"1240.42"},{"v":1254.9333333333338,"d":"1254.93"},{"v":1278.7166666666672,"d":"1278.72"},1231.15,1192.85,0.39185]
[6,"ABCAPITAL",149.1,{"v":148.66666666666666,"d":"148.67"},{"v":145.63333333333333,"d":"145.63"},{"v":142.16666666666666,"d":"142.17"},{"v":139.13333333333333,"d":"139.13"},{"v":152.13333333333333,"d":"152.13"},{"v":155.16666666666669,"d":"155.17"},{"v":158.63333333333333,"d":"158.63"},151.7,145.2,20.30951]
[7,"ABFRL",149.25,{"v":148.16666666666666,"d":"148.17"},{"v":146.4333333333333,"d":"146.43"},{"v":143.61666666666665,"d":"143.62"},{"v":141.8833333333333,"d":"141.88"},{"v":150.98333333333332,"d":"150.98"},{"v":152.71666666666667,"d":"152.72"},{"v":155.53333333333333,"d":"155.53"},149.9,145.35,4.32826]
[8,"ACC",1310,{"v":1316.3,"d":"1316.30"},{"v":1294.8999999999999,"d":"1294.90"},{"v":1279.8,"d":"1279.80"},{"v":1258.3999999999999,"d":"1258.40"},{"v":1331.3999999999999,"d":"1331.40"},{"v":1352.8,"d":"1352.80"},{"v":1367.8999999999999,"d":"1367.90"},1337.7,1301.2,8.94054]
[9,"ADANIPORTS",377.85,{"v":378.3,"d":"378.30"},372.75,367.65,{"v":362.09999999999997,"d":"362.10"},{"v":383.40000000000003,"d":"383.40"},{"v":388.9500000000001,"d":"388.95"},{"v":394.05000000000007,"d":"394.05"},383.85,373.2,33.94813]
[10,"ADANIPOWER",20.5,{"v":20.7,"d":"20.70"},{"v":19.849999999999998,"d":"19.85"},{"v":19.2,"d":"19.20"},{"v":18.349999999999998,"d":"18.35"},{"v":21.349999999999998,"d":"21.35"},{"v":22.2,"d":"22.20"},{"v":22.849999999999998,"d":"22.85"},21.55,20.05,193.3421]
{"$rows_left_out":492}
{"sheet":"Bulk Deals","index":4,"n_rows":69,"n_cols":8,"rows_kept":69,"merged":[[4,0,4,1],[4,2,4,3],[6,1,6,2]]}
[" "]
[]
[]
[]
[]
[{"$nulls":4},"Back To Main Page"]
["Subject :","BULK DEAL",null,{"$f":"Main!B10","v":"2018-05-30"}]
[]
["Date","Scrip code","Scrip Name","Client Name","Buy / Sell","Quantity Traded","Trade Price / Wt.Avg.trade price","Exchange  "]
["2018-05-29",537766,"BCP","KAMAL BABULAL AGARWAL","SELL",{"v":91823,"d":"91,823"},179.71,"BSE"]
["2018-05-29",537766,"BCP","KAMAL BABULAL AGARWAL","BUY",{"v":81823,"d":"81,823"},180.7,"BSE"]
["2018-05-29",539131,"CLLIMITED","ADSERVE ADVISORY AND CONSULTANCY SERVICES PRIVATE LIMITED","SELL",{"v":29887,"d":"29,887"},21.78,"BSE"]
["2018-05-29",539131,"CLLIMITED","ADSERVE ADVISORY AND CONSULTANCY SERVICES PRIVATE LIMITED","BUY",{"v":4026,"d":"4,026"},22.37,"BSE"]
["2018-05-29",538568,"FRUTION","NARESH KUMAR GUPTA","BUY",{"v":31200,"d":"31,200"},10.14,"BSE"]
["2018-05-29",538568,"FRUTION","YOGYA ENTERPRISES LIMITED","SELL",{"v":31110,"d":"31,110"},10.14,"BSE"]
["2018-05-29",540266,"GLCL","NIMESH GANPATBHAI PARMAR","BUY",{"v":75000,"d":"75,000"},36,"BSE"]
["2018-05-29",540266,"GLCL","HIMANSHU CHANDRAKANT BHANSALI","SELL",{"v":20000,"d":"20,000"},36,"BSE"]
["2018-05-29",540266,"GLCL","RAKESH TILAK RAJ SANGHAVI","SELL",{"v":50000,"d":"50,000"},36,"BSE"]
["2018-05-29",540266,"GLCL","KAMLESH MOTTYBHAI PATEL","BUY",{"v":20000,"d":"20,000"},36,"BSE"]
["2018-05-29",540152,"IGRL","GLOBE FINCAP LIMITED","SELL",{"v":80000,"d":"80,000"},10.2,"BSE"]
{"$rows_left_out":50}
{"sheet":"Call Tracker (Equity & F&O)","index":5,"n_rows":300,"n_cols":18,"rows_kept":300,"merged":[[40,0,41,0],[40,1,41,1],[40,9,41,9],[40,12,41,12],[40,13,41,13],[40,14,41,14]]}
[]
[]
[]
[]
[{"$nulls":12},"Back To Main Page"]
["Retail Research Technical Calls & Fundamental Performance Report for the month of May -2018 "]
[{"$nulls":12},{"$f":"Main!B10","v":"2018-05-30"}]
[null,"Positional  Call"]
["Sr.no","Date",null,"Company","Rec","Rec Price","Stop Loss***","Call Closed At","Target","Remark","Profit / Loss per Share","Gain / Loss  %","Status","Closed Date","NSE Closed Price"]
[1,"2018-02-12",null,"ITC","Buy",271.5,250,285,310,"Profit of Rs.13.5/-",{"$f":"H10-F10","v":13.5},{"$f":"K10/F10","v":{"v":0.049723756906077346,"d":"4.97%"}},"Successful","2018-05-02",{"$nulls":3},"P"]
[1,"2018-04-05",null,"RECLTD","Buy",129,122,121,140,"Loss of Rs.8/-",{"$f":"H11-F11","v":-8},{"$f":"K11/F11","v":{"v":-0.06201550387596899,"d":"-6.20%"}},"Unsuccessful","2018-05-10",{"$nulls":3},"R"]
[2,"2018-04-11",null,"FEDERALBNK","Buy",98.75,94,103.45,"106-109","Profit of Rs.4.7/-",{"$f":"H12-F12","v":4.700000000000003},{"$f":"K12/F12","v":{"v":0.04759493670886079,"d":"4.76%"}},"Successful","2019-05-09",{"$nulls":3},"R"]
[4,"2018-04-18",null,"BHEL","Buy$",{"$f":"(81+88.5)/2","v":84.75},79,78.75,100,"Loss of Rs.6/-",{"$f":"H13-F13","v":-6},{"$f":"K13/F13","v":{"v":-0.07079646017699115,"d":"-7.08%"}},"Unsuccessful","2018-05-14",{"$nulls":3},"A"]
[5,"2018-04-20",null,"HINDZINC","Sell",325.5,340,314.5,"310-305","Profit of Rs.11/-",{"$f":"F14-H14","v":11},{"$f":"K14/F14","v":{"v":0.03379416282642089,"d":"3.38%"}},"Successful","2018-05-02",{"$nulls":3},"H"]
[6,"2018-04-26",null,"HCLTECH","Buy",1060,1018,1015,"1130-1150","Loss of Rs.45/-",{"$f":"H15-F15","v":-45},{"v":-0.04245283018867924,"d":"-4.25%"},"Unsuccessful","2018-05-02",{"$nulls":3},"H"]
[7,"2018-04-27",null,"PFC","Buy",85.8,82.5,89.45,"91-93","Profit of Rs.3.65/-",{"$f":"H16-F16","v":3.6500000000000057},{"v":0.042540792540792606,"d":"4.25%"},"Successful","2018-05-02",{"$nulls":3},"H"]
[8,"2018-04-30",null,"HEXAWARE","Sell",447,464,428.5,"410-400","Profit of Rs.18.5/-",{"$f":"F17-H17","v":18.5},{"v":0.04138702460850112,"d":"4.14%"},"Successful","2018-05-05",{"$nulls":3},"H"]
[9,"2018-05-04",null,"GLENMARK","Buy",544,520,513,"580-585","Loss of Rs.31/-",{"$f":"H18-F18","v":-31},{"v":-0.05698529411764706,"d":"-5.70%"},"Unsuccessful","2018-05-11",{"$nulls":3},"R"]
[10,"2018-05-04",null,"L&TFH","Buy",177.5,169,183.25,"190-195"," Profit of Rs.5.75/-",{"$f":"H19-F19","v":5.75},{"v":0.0323943661971831,"d":"3.24%"},"Successful","2018-05-08",{"$nulls":3},"H"]
[11,"2018-05-04",null,"HCLTECH","Buy","920-930",890,null,"980-990","Open",{"$nulls":4},{"$f":"VLOOKUP(D20,Sheet2!$A$1:M2159,6,0)","v":905.1},null,null,"H"]
{"$rows_left_out":281}
{"sheet":"Call Tracker (Currency)","index":6,"n_rows":58,"n_cols":18,"rows_kept":58,"hidden":true,"merged":[[1,8,1,9],[2,8,2,9],[3,8,3,9],[4,8,4,9],[5,8,5,9],[6,8,6,9],[7,8,7,9],[8,8,8,9],[9,8,9,9],[10,8,10,9],[11,8,11,9],[12,8,12,9],[13,8,13,9],[14,8,14,9],[15,8,15,9],[16,8,16,9],[17,8,17,9],[18,8,18,9],[19,8,19,9],[20,8,20,9],[21,8,21,9],[22,8,22,9],[23,8,23,9],[24,8,24,9],[25,8,25,9],[26,8,26,9],[27,8,27,9],[28,8,28,9],[29,8,29,9],[30,8,30,9],[31,8,31,9],[32,8,32,9],[33,8,33,9],[34,8,34,9],[35,8,35,9],[36,8,36,9],[37,8,37,9],[38,8,38,9],[39,8,39,9],[40,8,40,9],[41,8,41,9],[42,8,42,9],[43,8,43,9],[44,8,44,9],[45,8,45,9],[46,8,46,9],[47,8,47,9],[48,8,48,9],[49,8,49,9],[50,8,50,9],[51,8,51,9],[52,8,52,9],[53,8,53,9],[54,8,54,9],[55,8,55,9],[56,8,56,9],[57,8,57,9],[58,8,58,9],[59,8,59,9],[60,8,60,9],[61,8,61,9],[62,8,62,9],[63,8,63,9],[64,8,64,9],[65,8,65,9],[66,8,66,9],[67,8,67,9],[68,8,68,9],[69,8,69,9],[70,8,70,9],[71,8,71,9],[72,8,72,9],[73,8,73,9],[74,8,74,9],[75,8,75,9],[76,8,76,9],[77,8,77,9],[78,8,78,9],[79,8,79,9],[80,8,80,9],[81,8,81,9],[82,8,82,9],[83,8,83,9],[84,8,84,9],[85,8,85,9],[86,8,86,9],[87,8,87,9],[88,8,88,9],[89,8,89,9],[90,8,90,9],[91,8,91,9],[92,8,92,9],[93,8,93,9],[94,8,94,9],[95,8,95,9],[96,8,96,9],[97,8,97,9],[98,8,98,9],[99,8,99,9],[100,8,100,9],[101,8,101,9],[102,8,102,9],[103,8,103,9],[104,8,104,9],[105,8,105,9],[106,8,106,9],[107,8,107,9],[108,8,108,9],[109,8,109,9],[110,8,110,9],[111,8,111,9],[112,8,112,9],[113,8,113,9],[114,8,114,9],[115,8,115,9],[116,8,116,9],[117,8,117,9],[118,8,118,9],[119,8,119,9],[120,8,120,9],[121,8,121,9],[122,8,122,9],[123,8,123,9],[124,8,124,9]]}
["Master Trade High Risk"]
["Sr.no","Date","Company","Rec","Rec Price","Stop Loss","Call Closed At","Target","Remark",null,"Profit / Loss per share","Gain / Loss  per Lot","Lot","Status","Closed Date"]
[1,"2017-05-08","USDINR MAY FUT","Buy",64.3935,64.29,64.66,64.59,"Profit of Rs.0.27/-",null,{"v":0.2664999999999935,"d":"0.27"},266.4999999999935,1000,"Successful","2017-05-09",null,null,"P"]
[2,"2017-05-08","USDINR JUN FUT","Buy",64.6535,64.45,64.965,65.05,"Profit of Rs 0.31/-",null,{"v":0.31150000000000944,"d":"0.31"},311.50000000000944,1000,"Successful","2017-05-09",null,null,"P"]
[3,"2017-05-09","EUROINR MAY FUT","Sell",70.65,70.8,70.07,70.4,"Profit of Rs 0.58/-",null,{"v":0.580000000000013,"d":"0.58"},580.00000000001,1000,"Successful","2017-05-12",null,null,"P"]
[4,"2017-05-09","GBPINR MAY FUT","Buy",83.774,83.37,83.37,84.77,"Loss of Rs 0.40/-",null,{"v":-0.40399999999999636,"d":"-0.40"},-403.99999999999636,1000,"Unsuccessful","2017-05-11",null,null,"P"]
[5,"2017-05-11","USDINR MAY FUT","Buy",64.6555,64.55,64.55,64.86,"Loss of Rs.0.1055/-",null,-0.10550000000000637,{"$f":"K7*M7","v":{"v":-105.50000000000637,"d":"-105.50"}},1000,"Unsuccessful","2017-05-11",null,null,"P"]
[6,"2017-05-15","USDINR MAY FUT","Buy",64.2275,64.08,64.46,64.48,"Profit of Rs 0.23/-",null,{"v":0.2324999999999875,"d":"0.23"},232.4999999999875,1000,"Successful","2017-05-18",null,null,"P"]
[7,"2017-05-19","USDINR MAY FUT","Sell",64.83,65,65,64.5,"Loss of Rs.0.17/-",null,{"v":-0.1700000000000017,"d":"-0.17"},-170.0000000000017,1000,"Unsuccessful","2017-05-19",null,null,"P"]
[8,"2017-05-23","USDINR MAY FUT","Buy",64.83,64.62,64.95,65.2,"Profit of Rs 0.12/-",null,{"v":0.12000000000000455,"d":"0.12"},120.00000000000455,1000,"Successful","2017-05-24",null,null,"P"]
[9,"2017-05-25","USDINR MAY FUT","Buy",64.57,64.25,64.56,65,"Loss of Rs.0.01/-",null,-0.009999999999990905,-9.999999999990905,1000,"Neutral","2017-05-29",null,null,"P"]
[10,"2017-05-30","USDINR JUN FUT","Buy",64.9125,64.71,64.71,65.31,"Loss of Rs.0.20/-",null,{"v":-0.20250000000000057,"d":"-0.20"},-202.50000000000057,1000,"Unsuccessful","2017-05-31",null,null,"P"]
[11,"2017-06-01","USDINR JUN FUT","Buy",64.655,64.45,64.45,65.05,"Loss of Rs.0.20/-",null,{"$f":"G13-E13","v":{"v":-0.2049999999999983,"d":"-0.20"}},{"$f":"K13*M13","v":-204.9999999999983},{"v":1000,"d":"1000.00"},"Unsuccessful","2017-06-08",null,null,"P"]
[12,"2017-06-12","USDINR JUN FUT","Buy",64.45,64,64.7625,65.2,"Profit of Rs 0.31/-",null,{"v":0.3125,"d":"0.31"},312.5,1000,"Successful","2017-06-16"]
[13,"2017-06-16","USDINR JUN FUT","Buy",64.51,64.2,64.7,65.11,"Profit of Rs 0.19/-",null,{"v":0.18999999999999773,"d":"0.19"},189.99999999999773,1000,"Successful","2017-06-21"]
[14,"2017-06-22","USDINR JUN FUT","Buy",64.56,64.2,64.2,65.1,"Loss of Rs.0.36/-",null,{"v":-0.35999999999999943,"d":"-0.36"},-359.99999999999943,{"v":1000,"d":"1000.00"},"Unsuccessful","2017-06-30"]
[15,"2017-07-10","USDINR JUL FUT","Buy",64.67,64.4,64.4,65.15,"Loss of Rs.0.27/-",null,{"v":-0.269999999999996,"d":"-0.27"},-269.999999999996,{"v":1000,"d":"1000.00"},"Unsuccessful","2017-07-31"]
[16,"2017-08-02","USDINR AUG FUT","Buy",64.235,63.98,63.98,64.75,"Loss of Rs.0.26/-",null,{"v":-0.25500000000000256,"d":"-0.26"},-255.00000000000256,{"v":1000,"d":"1000.00"},"Unsuccessful","2017-08-02"]
[17,"2017-08-08","USDINR AUG FUT","Buy",63.9425,63.6,64.15,64.5,"Profit of Rs 0.21/-",null,{"v":0.20750000000000313,"d":"0.21"},207.50000000000313,1000,"Successful","2017-08-10"]
[18,"2017-08-22","USDINR AUG FUT","Buy",64.1175,63.9,64.01,64.5,"Loss of Rs.0.11/-",null,{"$f":"G20-E20","v":{"v":-0.1075000000000017,"d":"-0.11"}},{"$f":"K20*M20","v":-107.5000000000017},{"v":1000,"d":"1000.00"},"Unsuccessful","2017-08-29"]
{"$rows_left_out":39}
{"sheet":"Sheet2","index":7,"n_rows":1646,"n_cols":14,"rows_kept":1646,"hidden":true}
["SYMBOL","SERIES","OPEN","HIGH","LOW","CLOSE","LAST","PREVCLOSE","TOTTRDQTY","TOTTRDVAL","TIMESTAMP","TOTALTRADES","ISIN","ISIN"]
["20MICRONS","EQ",42.35,42.9,42.05,42.45,42.25,42.2,59141,2509198,"2018-05-29",583,"INE144J01027"]
["21STCENMGM","EQ",39.15,39.85,38.4,38.4,38.4,39.15,11376,444488.1,"2018-05-29",20,"INE253B01015"]
["3IINFOTECH","EQ",4.8,5,4.7,4.95,5,4.8,2021943,9839647.7,"2018-05-29",1090,"INE748C01020"]
["3MINDIA","EQ",19960.55,20039.95,19794.55,19983.5,19925,19802.1,1240,24760807.75,"2018-05-29",434,"INE470A01017"]
["3PLAND","EQ",15.4,15.4,13,14.2,14.2,13.9,570,7664.85,"2018-05-29",24,"INE105C01023"]
["5PAISA","EQ",408,409.5,392.3,409.5,409.5,390,5327,2164016.75,"2018-05-29",300,"INE618L01018"]
["63MOONS","EQ",80.15,81.05,78.95,79.15,78.95,80.2,117152,9357318.3,"2018-05-29",1889,"INE111B01023"]
["8KMILES","EQ",625.2,648,623.85,638.1,637.9,623.35,236383,150556143,"2018-05-29",8211,"INE650K01021"]
["A2ZINFRA","EQ",25.5,26.1,23.8,24.1,24.2,25.7,565619,14137635.65,"2018-05-29",1821,"INE619I01012"]
["AARTIDRUGS","EQ",529.05,533,523,524.85,523,534.9,7347,3867752.95,"2018-05-29",342,"INE767A01016"]
["AARTIIND","EQ",1229,1229,1205,1208.9,1205,1218.15,25555,31022992.75,"2018-05-29",3865,"INE769A01020"]
["AARVEEDEN","EQ",41.7,41.7,37.5,37.7,37.5,38.6,21333,815382.35,"2018-05-29",120,"INE273D01019"]
["ABAN","EQ",154.5,158.75,154.15,155.8,155.65,155.1,542073,84815476.05,"2018-05-29",6764,"INE421A01028"]
["ABB","EQ",1211.6,1231.15,1192.85,1225.9,1225,1203.3,39185,47908710.65,"2018-05-29",2938,"INE117A01022"]
["ABBOTINDIA","EQ",6740,6767,6655.05,6686.1,6698,6773.65,2143,14378479.7,"2018-05-29",1136,"INE358A01014"]
["ABCAPITAL","EQ",146,151.7,145.2,149.1,149,146.15,2030951,303997059.9,"2018-05-29",19330,"INE674K01013"]
["ABFRL","EQ",145.35,149.9,145.35,149.25,149.4,146.35,432826,64106632.5,"2018-05-29",4462,"INE647O01011"]
["ABMINTLTD","BE",20.6,20.6,20.6,20.6,20.6,20.6,1,20.6,"2018-05-29",1,"INE251C01017"]
["ACC","EQ",1321.05,1337.7,1301.2,1310,1310.05,1322.5,894054,1172847631.45,"2018-05-29",28856,"INE012A01025"]
{"$rows_left_out":1627}
{"sheet":"Sheet1","index":8,"n_rows":0,"n_cols":0,"rows_kept":0,"hidden":true}

{"sheet":"Sheet3","index":9,"n_rows":0,"n_cols":0,"rows_kept":0,"hidden":true}