{"text_format":"3","workbook":"xlsx","n_sheets":10,"sheets":["Main","Future Intra","Cash Intra","MidCap Intra","Bulk Deals","Call Tracker (Equity & F&O)","Sheet2","Sheet1","Sheet3","Sheet4"],"not_rendered":{"images":4,"defined_names":4},"read":"whole","date_system":"1900"}

{"sheet":"Main","index":0,"n_rows":17,"n_cols":4,"rows_kept":17}
[null,"                                                                                                 "]
{"$rows_empty":8}
[null,"2019-03-29"]
[]
[null,"Sheet No.","Template Name","Summary"]
[null,1,"Future Intra","For Intraday trading in F&O segment"]
[null,2,"Cash Intra","For Intraday trading in cash market segment"]
[null,3,"Mid-cap Intra","For Intraday trading in Mid-cap stocks"]
[null,4,"Bulk Deals","Reveals Bulk Deals carried on NSE & BSE"]
[null,5,"Call Tracker"]

{"sheet":"Future Intra","index":1,"n_rows":236,"n_cols":15,"rows_kept":236,"merged":[[8,0,9,0],[8,1,9,1],[8,2,9,2],[8,5,8,7],[8,8,8,10]]}
[]
[]
[]
[]
[{"$nulls":12},"Back to Main Page"]
["FOR INTRA DAY TRADING",{"$nulls":10},{"$f":"Main!B10","v":"2019-03-29"}]
[]
[]
["Sr.no","Sector","Scrip","CLOSE RATE","Pivot Point","Supports",null,null,"Resistances"]
[null,"Sector",null,"Point","Point","S1","S2","S3","R1","R2","R3","HIGH","LOW","OI","% Change in OI"]
[1,"Index","BANKNIFTY",30527.35,{"v":30400.483333333334,"d":"30400.48"},{"v":30232.066666666666,"d":"30232.07"},{"v":29936.783333333333,"d":"29936.78"},{"v":29768.366666666665,"d":"29768.37"},{"v":30695.766666666666,"d":"30695.77"},{"v":30864.18333333333,"d":"30864.18"},{"v":31159.466666666667,"d":"31159.47"},30568.9,30105.2,2282800,{"v":-0.16299397948183944,"d":"-16.30%"}]
[2,"Index","NIFTY",{"v":11663.6,"d":"11663.60"},{"v":11622.616666666667,"d":"11622.62"},{"v":11565.383333333333,"d":"11565.38"},{"v":11467.166666666666,"d":"11467.17"},{"v":11409.933333333332,"d":"11409.93"},{"v":11720.833333333334,"d":"11720.83"},{"v":11778.066666666668,"d":"11778.07"},{"v":11876.283333333335,"d":"11876.28"},11679.85,11524.4,18116550,{"v":-0.2990368627086822,"d":"-29.90%"}]
[3,"Index","NIFTYIT",{"v":15723,"d":"15723.00"},{"v":15667.333333333334,"d":"15667.33"},{"v":15574.666666666668,"d":"15574.67"},{"v":15426.333333333334,"d":"15426.33"},{"v":15333.666666666668,"d":"15333.67"},{"v":15815.666666666668,"d":"15815.67"},{"v":15908.333333333336,"d":"15908.33"},{"v":16056.666666666668,"d":"16056.67"},15760,15519,13100,{"v":-0.3383838383838384,"d":"-33.84%"}]
[4,"Cement","ACC",{"v":1626.6,"d":"1626.60"},{"v":1620.8833333333332,"d":"1620.88"},{"v":1605.9166666666665,"d":"1605.92"},{"v":1585.2333333333333,"d":"1585.23"},{"v":1570.2666666666667,"d":"1570.27"},{"v":1641.5666666666664,"d":"1641.57"},{"v":1656.533333333333,"d":"1656.53"},{"v":1677.2166666666662,"d":"1677.22"},1635.85,1600.2,2362400,{"v":-0.07458476966468192,"d":"-7.46%"}]
[5,"Others","ADANIENT",{"v":138.9,"d":"138.90"},{"v":140.26666666666668,"d":"140.27"},{"v":136.18333333333337,"d":"136.18"},{"v":133.4666666666667,"d":"133.47"},{"v":129.38333333333338,"d":"129.38"},{"v":142.98333333333335,"d":"142.98"},{"v":147.06666666666666,"d":"147.07"},{"v":149.78333333333333,"d":"149.78"},144.35,137.55,39524000,{"v":-0.0249654627985001,"d":"-2.50%"}]
[6,"Others","ADANIPORTS",{"v":383.8,"d":"383.80"},{"v":379.4166666666667,"d":"379.42"},{"v":374.3833333333334,"d":"374.38"},{"v":364.9666666666667,"d":"364.97"},{"v":359.9333333333334,"d":"359.93"},{"v":388.83333333333337,"d":"388.83"},{"v":393.8666666666667,"d":"393.87"},{"v":403.28333333333336,"d":"403.28"},384.45,370,22320000,{"v":-0.1055004508566276,"d":"-10.55%"}]
[7,"Power","ADANIPOWER",{"v":47.7,"d":"47.70"},{"v":47.68333333333334,"d":"47.68"},{"v":47.16666666666667,"d":"47.17"},{"v":46.63333333333333,"d":"46.63"},{"v":46.11666666666667,"d":"46.12"},{"v":48.216666666666676,"d":"48.22"},{"v":48.73333333333334,"d":"48.73"},{"v":49.26666666666668,"d":"49.27"},48.2,47.15,165380000,{"v":-0.05873648264086511,"d":"-5.87%"}]
[8,"Pharma","AJANTPHARM",1023.35,{"v":1016.4,"d":"1016.40"},1004.95,{"v":986.5500000000001,"d":"986.55"},{"v":975.1000000000001,"d":"975.10"},{"v":1034.8,"d":"1034.80"},1046.25,{"v":1064.6499999999999,"d":"1064.65"},1027.85,998,678000,{"v":-0.23389830508474577,"d":"-23.39%"}]
[9,"Banking","ALBK",54.35,{"v":53.883333333333326,"d":"53.88"},{"v":52.51666666666665,"d":"52.52"},{"v":50.68333333333332,"d":"50.68"},{"v":49.31666666666665,"d":"49.32"},{"v":55.716666666666654,"d":"55.72"},{"v":57.08333333333333,"d":"57.08"},{"v":58.91666666666666,"d":"58.92"},55.25,52.05,26286000,{"v":0.028484231943031537,"d":"2.85%"}]
[10,"Automobile","AMARAJABAT",723.55,{"v":725.6666666666666,"d":"725.67"},{"v":716.9833333333332,"d":"716.98"},{"v":710.4166666666666,"d":"710.42"},{"v":701.7333333333332,"d":"701.73"},{"v":732.2333333333332,"d":"732.23"},{"v":740.9166666666666,"d":"740.92"},{"v":747.4833333333332,"d":"747.48"},734.35,719.1,1275400,{"v":-0.2341319882303489,"d":"-23.41%"}]
{"$rows_left_out":207}
{"sheet":"Cash Intra","index":2,"n_rows":247,"n_cols":13,"rows_kept":247,"merged":[[7,0,8,0],[7,1,8,1],[7,2,8,2],[7,3,8,3],[7,4,7,6],[7,7,7,9]]}
[]
[]
[]
[]
[{"$nulls":12},"Back to Main Page"]
["FOR INTRA DAY TRADING",{"$nulls":9},{"$f":"Main!B10","v":"2019-03-29"}]
[]
["Sr.no","Scrip","CLOSE RATE","Pivot Point","Supports",null,null,"Resistances"]
[null,null,"Point",null,"S1","S2","S3","R1","R2","R3","HIGH","LOW","Total Trade Quanity in Lakhs"]
[1,"Nifty 50",11570,{"v":11536.983333333332,"d":"11536.98"},{"v":11485.466666666664,"d":"11485.47"},{"v":11400.933333333332,"d":"11400.93"},{"v":11349.416666666664,"d":"11349.42"},{"v":11621.516666666663,"d":"11621.52"},{"v":11673.03333333333,"d":"11673.03"},{"v":11757.566666666662,"d":"11757.57"},11588.5,11452.45]
[2,"Nifty Bank",30420.55,{"v":30295.233333333334,"d":"30295.23"},{"v":30094.416666666668,"d":"30094.42"},{"v":29768.283333333333,"d":"29768.28"},{"v":29567.466666666667,"d":"29567.47"},{"v":30621.36666666667,"d":"30621.37"},{"v":30822.183333333334,"d":"30822.18"},{"v":31148.31666666667,"d":"31148.32"},30496.05,29969.1]
[3,"Nifty CPSE",2244.2,{"v":2250,"d":"2250.00"},2231.35,{"v":2218.5,"d":"2218.50"},2199.85,2262.85,{"v":2281.4999999999995,"d":"2281.50"},2294.35,2268.65,2237.15]
[4,"Nifty Infra",3197.6,{"v":3188.5166666666664,"d":"3188.52"},{"v":3172.033333333333,"d":"3172.03"},{"v":3146.4666666666662,"d":"3146.47"},{"v":3129.9833333333327,"d":"3129.98"},{"v":3214.083333333333,"d":"3214.08"},{"v":3230.5666666666666,"d":"3230.57"},{"v":3256.133333333333,"d":"3256.13"},3205,3162.95]
[5,"Nifty IT",15566.75,{"v":15534.233333333332,"d":"15534.23"},{"v":15431.966666666664,"d":"15431.97"},{"v":15297.183333333332,"d":"15297.18"},{"v":15194.916666666664,"d":"15194.92"},{"v":15669.016666666663,"d":"15669.02"},{"v":15771.28333333333,"d":"15771.28"},{"v":15906.066666666662,"d":"15906.07"},15636.5,15399.45]
[6,"Nifty PSE",3543.7,{"v":3547.783333333333,"d":"3547.78"},{"v":3532.616666666666,"d":"3532.62"},{"v":3521.533333333333,"d":"3521.53"},{"v":3506.366666666666,"d":"3506.37"},{"v":3558.866666666666,"d":"3558.87"},{"v":3574.033333333333,"d":"3574.03"},{"v":3585.116666666666,"d":"3585.12"},3562.95,3536.7]
[7,"Nifty Midcap 50",5024.85,{"v":5017.516666666666,"d":"5017.52"},{"v":4990.633333333333,"d":"4990.63"},{"v":4956.416666666667,"d":"4956.42"},{"v":4929.533333333334,"d":"4929.53"},{"v":5051.733333333333,"d":"5051.73"},{"v":5078.616666666666,"d":"5078.62"},{"v":5112.833333333332,"d":"5112.83"},5044.4,4983.3]
[8,"ABB",1314.9,{"v":1318.3500000000001,"d":"1318.35"},{"v":1305.0000000000002,"d":"1305.00"},{"v":1295.1000000000001,"d":"1295.10"},{"v":1281.7500000000002,"d":"1281.75"},{"v":1328.2500000000002,"d":"1328.25"},{"v":1341.6000000000001,"d":"1341.60"},{"v":1351.5000000000002,"d":"1351.50"},1331.7,1308.45,1.54138]
[9,"ACC",1617.8,{"v":1611.3999999999999,"d":"1611.40"},{"v":1593.3999999999996,"d":"1593.40"},{"v":1568.9999999999998,"d":"1569.00"},{"v":1550.9999999999995,"d":"1551.00"},{"v":1635.7999999999997,"d":"1635.80"},{"v":1653.8000000000002,"d":"1653.80"},{"v":1678.1999999999998,"d":"1678.20"},1629.4,1587,9.42173]
[10,"AIAENG",1837.15,{"v":1821.7166666666665,"d":"1821.72"},{"v":1778.433333333333,"d":"1778.43"},{"v":1719.7166666666665,"d":"1719.72"},{"v":1676.433333333333,"d":"1676.43"},{"v":1880.433333333333,"d":"1880.43"},{"v":1923.7166666666662,"d":"1923.72"},{"v":1982.433333333333,"d":"1982.43"},1865,1763,0.56612]
[11,"AUBANK",588.35,{"v":582.4499999999999,"d":"582.45"},{"v":574.8999999999999,"d":"574.90"},{"v":561.4499999999999,"d":"561.45"},{"v":553.8999999999999,"d":"553.90"},{"v":595.8999999999999,"d":"595.90"},{"v":603.4499999999998,"d":"603.45"},{"v":616.8999999999999,"d":"616.90"},590,569,3.07345]
{"$rows_left_out":228}
{"sheet":"MidCap Intra","index":3,"n_rows":510,"n_cols":13,"rows_kept":510,"merged":[[0,0,0,1],[8,0,9,0],[8,1,9,1],[8,2,9,2],[8,3,9,3],[8,4,8,6],[8,7,8,9]]}
[]
[]
[]
[]
[{"$nulls":11},"Back To Main Page"]
["FOR INTRA DAY TRADING",{"$nulls":9},{"$f":"Main!B10","v":"2019-03-29"}]
[null,null," "]
[]
["Sr.no","Scrip","CLOSE RATE","Pivot Point","Supports",null,null,"Resistances"]
[null,null,"Point",null,"S1","S2","S3","R1","R2","R3","HIGH","LOW","Total Trade Quanity in Lakhs"]
[1,"3MINDIA",24035.65,{"v":23949.216666666664,"d":"23949.22"},{"v":23748.433333333327,"d":"23748.43"},{"v":23461.216666666664,"d":"23461.22"},{"v":23260.433333333327,"d":"23260.43"},{"v":24236.433333333327,"d":"24236.43"},{"v":24437.21666666666,"d":"24437.22"},{"v":24724.433333333327,"d":"24724.43"},24150,23662,5.79E-3]
[2,"8KMILES",93.85,{"v":92.39999999999999,"d":"92.40"},{"v":90.94999999999999,"d":"90.95"},88.05,{"v":86.6,"d":"86.60"},{"v":95.29999999999998,"d":"95.30"},96.75,{"v":99.64999999999998,"d":"99.65"},93.85,89.5,1.83722]
[3,"AARTIIND",1555.25,{"v":1559.3,"d":"1559.30"},{"v":1533.5,"d":"1533.50"},1511.75,1485.95,1581.05,{"v":1606.8499999999997,"d":"1606.85"},{"v":1628.6,"d":"1628.60"},1585.1,1537.55,1.18734]
[4,"ABAN",58,{"v":58.23333333333333,"d":"58.23"},{"v":57.01666666666665,"d":"57.02"},{"v":56.033333333333324,"d":"56.03"},{"v":54.81666666666665,"d":"54.82"},{"v":59.216666666666654,"d":"59.22"},{"v":60.43333333333334,"d":"60.43"},{"v":61.41666666666666,"d":"61.42"},59.45,57.25,0.71729]
[5,"ABB",1314.9,{"v":1318.3500000000001,"d":"1318.35"},{"v":1305.0000000000002,"d":"1305.00"},{"v":1295.1000000000001,"d":"1295.10"},{"v":1281.7500000000002,"d":"1281.75"},{"v":1328.2500000000002,"d":"1328.25"},{"v":1341.6000000000001,"d":"1341.60"},{"v":1351.5000000000002,"d":"1351.50"},1331.7,1308.45,1.54138]
[6,"ABCAPITAL",98.55,{"v":99.31666666666666,"d":"99.32"},{"v":96.83333333333333,"d":"96.83"},{"v":95.11666666666666,"d":"95.12"},{"v":92.63333333333333,"d":"92.63"},{"v":101.03333333333333,"d":"101.03"},{"v":103.51666666666668,"d":"103.52"},{"v":105.23333333333333,"d":"105.23"},101.8,97.6,51.54877]
[7,"ABFRL",221.65,{"v":222.55000000000004,"d":"222.55"},{"v":219.4000000000001,"d":"219.40"},{"v":217.15000000000006,"d":"217.15"},{"v":214.0000000000001,"d":"214.00"},{"v":224.80000000000007,"d":"224.80"},227.95,{"v":230.20000000000005,"d":"230.20"},225.7,220.3,11.25372]
[8,"ACC",1617.8,{"v":1611.3999999999999,"d":"1611.40"},{"v":1593.3999999999996,"d":"1593.40"},{"v":1568.9999999999998,"d":"1569.00"},{"v":1550.9999999999995,"d":"1551.00"},{"v":1635.7999999999997,"d":"1635.80"},{"v":1653.8000000000002,"d":"1653.80"},{"v":1678.1999999999998,"d":"1678.20"},1629.4,1587,9.42173]
[9,"ADANIPORTS",381.3,376.75,370.85,{"v":360.40000000000003,"d":"360.40"},{"v":354.50000000000006,"d":"354.50"},{"v":387.2,"d":"387.20"},{"v":393.09999999999997,"d":"393.10"},{"v":403.54999999999995,"d":"403.55"},382.65,366.3,59.09606]
[10,"ADANIPOWER",46.9,{"v":47.03333333333333,"d":"47.03"},{"v":46.46666666666666,"d":"46.47"},{"v":46.03333333333333,"d":"46.03"},{"v":45.46666666666666,"d":"45.47"},{"v":47.46666666666666,"d":"47.47"},{"v":48.033333333333324,"d":"48.03"},{"v":48.46666666666666,"d":"48.47"},47.6,46.6,85.21212]
{"$rows_left_out":491}
{"sheet":"Bulk Deals","index":4,"n_rows":124,"n_cols":8,"rows_kept":124,"merged":[[4,0,4,1],[4,2,4,3],[6,1,6,2]]}
[" "]
[]
[]
[]
[]
[{"$nulls":4},"Back To Main Page"]
["Subject :","BULK DEAL",null,{"$f":"Main!B10","v":"2019-03-29"}]
[]
["Date","Scrip code","Scrip Name","Client Name","Buy / Sell","Quantity Traded","Trade Price / Wt.Avg.trade price","Exchange  "]
["2019-03-28",540615,"7NR","REKHA RAVI BHANDARI","SELL",{"v":54000,"d":"54,000"},50,"BSE"]
["2019-03-28",542580,"AARTECH","PRADEEP VASANT NARKHEDE","BUY",{"v":56000,"d":"56,000"},34.78,"BSE"]
["2019-03-28",539661,"ACEMEN","TEJAS GULABCHAND MARU","SELL",20200,20.58,"BSE"]
["2019-03-28",537766,"BCP","ACHINTYA SECURITIES PVT. LTD.","BUY",489620,39.54,"BSE"]
["2019-03-28",537766,"BCP","ACHINTYA SECURITIES PVT. LTD.","SELL",489620,38.89,"BSE"]
["2019-03-28",542057,"BCPL","SHERWOOD SECURITIES PVT LTD","SELL",96000,35.9,"BSE"]
["2019-03-28",540190,"FRANKLININD","PARESH GHANSHYAMBHAI PATEL","BUY",104000,11,"BSE"]
["2019-03-28",540190,"FRANKLININD","CHANDRIKABEN SAIJA","BUY",128000,11,"BSE"]
["2019-03-28",540190,"FRANKLININD","SUNIL LAXMINARAYAN JHA","BUY",138000,11,"BSE"]
["2019-03-28",540190,"FRANKLININD","RINAL SANDIPKUMAR KHATRI","BUY",160000,11,"BSE"]
["2019-03-28",540190,"FRANKLININD","MANISHA NITINKUMAR SHAH","BUY",50000,11,"BSE"]
{"$rows_left_out":105}
{"sheet":"Call Tracker (Equity & F&O)","index":5,"n_rows":353,"n_cols":18,"rows_kept":353,"merged":[[36,0,37,0],[36,1,37,1],[36,2,37,2],[36,9,37,9],[36,11,37,11],[36,12,37,12],[36,13,37,13],[36,14,37,14],[39,0,40,0],[39,1,40,1],[39,2,40,2],[39,9,40,9],[39,11,40,11],[39,12,40,12],[39,13,40,13],[39,14,40,14],[41,0,42,0],[41,1,42,1],[41,2,42,2],[41,9,42,9],[41,11,42,11],[41,12,42,12],[41,13,42,13],[41,14,42,14],[52,0,53,0],[52,1,53,1],[52,2,53,2],[52,9,53,9],[52,11,53,11],[52,12,53,12],[52,13,53,13],[52,14,53,14],[66,0,67,0],[66,1,67,1],[66,2,67,2],[66,9,67,9],[66,11,67,11],[66,12,67,12],[66,13,67,13],[66,14,67,14],[68,0,69,0],[68,1,69,1],[68,2,69,2],[68,9,69,9],[68,11,69,11],[68,12,69,12],[68,13,69,13],[68,14,69,14]]}
[]
[]
[]
[]
[{"$nulls":12},"Back To Main Page"]
["Retail Research Technical Calls & Fundamental Performance Report for the month of March -2019 "]
[{"$nulls":12},{"$f":"Main!B10","v":"2019-03-29"}]
[null,"Positional  Call"]
["Sr.no","Date",null,"Company","Rec","Rec Price","Stop Loss***","Call Closed At","Target","Remark","Profit / Loss per Share","Gain / Loss  %","Status","Closed Date","NSE Closed Price"]
[1,"2019-01-24",null,"ITC","Buy",280,268,292,305,"Profit of Rs.12/-",{"$f":"H10-F10","v":12},{"$f":"K10/F10","v":{"v":0.04285714285714286,"d":"4.29%"}},"Successful","2019-03-08",{"$nulls":3},"R"]
[2,"2019-03-01",null,"UPL","Sell",881.5,922.2,922.2,800,"Loss of Rs.40.7/-",{"$f":"F11-H11","v":-40.700000000000045},{"v":-0.0461712989222916,"d":"-4.62%"},"UnSuccessful","2019-03-15",{"$nulls":3},"R"]
[3,"2019-03-01",null,"BEL","Buy",83,78.5,86.25,92,"Profit of Rs.3.25/-",3.25,{"$f":"K12/F12","v":{"v":0.0391566265060241,"d":"3.92%"}},"Successful","2019-03-05",{"$nulls":3},"H"]
[4,"2019-03-01",null,"ZEEL","Sell",478.5,507.3,458.5,"435-425","Profit of Rs.20/-",{"$f":"F13-H13","v":20},{"$f":"K13/F13","v":{"v":0.04179728317659352,"d":"4.18%"}},"Successful","2019-03-07",{"$nulls":3},"R"]
[5,"2019-03-06",null,"MARUTI","Buy",7025,6700,6955,"7500-7600","Loss of Rs.70/-",-70,{"v":-0.0099644128113879,"d":"-1.00%"},"UnSuccessful","2019-03-20",{"$nulls":3},"H"]
[6,"2019-03-07",null,"BPCL","Sell",376.5,395.6,385.75,"345-335","Loss of Rs.9.25/-",{"$f":"F15-H15","v":-9.25},{"$f":"K15/F15","v":{"v":-0.024568393094289508,"d":"-2.46%"}},"UnSuccessful","2019-03-18",{"$nulls":3},"R"]
[7,"2019-03-07",null,"RAYMOND","Sell","825-830",888.8,null,"720-730","Open",{"$nulls":4},{"$f":"VLOOKUP(D16,Sheet2!A16:M1811,6,0)","v":795},null,null,"R"]
[8,"2019-03-08",null,"BHEL","Sell",67.5,70.5,70.5,"63-61","Loss of Rs.3/-",{"$f":"F17-H17","v":-3},{"$f":"K17/F17","v":{"v":-0.044444444444444446,"d":"-4.44%"}},"UnSuccessful","2019-03-12",{"$nulls":3},"H"]
[9,"2019-03-13",null,"DLF","Sell","192-194",206.6,null,"164-168 ","Open",{"$nulls":4},{"$f":"VLOOKUP(D18,Sheet2!A18:M1813,6,0)","v":194.05},null,null,"R"]
[10,"2019-03-15",null,"OFSS","Buy","3380-3410",3250,null,"3650-3700","Open",{"$nulls":4},{"$f":"VLOOKUP(D19,Sheet2!A19:M1814,6,0)","v":3362.9},null,null,"H"]
[11,"2019-03-18",null,"BANKBARODA","Sell",121,127.3,{"$f":"(116.75+128)/2","v":122.375},"110-108","Loss of Rs.1.4",{"$f":"F20-H20","v":{"v":-1.375,"d":"-1.4"}},{"$f":"K20/F20","v":{"v":-0.011363636363636364,"d":"-1.14%"}},"Neutral","2019-03-28",{"$nulls":3},"R"]
{"$rows_left_out":315}
{"sheet":"Sheet2","index":6,"n_rows":1641,"n_cols":14,"rows_kept":1641,"hidden":true}
["SYMBOL","SERIES","OPEN","HIGH","LOW","CLOSE","LAST","PREVCLOSE","TOTTRDQTY","TOTTRDVAL","TIMESTAMP","TOTALTRADES","ISIN","ISIN"]
["20MICRONS","EQ",37.5,38.8,37,38.5,38.7,37.05,38303,1458324.45,"2019-03-28",398,"INE144J01027"]
["21STCENMGM","EQ",18.2,18.9,18.2,18.9,18.9,18.55,2476,46374.85,"2019-03-28",15,"INE253B01015"]
["3IINFOTECH","EQ",3.8,3.9,3.7,3.8,3.85,3.75,2391169,9067838.35,"2019-03-28",692,"INE748C01020"]
["3MINDIA","EQ",23945,24150,23662,24035.65,23978.5,23777.85,579,13855199.45,"2019-03-28",352,"INE470A01017"]
["5PAISA","EQ",228.8,239.95,228,237.3,239,228.75,4120,969097.4,"2019-03-28",232,"INE618L01018"]
["63MOONS","EQ",78.45,80.7,78.15,79.55,79.3,78.05,182918,14582419.45,"2019-03-28",2469,"INE111B01023"]
["8KMILES","EQ",90,93.85,89.5,93.85,93.85,89.4,183722,16981471.3,"2019-03-28",2367,"INE650K01021"]
["A2ZINFRA","BE",17.1,17.7,17.1,17.45,17.5,17.1,150988,2626933,"2019-03-28",221,"INE619I01012"]
["AARTIDRUGS","EQ",650,655,646.55,648.15,647.05,662.3,19709,12820100.9,"2019-03-28",1382,"INE767A01016"]
["AARTIIND","EQ",1585.1,1585.1,1537.55,1555.25,1558,1590.5,118734,184472134.2,"2019-03-28",8123,"INE769A01020"]
["AARVEEDEN","EQ",23.05,25.35,22.25,23.85,23.8,23.1,40748,993463.45,"2019-03-28",382,"INE273D01019"]
["AAVAS","EQ",1144,1159.85,1075.4,1096.8,1101,1143.4,46575,53037911.05,"2019-03-28",1950,"INE216P01012"]
["ABAN","BE",58.9,59.45,57.25,58,57.75,57.6,71729,4163260.15,"2019-03-28",591,"INE421A01028"]
["ABB","EQ",1321.1,1331.7,1308.45,1314.9,1312.3,1326.45,154138,203785662.3,"2019-03-28",4483,"INE117A01022"]
["ABBOTINDIA","EQ",7259.95,7331,7242.1,7274.9,7265,7227.35,26845,195054934.5,"2019-03-28",1161,"INE358A01014"]
["ABCAPITAL","EQ",101.5,101.8,97.6,98.55,98.2,100.9,5154877,513030122,"2019-03-28",27576,"INE674K01013"]
["ABFRL","EQ",223.5,225.7,220.3,221.65,222,223.5,1125372,251891210.4,"2019-03-28",5780,"INE647O01011"]
["ABSLNN50ET","EQ",331.7,331.7,315.7,327.02,327.02,320,129,42553.14,"2019-03-28",6,"INF209KB1B87"]
["ACC","EQ",1604,1629.4,1587,1617.8,1629,1602.55,942173,1514523342.95,"2019-03-28",36378,"INE012A01025"]
{"$rows_left_out":1622}
{"sheet":"Sheet1","index":7,"n_rows":0,"n_cols":0,"rows_kept":0,"hidden":true}

{"sheet":"Sheet3","index":8,"n_rows":0,"n_cols":0,"rows_kept":0,"hidden":true}

{"sheet":"Sheet4","index":9,"n_rows":0,"n_cols":0,"rows_kept":0,"hidden":true}