{"text_format":"3","workbook":"xlsx","n_sheets":8,"sheets":["Main","Future Intra","Cash Intra","MidCap Intra","Bulk Deals","Call Tracker (Equity & F&O)","Sheet2","Sheet1"],"not_rendered":{"images":4,"defined_names":4},"read":"whole","date_system":"1900"}

{"sheet":"Main","index":0,"n_rows":17,"n_cols":4,"rows_kept":17}
[null,"                                                                                                 "]
{"$rows_empty":8}
[null,"2018-12-28"]
[]
[null,"Sheet No.","Template Name","Summary"]
[null,1,"Future Intra","For Intraday trading in F&O segment"]
[null,2,"Cash Intra","For Intraday trading in cash market segment"]
[null,3,"Mid-cap Intra","For Intraday trading in Mid-cap stocks"]
[null,4,"Bulk Deals","Reveals Bulk Deals carried on NSE & BSE"]
[null,5,"Call Tracker"]

{"sheet":"Future Intra","index":1,"n_rows":240,"n_cols":15,"rows_kept":240,"merged":[[8,0,9,0],[8,1,9,1],[8,2,9,2],[8,5,8,7],[8,8,8,10]]}
[]
[]
[]
[]
[{"$nulls":12},"Back to Main Page"]
["FOR INTRA DAY TRADING",{"$nulls":10},{"$f":"Main!B10","v":"2018-12-28"}]
[]
[]
["Sr.no","Sector","Scrip","CLOSE RATE","Pivot Point","Supports",null,null,"Resistances"]
[null,"Sector",null,"Point","Point","S1","S2","S3","R1","R2","R3","HIGH","LOW","OI","% Change in OI"]
[1,"Index","BANKNIFTY",{"v":27030.5,"d":"27030.50"},{"v":27133.38333333333,"d":"27133.38"},{"v":26898.11666666666,"d":"26898.12"},{"v":26765.73333333333,"d":"26765.73"},{"v":26530.46666666666,"d":"26530.47"},{"v":27265.766666666663,"d":"27265.77"},{"v":27501.033333333333,"d":"27501.03"},{"v":27633.416666666664,"d":"27633.42"},27368.65,27001,1148960,{"v":-0.3646749167800228,"d":"-36.47%"}]
[2,"Index","NIFTY",10809.85,{"v":10829.933333333332,"d":"10829.93"},{"v":10779.966666666665,"d":"10779.97"},{"v":10750.083333333332,"d":"10750.08"},{"v":10700.116666666665,"d":"10700.12"},{"v":10859.816666666666,"d":"10859.82"},{"v":10909.783333333333,"d":"10909.78"},{"v":10939.666666666666,"d":"10939.67"},10879.9,10800.05,22331850,{"v":-0.22774393169575355,"d":"-22.77%"}]
[3,"Index","NIFTYIT",{"v":14400,"d":"14400.00"},{"v":14414.333333333334,"d":"14414.33"},{"v":14320.666666666668,"d":"14320.67"},{"v":14241.333333333334,"d":"14241.33"},{"v":14147.666666666668,"d":"14147.67"},{"v":14493.666666666668,"d":"14493.67"},{"v":14587.333333333336,"d":"14587.33"},{"v":14666.666666666668,"d":"14666.67"},14508,14335,16250,{"v":-0.2888402625820569,"d":"-28.88%"}]
[4,"Cement","ACC",{"v":1467.4,"d":"1467.40"},{"v":1478.8333333333333,"d":"1478.83"},{"v":1453.1666666666665,"d":"1453.17"},{"v":1438.9333333333332,"d":"1438.93"},{"v":1413.2666666666664,"d":"1413.27"},{"v":1493.0666666666666,"d":"1493.07"},{"v":1518.7333333333331,"d":"1518.73"},{"v":1532.9666666666667,"d":"1532.97"},1504.5,1464.6,1275200,{"v":-0.14668094218415417,"d":"-14.67%"}]
[5,"Others","ADANIENT",163.15,164.35,{"v":159.79999999999998,"d":"159.80"},156.45,{"v":151.89999999999998,"d":"151.90"},{"v":167.7,"d":"167.70"},172.25,{"v":175.6,"d":"175.60"},168.9,161,34460000,{"v":-0.10937661532099659,"d":"-10.94%"}]
[6,"Others","ADANIPORTS",{"v":386.5,"d":"386.50"},{"v":383.43333333333334,"d":"383.43"},{"v":378.8666666666667,"d":"378.87"},{"v":371.23333333333335,"d":"371.23"},{"v":366.6666666666667,"d":"366.67"},{"v":391.06666666666666,"d":"391.07"},{"v":395.6333333333334,"d":"395.63"},{"v":403.26666666666665,"d":"403.27"},388,375.8,22692500,{"v":-0.09510517396072177,"d":"-9.51%"}]
[7,"Power","ADANIPOWER",{"v":52,"d":"52.00"},{"v":51.96666666666667,"d":"51.97"},{"v":51.53333333333334,"d":"51.53"},{"v":51.06666666666667,"d":"51.07"},{"v":50.63333333333334,"d":"50.63"},{"v":52.43333333333334,"d":"52.43"},{"v":52.866666666666674,"d":"52.87"},{"v":53.333333333333336,"d":"53.33"},52.4,51.5,161260000,{"v":-0.014905314599877826,"d":"-1.49%"}]
[8,"Pharma","AJANTPHARM",{"v":1185.4,"d":"1185.40"},{"v":1169.1333333333334,"d":"1169.13"},{"v":1148.2666666666669,"d":"1148.27"},{"v":1111.1333333333334,"d":"1111.13"},{"v":1090.2666666666669,"d":"1090.27"},{"v":1206.2666666666669,"d":"1206.27"},{"v":1227.1333333333332,"d":"1227.13"},{"v":1264.2666666666669,"d":"1264.27"},1190,1132,583500,{"v":0.05515370705244123,"d":"5.52%"}]
[9,"Banking","ALBK",{"v":46.8,"d":"46.80"},{"v":46.5,"d":"46.50"},{"v":46.1,"d":"46.10"},{"v":45.4,"d":"45.40"},{"v":45,"d":"45.00"},{"v":47.2,"d":"47.20"},{"v":47.60000000000001,"d":"47.60"},{"v":48.300000000000004,"d":"48.30"},46.9,45.8,18655000,{"v":-0.06143087140269672,"d":"-6.14%"}]
[10,"Automobile","AMARAJABAT",{"v":739.7,"d":"739.70"},{"v":739.6333333333333,"d":"739.63"},{"v":735.0666666666666,"d":"735.07"},{"v":730.4333333333333,"d":"730.43"},{"v":725.8666666666666,"d":"725.87"},{"v":744.2666666666667,"d":"744.27"},{"v":748.8333333333335,"d":"748.83"},{"v":753.4666666666667,"d":"753.47"},744.2,735,977200,{"v":-0.17542823390431186,"d":"-17.54%"}]
{"$rows_left_out":211}
{"sheet":"Cash Intra","index":2,"n_rows":247,"n_cols":13,"rows_kept":247,"merged":[[7,0,8,0],[7,1,8,1],[7,2,8,2],[7,3,8,3],[7,4,7,6],[7,7,7,9]]}
[]
[]
[]
[]
[{"$nulls":12},"Back to Main Page"]
["FOR INTRA DAY TRADING",{"$nulls":9},{"$f":"Main!B10","v":"2018-12-28"}]
[]
["Sr.no","Scrip","CLOSE RATE","Pivot Point","Supports",null,null,"Resistances"]
[null,null,"Point",null,"S1","S2","S3","R1","R2","R3","HIGH","LOW","Total Trade Quanity in Lakhs"]
[1,"Nifty 50",10779.8,{"v":10792.816666666668,"d":"10792.82"},{"v":10751.433333333334,"d":"10751.43"},{"v":10723.066666666668,"d":"10723.07"},{"v":10681.683333333334,"d":"10681.68"},{"v":10821.183333333334,"d":"10821.18"},{"v":10862.56666666667,"d":"10862.57"},{"v":10890.933333333334,"d":"10890.93"},10834.2,10764.45]
[2,"Nifty Bank",26878.55,{"v":26987.86666666667,"d":"26987.87"},{"v":26735.783333333336,"d":"26735.78"},{"v":26593.016666666666,"d":"26593.02"},{"v":26340.933333333334,"d":"26340.93"},{"v":27130.63333333334,"d":"27130.63"},{"v":27382.716666666667,"d":"27382.72"},{"v":27525.48333333334,"d":"27525.48"},27239.95,26845.1]
[3,"Nifty CPSE",2049.25,{"v":2044.3333333333333,"d":"2044.33"},{"v":2032.3166666666666,"d":"2032.32"},{"v":2015.3833333333334,"d":"2015.38"},{"v":2003.3666666666668,"d":"2003.37"},{"v":2061.2666666666664,"d":"2061.27"},{"v":2073.2833333333333,"d":"2073.28"},{"v":2090.2166666666662,"d":"2090.22"},2056.35,2027.4]
[4,"Nifty Infra",3154.1,{"v":3147.7833333333333,"d":"3147.78"},{"v":3134.7166666666667,"d":"3134.72"},{"v":3115.3333333333335,"d":"3115.33"},{"v":3102.266666666667,"d":"3102.27"},{"v":3167.1666666666665,"d":"3167.17"},{"v":3180.233333333333,"d":"3180.23"},{"v":3199.6166666666663,"d":"3199.62"},3160.85,3128.4]
[5,"Nifty IT",14354.5,{"v":14363.016666666668,"d":"14363.02"},{"v":14265.333333333336,"d":"14265.33"},{"v":14176.166666666668,"d":"14176.17"},{"v":14078.483333333335,"d":"14078.48"},{"v":14452.183333333336,"d":"14452.18"},{"v":14549.866666666667,"d":"14549.87"},{"v":14639.033333333336,"d":"14639.03"},14460.7,14273.85]
[6,"Nifty PSE",3356.5,{"v":3349.6999999999994,"d":"3349.70"},{"v":3332.7499999999986,"d":"3332.75"},{"v":3308.999999999999,"d":"3309.00"},{"v":3292.0499999999984,"d":"3292.05"},{"v":3373.449999999999,"d":"3373.45"},{"v":3390.3999999999996,"d":"3390.40"},{"v":3414.149999999999,"d":"3414.15"},3366.65,3325.95]
[7,"Nifty Midcap 50",4853.9,{"v":4847.666666666667,"d":"4847.67"},{"v":4826.283333333334,"d":"4826.28"},{"v":4798.666666666667,"d":"4798.67"},{"v":4777.283333333334,"d":"4777.28"},{"v":4875.283333333334,"d":"4875.28"},{"v":4896.666666666667,"d":"4896.67"},{"v":4924.283333333334,"d":"4924.28"},4869.05,4820.05]
[8,"ABB",1309,{"v":1311.4833333333333,"d":"1311.48"},{"v":1299.9666666666667,"d":"1299.97"},{"v":1290.9333333333334,"d":"1290.93"},{"v":1279.4166666666667,"d":"1279.42"},{"v":1320.5166666666667,"d":"1320.52"},{"v":1332.0333333333335,"d":"1332.03"},{"v":1341.0666666666666,"d":"1341.07"},1323,1302.45,0.72902]
[9,"ACC",1459.2,{"v":1470.6833333333332,"d":"1470.68"},{"v":1442.3666666666663,"d":"1442.37"},{"v":1425.533333333333,"d":"1425.53"},{"v":1397.2166666666662,"d":"1397.22"},{"v":1487.5166666666664,"d":"1487.52"},{"v":1515.8333333333335,"d":"1515.83"},{"v":1532.6666666666665,"d":"1532.67"},1499,1453.85,5.54317]
[10,"AIAENG",1690.45,{"v":1675.4833333333333,"d":"1675.48"},{"v":1635.9666666666667,"d":"1635.97"},{"v":1581.4833333333333,"d":"1581.48"},{"v":1541.9666666666667,"d":"1541.97"},{"v":1729.9666666666667,"d":"1729.97"},{"v":1769.4833333333336,"d":"1769.48"},{"v":1823.9666666666667,"d":"1823.97"},1715,1621,0.32339]
[11,"AUBANK",595.45,{"v":596.6166666666667,"d":"596.62"},{"v":584.8333333333334,"d":"584.83"},{"v":574.2166666666667,"d":"574.22"},{"v":562.4333333333334,"d":"562.43"},{"v":607.2333333333333,"d":"607.23"},{"v":619.0166666666667,"d":"619.02"},{"v":629.6333333333333,"d":"629.63"},608.4,586,0.89749]
{"$rows_left_out":228}
{"sheet":"MidCap Intra","index":3,"n_rows":510,"n_cols":13,"rows_kept":510,"merged":[[0,0,0,1],[8,0,9,0],[8,1,9,1],[8,2,9,2],[8,3,9,3],[8,4,8,6],[8,7,8,9]]}
[]
[]
[]
[]
[{"$nulls":11},"Back To Main Page"]
["FOR INTRA DAY TRADING",{"$nulls":9},{"$f":"Main!B10","v":"2018-12-28"}]
[null,null," "]
[]
["Sr.no","Scrip","CLOSE RATE","Pivot Point","Supports",null,null,"Resistances"]
[null,null,"Point",null,"S1","S2","S3","R1","R2","R3","HIGH","LOW","Total Trade Quanity in Lakhs"]
[1,"3MINDIA",20258.7,{"v":20468.7,"d":"20468.70"},{"v":19940,"d":"19940.00"},{"v":19621.3,"d":"19621.30"},{"v":19092.6,"d":"19092.60"},{"v":20787.4,"d":"20787.40"},{"v":21316.100000000006,"d":"21316.10"},{"v":21634.800000000003,"d":"21634.80"},20997.4,20150,0.02164]
[2,"8KMILES",144.75,{"v":145.88333333333333,"d":"145.88"},{"v":141.76666666666665,"d":"141.77"},{"v":138.78333333333333,"d":"138.78"},{"v":134.66666666666666,"d":"134.67"},{"v":148.86666666666665,"d":"148.87"},{"v":152.98333333333332,"d":"152.98"},{"v":155.96666666666664,"d":"155.97"},150,142.9,2.6867]
[3,"AARTIIND",1423.25,{"v":1431.9666666666665,"d":"1431.97"},{"v":1406.733333333333,"d":"1406.73"},{"v":1390.2166666666665,"d":"1390.22"},{"v":1364.983333333333,"d":"1364.98"},{"v":1448.483333333333,"d":"1448.48"},{"v":1473.7166666666665,"d":"1473.72"},{"v":1490.233333333333,"d":"1490.23"},1457.2,1415.45,0.5363]
[4,"ABAN",74.6,{"v":75.08333333333333,"d":"75.08"},{"v":73.16666666666666,"d":"73.17"},{"v":71.73333333333333,"d":"71.73"},{"v":69.81666666666666,"d":"69.82"},{"v":76.51666666666665,"d":"76.52"},{"v":78.43333333333331,"d":"78.43"},{"v":79.86666666666665,"d":"79.87"},77,73.65,8.84427]
[5,"ABB",1309,{"v":1311.4833333333333,"d":"1311.48"},{"v":1299.9666666666667,"d":"1299.97"},{"v":1290.9333333333334,"d":"1290.93"},{"v":1279.4166666666667,"d":"1279.42"},{"v":1320.5166666666667,"d":"1320.52"},{"v":1332.0333333333335,"d":"1332.03"},{"v":1341.0666666666666,"d":"1341.07"},1323,1302.45,0.72902]
[6,"ABCAPITAL",98.15,{"v":98.10000000000001,"d":"98.10"},{"v":97.80000000000001,"d":"97.80"},97.45,97.15,{"v":98.45000000000002,"d":"98.45"},98.75,{"v":99.10000000000002,"d":"99.10"},98.4,97.75,8.68657]
[7,"ABFRL",204.9,{"v":207.38333333333333,"d":"207.38"},{"v":201.51666666666665,"d":"201.52"},{"v":198.13333333333333,"d":"198.13"},{"v":192.26666666666665,"d":"192.27"},{"v":210.76666666666665,"d":"210.77"},{"v":216.63333333333333,"d":"216.63"},{"v":220.01666666666665,"d":"220.02"},213.25,204,16.52016]
[8,"ACC",1459.2,{"v":1470.6833333333332,"d":"1470.68"},{"v":1442.3666666666663,"d":"1442.37"},{"v":1425.533333333333,"d":"1425.53"},{"v":1397.2166666666662,"d":"1397.22"},{"v":1487.5166666666664,"d":"1487.52"},{"v":1515.8333333333335,"d":"1515.83"},{"v":1532.6666666666665,"d":"1532.67"},1499,1453.85,5.54317]
[9,"ADANIPORTS",384,{"v":381.1499999999999,"d":"381.15"},{"v":376.49999999999983,"d":"376.50"},{"v":368.9999999999999,"d":"369.00"},{"v":364.3499999999998,"d":"364.35"},{"v":388.64999999999986,"d":"388.65"},{"v":393.29999999999995,"d":"393.30"},{"v":400.7999999999999,"d":"400.80"},385.8,373.65,50.43675]
[10,"ADANIPOWER",51.35,{"v":51.449999999999996,"d":"51.45"},{"v":50.89999999999999,"d":"50.90"},{"v":50.449999999999996,"d":"50.45"},{"v":49.89999999999999,"d":"49.90"},{"v":51.89999999999999,"d":"51.90"},{"v":52.44999999999999,"d":"52.45"},{"v":52.89999999999999,"d":"52.90"},52,51,105.25643]
{"$rows_left_out":491}
{"sheet":"Bulk Deals","index":4,"n_rows":72,"n_cols":8,"rows_kept":72,"merged":[[4,0,4,1],[4,2,4,3],[6,1,6,2]]}
[" "]
[]
[]
[]
[]
[{"$nulls":4},"Back To Main Page"]
["Subject :","BULK DEAL",null,{"$f":"Main!B10","v":"2018-12-28"}]
[]
["Date","Scrip code","Scrip Name","Client Name","Buy / Sell","Quantity Traded","Trade Price / Wt.Avg.trade price","Exchange  "]
["2018-12-27",541702,"ASHNI","ARPIT GIRISH MACHHI","BUY",{"v":16000,"d":"16,000"},8.6,"BSE"]
["2018-12-27",542057,"BCPL","SHERWOOD SECURITIES PVT LTD","SELL",{"v":92000,"d":"92,000"},32,"BSE"]
["2018-12-27",506197,"BLISSGVS","VIBHA GAGAN SHARMA","SELL",{"v":550000,"d":"550,000"},139.99,"BSE"]
["2018-12-27",506197,"BLISSGVS","ARIAN INVESTMENT LTD","BUY",{"v":9510281,"d":"9,510,281"},139.99,"BSE"]
["2018-12-27",506197,"BLISSGVS","NARSIMHA SHIBROOR KAMATH","SELL",{"v":4000000,"d":"4,000,000"},140,"BSE"]
["2018-12-27",506197,"BLISSGVS","SHRUTI VISHAL RAO","SELL",{"v":2500000,"d":"2,500,000"},140,"BSE"]
["2018-12-27",506197,"BLISSGVS","VIBHA GAGAN SHARMA","SELL",{"v":2500000,"d":"2,500,000"},140.01,"BSE"]
["2018-12-27",538521,"CROWNTOURS","JAY BHAVSAR","BUY",{"v":15554,"d":"15,554"},23.01,"BSE"]
["2018-12-27",532326,"INTENTECH","UTSAV PRAMODKUMAR SHRIVASTAV","BUY",{"v":232863,"d":"232,863"},41.3,"BSE"]
["2018-12-27",532326,"INTENTECH","SASMEETA SRIVASTAVA","SELL",{"v":230349,"d":"230,349"},41.3,"BSE"]
["2018-12-27",505737,"INTLCOMBQ","UTSAV PRAMODKUMAR SHRIVASTAV","BUY",{"v":24000,"d":"24,000"},278.1,"BSE"]
{"$rows_left_out":53}
{"sheet":"Call Tracker (Equity & F&O)","index":5,"n_rows":334,"n_cols":18,"rows_kept":334,"merged":[[38,0,39,0],[38,1,39,1],[38,2,39,2],[38,9,39,9],[38,11,39,11],[38,12,39,12],[38,13,39,13],[38,14,39,14],[40,0,41,0],[40,1,41,1],[40,2,41,2],[40,9,41,9],[40,11,41,11],[40,12,41,12],[40,13,41,13],[40,14,41,14],[42,0,43,0],[42,1,43,1],[42,2,43,2],[42,9,43,9],[42,11,43,11],[42,12,43,12],[42,13,43,13],[42,14,43,14],[44,0,45,0],[44,1,45,1],[44,2,45,2],[44,9,45,9],[44,11,45,11],[44,12,45,12],[44,13,45,13],[44,14,45,14],[46,0,47,0],[46,1,47,1],[46,2,47,2],[46,9,47,9],[46,11,47,11],[46,12,47,12],[46,13,47,13],[46,14,47,14],[48,0,49,0],[48,1,49,1],[48,2,49,2],[48,9,49,9],[48,11,49,11],[48,12,49,12],[48,13,49,13],[48,14,49,14],[50,0,51,0],[50,1,51,1],[50,2,51,2],[50,9,51,9],[50,11,51,11],[50,12,51,12],[50,13,51,13],[50,14,51,14],[52,0,53,0],[52,1,53,1],[52,2,53,2],[52,9,53,9],[52,11,53,11],[52,12,53,12],[52,13,53,13],[52,14,53,14],[58,0,59,0],[58,1,59,1],[58,2,59,2],[58,9,59,9],[58,11,59,11],[58,12,59,12],[58,13,59,13],[58,14,59,14],[60,0,61,0],[60,1,61,1],[60,2,61,2],[60,9,61,9],[60,11,61,11],[60,12,61,12],[60,13,61,13],[60,14,61,14]]}
[]
[]
[]
[]
[{"$nulls":12},"Back To Main Page"]
["Retail Research Technical Calls & Fundamental Performance Report for the month of December -2018 "]
[{"$nulls":12},{"$f":"Main!B10","v":"2018-12-28"}]
[null,"Positional  Call"]
["Sr.no","Date",null,"Company","Rec","Rec Price","Stop Loss***","Call Closed At","Target","Remark","Profit / Loss per Share","Gain / Loss  %","Status","Closed Date","NSE Closed Price"]
[1,"2018-11-14",null,"ASHOKLEY","Buy",108,100.7,111.25,"122-125","Part Profit of Rs.3.25/-",{"$f":"H10-F10","v":3.25},{"$f":"K10/F10","v":{"v":0.03009259259259259,"d":"3.01%"}},"Successful","2018-11-30",{"$nulls":3},"R"]
[2,"2018-11-21",null,"ADANIPORTS","Sell",359.5,377.7,349,"322-326","Profit of Rs.10.5/-",{"$f":"F11-H11","v":10.5},{"v":0.02920723226703755,"d":"2.92%"},"Successful","2018-12-11",{"$nulls":3},"R"]
[3,"2018-11-29",null,"JSWSTEEL","Buy{}",312,297.7,{"$f":"(322+296)/2","v":309},"344-350","Loss of Rs.3/-",{"$f":"H12-F12","v":-3},{"$f":"K12/F12","v":{"v":-0.009615384615384616,"d":"-0.96%"}},"Unsuccessful","2018-12-07",{"$nulls":3},"R"]
[4,"2018-11-30",null,"RAYMOND","Sell",820,861.6,789,"745-735","Profit of Rs.31/-",{"$f":"F13-H13","v":31},{"v":0.03780487804878049,"d":"3.78%"},"Successful","2018-12-07",{"$nulls":3},"R"]
[5,"2018-11-30",null,"INFY","Buy",665,628,685,725,"Profit of Rs.20/-",20,{"$f":"K14/F14","v":{"v":0.03007518796992481,"d":"3.01%"}},"Successful","2018-12-07",{"$nulls":3},"H"]
[6,"2018-12-13",null,"JSWSTEEL","Buy",301.5,289,310.75,"325-330","Profit of Rs.9.25/-",{"$f":"H15-F15","v":9.25},{"$f":"K15/F15","v":{"v":0.03067993366500829,"d":"3.07%"}},"Successful","2018-12-19",{"$nulls":3},"H"]
[7,"2018-12-17",null,"COALINDIA","Buy",245.5,233,253.4,"260-265","Profit of Rs.7.9/-",{"$f":"H16-F16","v":7.900000000000006},{"$f":"K16/F16","v":{"v":0.03217922606924646,"d":"3.22%"}},"Successful","2018-12-20",{"$nulls":3},"H"]
[8,"2018-12-21",null,"TATAGLOBAL","Buy",217,209,223.5,"235-240","Part Profit of Rs.6.25/-",6.5,{"v":0.029953917050691243,"d":"3.00%"},"Successful","2018-12-24",{"$nulls":3},"H"]
[9,"2018-12-24",null,"JSWSTEEL","Buy","299-300",289,null,"320-325","Open",{"$nulls":4},{"$f":"VLOOKUP(D18,Sheet2!A2:M1497,6,0)","v":292.95},null,null,"H"]
[10,"2018-12-24",null,"TATAPOWER","Buy","77.2-77.4",73.7,null,"83-84","Open",{"$nulls":4},{"$f":"VLOOKUP(D19,Sheet2!A3:M1498,6,0)","v":77},null,null,"R"]
[11,"2018-12-26",null,"CONCOR","Buy",640.5,608.8,669,"700-710","Profit of Rs.28.5/-",{"$f":"H20-F20","v":28.5},{"$f":"K20/F20","v":{"v":0.04449648711943794,"d":"4.45%"}},"Successful","2018-12-27",{"$nulls":3},"R"]
{"$rows_left_out":277}
{"sheet":"Sheet2","index":6,"n_rows":1633,"n_cols":14,"rows_kept":1633,"hidden":true}
["SYMBOL","SERIES","OPEN","HIGH","LOW","CLOSE","LAST","PREVCLOSE","TOTTRDQTY","TOTTRDVAL","TIMESTAMP","TOTALTRADES","ISIN","ISIN"]
["20MICRONS","EQ",42.55,42.55,41.75,41.9,42.1,41.8,8160,342896.9,"2018-12-27",156,"INE144J01027"]
["3IINFOTECH","EQ",3.6,3.65,3.5,3.55,3.55,3.5,4406193,15754334,"2018-12-27",767,"INE748C01020"]
["3MINDIA","EQ",20930,20997.4,20150,20258.7,20287,20597.55,2164,44662635.15,"2018-12-27",1115,"INE470A01017"]
["3PLAND","EQ",12.4,12.4,11.85,11.85,11.85,12.4,1974,23446.9,"2018-12-27",9,"INE105C01023"]
["5PAISA","EQ",193,208,193,203.05,208,193.2,9079,1806183.3,"2018-12-27",333,"INE618L01018"]
["63MOONS","EQ",95.6,99.4,94.35,97.55,99.05,94.65,397226,38553009.6,"2018-12-27",4332,"INE111B01023"]
["8KMILES","EQ",149,150,142.9,144.75,144,145.4,268670,39311678.35,"2018-12-27",4232,"INE650K01021"]
["A2ZINFRA","EQ",13,13.1,12.9,13,13,12.95,102888,1335246.2,"2018-12-27",235,"INE619I01012"]
["AARTIDRUGS","EQ",574.95,575.95,563,567.6,569,574.4,10646,6029144,"2018-12-27",2224,"INE767A01016"]
["AARTIIND","EQ",1435,1457.2,1415.45,1423.25,1427,1427.25,53630,76633526.95,"2018-12-27",6856,"INE769A01020"]
["AARVEEDEN","EQ",24.4,27.4,24.4,25.2,25.55,23.75,34985,911203.15,"2018-12-27",330,"INE273D01019"]
["AAVAS","EQ",819.75,836,792.1,807.3,818,800.35,18326,15018170,"2018-12-27",2341,"INE216P01012"]
["ABAN","EQ",74.4,77,73.65,74.6,74.6,73.2,884427,66434639.35,"2018-12-27",7691,"INE421A01028"]
["ABB","EQ",1310,1323,1302.45,1309,1306.5,1295.3,72902,95770167.3,"2018-12-27",5890,"INE117A01022"]
["ABBOTINDIA","EQ",7507,7545.15,7460,7469.5,7465,7498.3,1743,13075444.85,"2018-12-27",465,"INE358A01014"]
["ABCAPITAL","EQ",97.8,98.4,97.75,98.15,98.15,97.1,868657,85151215.5,"2018-12-27",11959,"INE674K01013"]
["ABFRL","EQ",207.75,213.25,204,204.9,205,205.9,1652016,344211107.05,"2018-12-27",15463,"INE647O01011"]
["ABSLNN50ET","EQ",283,329,283,309.92,309.92,283.42,89,26303.66,"2018-12-27",27,"INF209KB1B87"]
["ACC","EQ",1499,1499,1453.85,1459.2,1457.9,1479.4,554317,816848252.4,"2018-12-27",20641,"INE012A01025"]
{"$rows_left_out":1614}
{"sheet":"Sheet1","index":7,"n_rows":0,"n_cols":0,"rows_kept":0,"hidden":true}