{"text_format":"3","workbook":"xlsx","n_sheets":10,"sheets":["Main","Future Intra","Cash Intra","MidCap Intra","Bulk Deals","Call Tracker (Equity & F&O)","Sheet2","Sheet1","Sheet3","Sheet4"],"not_rendered":{"images":4,"defined_names":4},"read":"whole","date_system":"1900"}

{"sheet":"Main","index":0,"n_rows":17,"n_cols":4,"rows_kept":17}
[null,"                                                                                                 "]
{"$rows_empty":8}
[null,"2019-03-28"]
[]
[null,"Sheet No.","Template Name","Summary"]
[null,1,"Future Intra","For Intraday trading in F&O segment"]
[null,2,"Cash Intra","For Intraday trading in cash market segment"]
[null,3,"Mid-cap Intra","For Intraday trading in Mid-cap stocks"]
[null,4,"Bulk Deals","Reveals Bulk Deals carried on NSE & BSE"]
[null,5,"Call Tracker"]

{"sheet":"Future Intra","index":1,"n_rows":237,"n_cols":15,"rows_kept":237,"merged":[[8,0,9,0],[8,1,9,1],[8,2,9,2],[8,5,8,7],[8,8,8,10]]}
[]
[]
[]
[]
[{"$nulls":12},"Back to Main Page"]
["FOR INTRA DAY TRADING",{"$nulls":10},{"$f":"Main!B10","v":"2019-03-28"}]
[]
[]
["Sr.no","Sector","Scrip","CLOSE RATE","Pivot Point","Supports",null,null,"Resistances"]
[null,"Sector",null,"Point","Point","S1","S2","S3","R1","R2","R3","HIGH","LOW","OI","% Change in OI"]
[1,"Index","BANKNIFTY",{"v":30040.9,"d":"30040.90"},{"v":30032.149999999998,"d":"30032.15"},{"v":29789.299999999996,"d":"29789.30"},{"v":29537.699999999997,"d":"29537.70"},{"v":29294.849999999995,"d":"29294.85"},{"v":30283.749999999996,"d":"30283.75"},{"v":30526.599999999995,"d":"30526.60"},{"v":30778.199999999997,"d":"30778.20"},30275,29780.55,2727340,{"v":-0.06513423094852881,"d":"-6.51%"}]
[2,"Index","NIFTY",{"v":11458.1,"d":"11458.10"},{"v":11484.283333333335,"d":"11484.28"},{"v":11394.866666666669,"d":"11394.87"},{"v":11331.633333333333,"d":"11331.63"},{"v":11242.216666666667,"d":"11242.22"},{"v":11547.51666666667,"d":"11547.52"},{"v":11636.933333333338,"d":"11636.93"},{"v":11700.166666666672,"d":"11700.17"},11573.7,11421.05,25845225,{"v":0.033670488154587286,"d":"3.37%"}]
[3,"Index","NIFTYIT",{"v":15358,"d":"15358.00"},{"v":15386,"d":"15386.00"},{"v":15282,"d":"15282.00"},{"v":15206,"d":"15206.00"},{"v":15102,"d":"15102.00"},{"v":15462,"d":"15462.00"},{"v":15566,"d":"15566.00"},{"v":15642,"d":"15642.00"},15490,15310,19800,{"v":-0.03178484107579462,"d":"-3.18%"}]
[4,"Cement","ACC",1603.45,{"v":1597.2833333333335,"d":"1597.28"},{"v":1578.566666666667,"d":"1578.57"},{"v":1553.6833333333336,"d":"1553.68"},{"v":1534.9666666666672,"d":"1534.97"},{"v":1622.166666666667,"d":"1622.17"},{"v":1640.8833333333337,"d":"1640.88"},{"v":1665.7666666666669,"d":"1665.77"},1616,1572.4,2552800,{"v":-0.02281427040269484,"d":"-2.28%"}]
[5,"Others","ADANIENT",137.95,{"v":138.51666666666665,"d":"138.52"},{"v":135.58333333333331,"d":"135.58"},{"v":133.21666666666667,"d":"133.22"},{"v":130.28333333333333,"d":"130.28"},{"v":140.8833333333333,"d":"140.88"},{"v":143.81666666666663,"d":"143.82"},{"v":146.18333333333328,"d":"146.18"},141.45,136.15,40536000,{"v":-0.014681575109382596,"d":"-1.47%"}]
[6,"Others","ADANIPORTS",366.75,367.95,{"v":363.9,"d":"363.90"},361.05,{"v":357,"d":"357.00"},{"v":370.79999999999995,"d":"370.80"},374.85,{"v":377.69999999999993,"d":"377.70"},372,365.1,24952500,{"v":-0.02965195411238577,"d":"-2.97%"}]
[7,"Power","ADANIPOWER",46.95,{"v":47.38333333333333,"d":"47.38"},{"v":46.06666666666666,"d":"46.07"},{"v":45.18333333333333,"d":"45.18"},{"v":43.86666666666666,"d":"43.87"},{"v":48.266666666666666,"d":"48.27"},{"v":49.58333333333334,"d":"49.58"},{"v":50.46666666666667,"d":"50.47"},48.7,46.5,175700000,{"v":0.011863625892651462,"d":"1.19%"}]
[8,"Pharma","AJANTPHARM",{"v":996.7,"d":"996.70"},{"v":998.1333333333333,"d":"998.13"},{"v":973.5666666666666,"d":"973.57"},{"v":950.4333333333333,"d":"950.43"},{"v":925.8666666666666,"d":"925.87"},{"v":1021.2666666666667,"d":"1021.27"},{"v":1045.8333333333335,"d":"1045.83"},{"v":1068.9666666666667,"d":"1068.97"},1022.7,975,885000,{"v":1.697792869269949E-3,"d":"0.17%"}]
[9,"Banking","ALBK",{"v":52.4,"d":"52.40"},{"v":52,"d":"52.00"},51.35,{"v":50.300000000000004,"d":"50.30"},{"v":49.650000000000006,"d":"49.65"},53.05,{"v":53.7,"d":"53.70"},{"v":54.74999999999999,"d":"54.75"},52.65,50.95,25558000,{"v":-2.5367833587011668E-3,"d":"-0.25%"}]
[10,"Automobile","AMARAJABAT",724.85,{"v":721.6166666666667,"d":"721.62"},{"v":711.2333333333333,"d":"711.23"},{"v":697.6166666666667,"d":"697.62"},{"v":687.2333333333333,"d":"687.23"},{"v":735.2333333333333,"d":"735.23"},{"v":745.6166666666668,"d":"745.62"},{"v":759.2333333333333,"d":"759.23"},732,708,1665300,{"v":0.50856055802156,"d":"50.86%"}]
{"$rows_left_out":208}
{"sheet":"Cash Intra","index":2,"n_rows":247,"n_cols":13,"rows_kept":247,"merged":[[7,0,8,0],[7,1,8,1],[7,2,8,2],[7,3,8,3],[7,4,7,6],[7,7,7,9]]}
[]
[]
[]
[]
[{"$nulls":12},"Back to Main Page"]
["FOR INTRA DAY TRADING",{"$nulls":9},{"$f":"Main!B10","v":"2019-03-28"}]
[]
["Sr.no","Scrip","CLOSE RATE","Pivot Point","Supports",null,null,"Resistances"]
[null,null,"Point",null,"S1","S2","S3","R1","R2","R3","HIGH","LOW","Total Trade Quanity in Lakhs"]
[1,"Nifty 50",11445.05,{"v":11468.083333333334,"d":"11468.08"},{"v":11389.966666666667,"d":"11389.97"},{"v":11334.883333333333,"d":"11334.88"},{"v":11256.766666666666,"d":"11256.77"},{"v":11523.166666666668,"d":"11523.17"},{"v":11601.283333333333,"d":"11601.28"},{"v":11656.366666666669,"d":"11656.37"},11546.2,11413]
[2,"Nifty Bank",30019.8,{"v":30024.2,"d":"30024.20"},{"v":29785.850000000002,"d":"29785.85"},{"v":29551.9,"d":"29551.90"},{"v":29313.550000000003,"d":"29313.55"},30258.15,{"v":30496.5,"d":"30496.50"},30730.45,30262.55,29790.25]
[3,"Nifty CPSE",2255.95,{"v":2261.9333333333334,"d":"2261.93"},{"v":2244.0666666666666,"d":"2244.07"},{"v":2232.1833333333334,"d":"2232.18"},{"v":2214.3166666666666,"d":"2214.32"},{"v":2273.8166666666666,"d":"2273.82"},{"v":2291.6833333333334,"d":"2291.68"},{"v":2303.5666666666666,"d":"2303.57"},2279.8,2250.05]
[4,"Nifty Infra",3165.4,{"v":3178.7000000000003,"d":"3178.70"},{"v":3146.7500000000005,"d":"3146.75"},{"v":3128.1000000000004,"d":"3128.10"},{"v":3096.1500000000005,"d":"3096.15"},{"v":3197.3500000000004,"d":"3197.35"},{"v":3229.3,"d":"3229.30"},{"v":3247.9500000000003,"d":"3247.95"},3210.65,3160.05]
[5,"Nifty IT",15339.4,{"v":15356.116666666667,"d":"15356.12"},{"v":15290.383333333333,"d":"15290.38"},{"v":15241.366666666667,"d":"15241.37"},{"v":15175.633333333333,"d":"15175.63"},{"v":15405.133333333333,"d":"15405.13"},{"v":15470.866666666667,"d":"15470.87"},{"v":15519.883333333333,"d":"15519.88"},15421.85,15307.1]
[6,"Nifty PSE",3549.9,{"v":3561.4833333333336,"d":"3561.48"},{"v":3529.966666666667,"d":"3529.97"},{"v":3510.0333333333338,"d":"3510.03"},{"v":3478.5166666666673,"d":"3478.52"},{"v":3581.416666666667,"d":"3581.42"},{"v":3612.9333333333334,"d":"3612.93"},{"v":3632.866666666667,"d":"3632.87"},3593,3541.55]
[7,"Nifty Midcap 50",4974.1,{"v":4985.833333333333,"d":"4985.83"},{"v":4956.316666666666,"d":"4956.32"},{"v":4938.533333333333,"d":"4938.53"},{"v":4909.0166666666655,"d":"4909.02"},{"v":5003.616666666666,"d":"5003.62"},{"v":5033.133333333334,"d":"5033.13"},{"v":5050.916666666666,"d":"5050.92"},5015.35,4968.05]
[8,"ABB",1326.45,{"v":1331.4666666666665,"d":"1331.47"},{"v":1314.933333333333,"d":"1314.93"},{"v":1303.4166666666665,"d":"1303.42"},{"v":1286.883333333333,"d":"1286.88"},{"v":1342.983333333333,"d":"1342.98"},{"v":1359.5166666666662,"d":"1359.52"},{"v":1371.0333333333328,"d":"1371.03"},1348,1319.95,1.82854]
[9,"ACC",1602.55,{"v":1595.1333333333332,"d":"1595.13"},{"v":1576.2666666666664,"d":"1576.27"},{"v":1549.9833333333331,"d":"1549.98"},{"v":1531.1166666666663,"d":"1531.12"},{"v":1621.4166666666665,"d":"1621.42"},{"v":1640.2833333333333,"d":"1640.28"},{"v":1666.5666666666666,"d":"1666.57"},1614,1568.85,13.28748]
[10,"AIAENG",1762.9,{"v":1741.2333333333333,"d":"1741.23"},{"v":1707.7166666666667,"d":"1707.72"},{"v":1652.5333333333333,"d":"1652.53"},{"v":1619.0166666666667,"d":"1619.02"},{"v":1796.4166666666667,"d":"1796.42"},{"v":1829.9333333333336,"d":"1829.93"},{"v":1885.1166666666668,"d":"1885.12"},1774.75,1686.05,0.13924]
[11,"AUBANK",574.55,{"v":569.3833333333333,"d":"569.38"},{"v":560.2666666666667,"d":"560.27"},{"v":545.9833333333333,"d":"545.98"},{"v":536.8666666666667,"d":"536.87"},{"v":583.6666666666666,"d":"583.67"},{"v":592.7833333333332,"d":"592.78"},{"v":607.0666666666666,"d":"607.07"},578.5,555.1,9.5973]
{"$rows_left_out":228}
{"sheet":"MidCap Intra","index":3,"n_rows":510,"n_cols":13,"rows_kept":510,"merged":[[0,0,0,1],[8,0,9,0],[8,1,9,1],[8,2,9,2],[8,3,9,3],[8,4,8,6],[8,7,8,9]]}
[]
[]
[]
[]
[{"$nulls":11},"Back To Main Page"]
["FOR INTRA DAY TRADING",{"$nulls":9},{"$f":"Main!B10","v":"2019-03-28"}]
[null,null," "]
[]
["Sr.no","Scrip","CLOSE RATE","Pivot Point","Supports",null,null,"Resistances"]
[null,null,"Point",null,"S1","S2","S3","R1","R2","R3","HIGH","LOW","Total Trade Quanity in Lakhs"]
[1,"3MINDIA",23777.85,{"v":23875.566666666666,"d":"23875.57"},{"v":23563.283333333333,"d":"23563.28"},{"v":23348.716666666667,"d":"23348.72"},{"v":23036.433333333334,"d":"23036.43"},{"v":24090.13333333333,"d":"24090.13"},{"v":24402.416666666664,"d":"24402.42"},{"v":24616.98333333333,"d":"24616.98"},24187.85,23661,0.07457]
[2,"8KMILES",89.4,{"v":90.91666666666667,"d":"90.92"},{"v":86.83333333333334,"d":"86.83"},{"v":84.26666666666667,"d":"84.27"},{"v":80.18333333333334,"d":"80.18"},{"v":93.48333333333335,"d":"93.48"},{"v":97.56666666666669,"d":"97.57"},{"v":100.13333333333335,"d":"100.13"},95,88.35,4.72225]
[3,"AARTIIND",1590.5,{"v":1571.8166666666666,"d":"1571.82"},{"v":1548.6833333333332,"d":"1548.68"},{"v":1506.8666666666666,"d":"1506.87"},{"v":1483.7333333333331,"d":"1483.73"},{"v":1613.6333333333332,"d":"1613.63"},{"v":1636.7666666666664,"d":"1636.77"},{"v":1678.5833333333333,"d":"1678.58"},1594.95,1530,3.21655]
[4,"ABAN",57.6,{"v":58.28333333333333,"d":"58.28"},{"v":55.96666666666666,"d":"55.97"},{"v":54.33333333333333,"d":"54.33"},{"v":52.01666666666666,"d":"52.02"},{"v":59.916666666666664,"d":"59.92"},{"v":62.23333333333333,"d":"62.23"},{"v":63.86666666666667,"d":"63.87"},60.6,56.65,1.03634]
[5,"ABB",1326.45,{"v":1331.4666666666665,"d":"1331.47"},{"v":1314.933333333333,"d":"1314.93"},{"v":1303.4166666666665,"d":"1303.42"},{"v":1286.883333333333,"d":"1286.88"},{"v":1342.983333333333,"d":"1342.98"},{"v":1359.5166666666662,"d":"1359.52"},{"v":1371.0333333333328,"d":"1371.03"},1348,1319.95,1.82854]
[6,"ABCAPITAL",100.9,{"v":101.21666666666665,"d":"101.22"},{"v":99.18333333333331,"d":"99.18"},{"v":97.46666666666665,"d":"97.47"},{"v":95.43333333333331,"d":"95.43"},{"v":102.93333333333331,"d":"102.93"},{"v":104.96666666666664,"d":"104.97"},{"v":106.68333333333331,"d":"106.68"},103.25,99.5,50.05683]
[7,"ABFRL",223.5,{"v":222.04999999999998,"d":"222.05"},{"v":218.44999999999996,"d":"218.45"},{"v":213.39999999999998,"d":"213.40"},{"v":209.79999999999995,"d":"209.80"},{"v":227.09999999999997,"d":"227.10"},{"v":230.7,"d":"230.70"},{"v":235.74999999999997,"d":"235.75"},225.65,217,9.90443]
[8,"ACC",1602.55,{"v":1595.1333333333332,"d":"1595.13"},{"v":1576.2666666666664,"d":"1576.27"},{"v":1549.9833333333331,"d":"1549.98"},{"v":1531.1166666666663,"d":"1531.12"},{"v":1621.4166666666665,"d":"1621.42"},{"v":1640.2833333333333,"d":"1640.28"},{"v":1666.5666666666666,"d":"1666.57"},1614,1568.85,13.28748]
[9,"ADANIPORTS",366.3,{"v":367.40000000000003,"d":"367.40"},{"v":363.1000000000001,"d":"363.10"},{"v":359.90000000000003,"d":"359.90"},{"v":355.6000000000001,"d":"355.60"},{"v":370.6000000000001,"d":"370.60"},{"v":374.90000000000003,"d":"374.90"},{"v":378.1000000000001,"d":"378.10"},371.7,364.2,29.65654]
[10,"ADANIPOWER",46.9,{"v":47.28333333333333,"d":"47.28"},{"v":46.11666666666666,"d":"46.12"},{"v":45.33333333333333,"d":"45.33"},{"v":44.16666666666666,"d":"44.17"},{"v":48.06666666666666,"d":"48.07"},{"v":49.233333333333334,"d":"49.23"},{"v":50.016666666666666,"d":"50.02"},48.45,46.5,78.26448]
{"$rows_left_out":491}
{"sheet":"Bulk Deals","index":4,"n_rows":199,"n_cols":8,"rows_kept":199,"merged":[[4,0,4,1],[4,2,4,3],[6,1,6,2]]}
[" "]
[]
[]
[]
[]
[{"$nulls":4},"Back To Main Page"]
["Subject :","BULK DEAL",null,{"$f":"Main!B10","v":"2019-03-28"}]
[]
["Date","Scrip code","Scrip Name","Client Name","Buy / Sell","Quantity Traded","Trade Price / Wt.Avg.trade price","Exchange  "]
["2019-03-27",538812,"AANCHALISP","MIKER FINANCIAL CONSULTANTS PRIVATE LIMITED","SELL",{"v":126501,"d":"126,501"},9.75,"BSE"]
["2019-03-27",542580,"AARTECH","VIJAYA DEVI DESHLAHRA","BUY",{"v":56000,"d":"56,000"},34.52,"BSE"]
["2019-03-27",542580,"AARTECH","GIRIRAJ PRASAD AGRAWAL","BUY",128000,34.52,"BSE"]
["2019-03-27",539661,"ACEMEN","ZODIAC VANIJYA PRIVATE LIMITED","BUY",20200,21.42,"BSE"]
["2019-03-27",539661,"ACEMEN","AVNISH HARAKHCHAND GUDHKA","SELL",20200,21.42,"BSE"]
["2019-03-27",531921,"AGARIND","NISHU FINLEASE PVT. LTD.","BUY",65000,162.25,"BSE"]
["2019-03-27",531921,"AGARIND","GARNET INTERNATIONAL LIMITED","SELL",65000,162.25,"BSE"]
["2019-03-27",538778,"AKASHDEEP","SIRIUS ADVISORS PRIVATE LIMITED.","BUY",50800,45.45,"BSE"]
["2019-03-27",530499,"AKCAPIT","FAMILY HOME CONSULTANCY SERVICES PRIVATE LIMITED","BUY",48570,332.56,"BSE"]
["2019-03-27",540024,"ASHARI","SEEMA GARG","SELL",62800,7.85,"BSE"]
["2019-03-27",540024,"ASHARI","YOGESH KUMAR SHARMA","BUY",155000,7.97,"BSE"]
{"$rows_left_out":180}
{"sheet":"Call Tracker (Equity & F&O)","index":5,"n_rows":342,"n_cols":18,"rows_kept":342,"merged":[[36,0,37,0],[36,1,37,1],[36,2,37,2],[36,9,37,9],[36,11,37,11],[36,12,37,12],[36,13,37,13],[36,14,37,14],[39,0,40,0],[39,1,40,1],[39,2,40,2],[39,9,40,9],[39,11,40,11],[39,12,40,12],[39,13,40,13],[39,14,40,14],[41,0,42,0],[41,1,42,1],[41,2,42,2],[41,9,42,9],[41,11,42,11],[41,12,42,12],[41,13,42,13],[41,14,42,14],[52,0,53,0],[52,1,53,1],[52,2,53,2],[52,9,53,9],[52,11,53,11],[52,12,53,12],[52,13,53,13],[52,14,53,14],[66,0,67,0],[66,1,67,1],[66,2,67,2],[66,9,67,9],[66,11,67,11],[66,12,67,12],[66,13,67,13],[66,14,67,14],[68,0,69,0],[68,1,69,1],[68,2,69,2],[68,9,69,9],[68,11,69,11],[68,12,69,12],[68,13,69,13],[68,14,69,14]]}
[]
[]
[]
[]
[{"$nulls":12},"Back To Main Page"]
["Retail Research Technical Calls & Fundamental Performance Report for the month of March -2019 "]
[{"$nulls":12},{"$f":"Main!B10","v":"2019-03-28"}]
[null,"Positional  Call"]
["Sr.no","Date",null,"Company","Rec","Rec Price","Stop Loss***","Call Closed At","Target","Remark","Profit / Loss per Share","Gain / Loss  %","Status","Closed Date","NSE Closed Price"]
[1,"2019-01-24",null,"ITC","Buy",280,268,292,305,"Profit of Rs.12/-",{"$f":"H10-F10","v":12},{"$f":"K10/F10","v":{"v":0.04285714285714286,"d":"4.29%"}},"Successful","2019-03-08",{"$nulls":3},"R"]
[2,"2019-03-01",null,"UPL","Sell",881.5,922.2,922.2,800,"Loss of Rs.40.7/-",{"$f":"F11-H11","v":-40.700000000000045},{"v":-0.0461712989222916,"d":"-4.62%"},"UnSuccessful","2019-03-15",{"$nulls":3},"R"]
[3,"2019-03-01",null,"BEL","Buy",83,78.5,86.25,92,"Profit of Rs.3.25/-",3.25,{"$f":"K12/F12","v":{"v":0.0391566265060241,"d":"3.92%"}},"Successful","2019-03-05",{"$nulls":3},"H"]
[4,"2019-03-01",null,"ZEEL","Sell",478.5,507.3,458.5,"435-425","Profit of Rs.20/-",{"$f":"F13-H13","v":20},{"$f":"K13/F13","v":{"v":0.04179728317659352,"d":"4.18%"}},"Successful","2019-03-07",{"$nulls":3},"R"]
[5,"2019-03-06",null,"MARUTI","Buy",7025,6700,6955,"7500-7600","Loss of Rs.70/-",-70,{"v":-0.0099644128113879,"d":"-1.00%"},"UnSuccessful","2019-03-20",{"$nulls":3},"H"]
[6,"2019-03-07",null,"BPCL","Sell",376.5,395.6,385.75,"345-335","Loss of Rs.9.25/-",{"$f":"F15-H15","v":-9.25},{"$f":"K15/F15","v":{"v":-0.024568393094289508,"d":"-2.46%"}},"UnSuccessful","2019-03-18",{"$nulls":3},"R"]
[7,"2019-03-07",null,"RAYMOND","Sell","825-830",888.8,null,"720-730","Open",{"$nulls":4},{"$f":"VLOOKUP(D16,Sheet2!A16:M1811,6,0)","v":798.95},null,null,"R"]
[8,"2019-03-08",null,"BHEL","Sell",67.5,70.5,70.5,"63-61","Loss of Rs.3/-",{"$f":"F17-H17","v":-3},{"$f":"K17/F17","v":{"v":-0.044444444444444446,"d":"-4.44%"}},"UnSuccessful","2019-03-12",{"$nulls":3},"H"]
[9,"2019-03-13",null,"DLF","Sell","192-194",206.6,null,"164-168 ","Open",{"$nulls":4},{"$f":"VLOOKUP(D18,Sheet2!A18:M1813,6,0)","v":190.4},null,null,"R"]
[10,"2019-03-15",null,"OFSS","Buy","3380-3410",3250,null,"3650-3700","Open",{"$nulls":4},{"$f":"VLOOKUP(D19,Sheet2!A19:M1814,6,0)","v":3370.3},null,null,"H"]
[11,"2019-03-18",null,"BANKBARODA","Sell",121,127.3,116.75,"110-108","Part Profit of Rs.4.25/-",{"$f":"F20-H20","v":4.25},{"$f":"K20/F20","v":{"v":0.03512396694214876,"d":"3.51%"}},"Successful","2019-03-25",{"$nulls":3},"R"]
{"$rows_left_out":311}
{"sheet":"Sheet2","index":6,"n_rows":1641,"n_cols":14,"rows_kept":1641,"hidden":true}
["SYMBOL","SERIES","OPEN","HIGH","LOW","CLOSE","LAST","PREVCLOSE","TOTTRDQTY","TOTTRDVAL","TIMESTAMP","TOTALTRADES","ISIN","ISIN"]
["20MICRONS","EQ",38.25,39.5,34,37.05,37.05,38.75,111782,4072957.5,"2019-03-27",1183,"INE144J01027"]
["21STCENMGM","EQ",18.55,18.55,18.2,18.55,18.55,18.55,1797,32958.65,"2019-03-27",16,"INE253B01015"]
["3IINFOTECH","EQ",3.9,3.9,3.75,3.75,3.8,3.8,2791767,10692986.3,"2019-03-27",730,"INE748C01020"]
["3MINDIA","EQ",23949.6,24187.85,23661,23777.85,23756,23949.5,7457,177876878.45,"2019-03-27",873,"INE470A01017"]
["3PLAND","EQ",10.9,11.75,10.8,11.75,11.75,11.35,1201,13097.25,"2019-03-27",14,"INE105C01023"]
["5PAISA","EQ",234.5,234.5,227,228.75,229,231.25,1473,339454.55,"2019-03-27",90,"INE618L01018"]
["63MOONS","EQ",79.15,79.8,77.6,78.05,77.75,78.65,132342,10419922.3,"2019-03-27",1839,"INE111B01023"]
["8KMILES","EQ",94,95,88.35,89.4,89.1,93,472225,42480151.45,"2019-03-27",5032,"INE650K01021"]
["A2ZINFRA","BE",17.95,17.95,17,17.1,17.4,17.6,680275,11775257.75,"2019-03-27",437,"INE619I01012"]
["AARTIDRUGS","EQ",672,677.7,655,662.3,662.8,671.4,59808,39799164.75,"2019-03-27",4733,"INE767A01016"]
["AARTIIND","EQ",1530,1594.95,1530,1590.5,1586,1524.8,321655,506215256.35,"2019-03-27",22241,"INE769A01020"]
["AARVEEDEN","EQ",23.55,23.95,23.05,23.1,23.05,23.05,8189,189979.1,"2019-03-27",76,"INE273D01019"]
["AAVAS","EQ",1167.55,1174.8,1136.3,1143.4,1138.5,1150.55,15595,18014898.05,"2019-03-27",714,"INE216P01012"]
["ABAN","BE",59.4,60.6,56.65,57.6,58.45,58.6,103634,6066249.25,"2019-03-27",1100,"INE421A01028"]
["ABB","EQ",1335,1348,1319.95,1326.45,1321.3,1330.95,182854,243562665.3,"2019-03-27",6655,"INE117A01022"]
["ABBOTINDIA","EQ",7399,7399,7209.95,7227.35,7230,7346.45,4519,32834456.75,"2019-03-27",1657,"INE358A01014"]
["ABCAPITAL","EQ",102,103.25,99.5,100.9,100.7,101.65,5005683,507179255.25,"2019-03-27",31247,"INE674K01013"]
["ABFRL","EQ",217.5,225.65,217,223.5,223,217.95,990443,220535701.6,"2019-03-27",6048,"INE647O01011"]
["ABSLNN50ET","EQ",328,328.45,320,320,320,332.45,109,35472.4,"2019-03-27",6,"INF209KB1B87"]
{"$rows_left_out":1622}
{"sheet":"Sheet1","index":7,"n_rows":0,"n_cols":0,"rows_kept":0,"hidden":true}

{"sheet":"Sheet3","index":8,"n_rows":0,"n_cols":0,"rows_kept":0,"hidden":true}

{"sheet":"Sheet4","index":9,"n_rows":0,"n_cols":0,"rows_kept":0,"hidden":true}