{"text_format":"3","workbook":"xlsx","n_sheets":8,"sheets":["Main","Future Intra","Cash Intra","MidCap Intra","Bulk Deals","Call Tracker (Equity & F&O)","Sheet2","Sheet1"],"not_rendered":{"images":4,"defined_names":4},"read":"whole","date_system":"1900"}

{"sheet":"Main","index":0,"n_rows":17,"n_cols":4,"rows_kept":17}
[null,"                                                                                                 "]
{"$rows_empty":8}
[null,"2018-12-27"]
[]
[null,"Sheet No.","Template Name","Summary"]
[null,1,"Future Intra","For Intraday trading in F&O segment"]
[null,2,"Cash Intra","For Intraday trading in cash market segment"]
[null,3,"Mid-cap Intra","For Intraday trading in Mid-cap stocks"]
[null,4,"Bulk Deals","Reveals Bulk Deals carried on NSE & BSE"]
[null,5,"Call Tracker"]

{"sheet":"Future Intra","index":1,"n_rows":242,"n_cols":15,"rows_kept":242,"merged":[[8,0,9,0],[8,1,9,1],[8,2,9,2],[8,5,8,7],[8,8,8,10]]}
[]
[]
[]
[]
[{"$nulls":12},"Back to Main Page"]
["FOR INTRA DAY TRADING",{"$nulls":10},{"$f":"Main!B10","v":"2018-12-27"}]
[]
[]
["Sr.no","Sector","Scrip","CLOSE RATE","Pivot Point","Supports",null,null,"Resistances"]
[null,"Sector",null,"Point","Point","S1","S2","S3","R1","R2","R3","HIGH","LOW","OI","% Change in OI"]
[1,"Index","BANKNIFTY",{"v":27031.7,"d":"27031.70"},{"v":26847.099999999995,"d":"26847.10"},{"v":26624.19999999999,"d":"26624.20"},{"v":26216.699999999993,"d":"26216.70"},{"v":25993.79999999999,"d":"25993.80"},{"v":27254.59999999999,"d":"27254.60"},{"v":27477.499999999993,"d":"27477.50"},{"v":27884.999999999993,"d":"27885.00"},27070,26439.6,1808460,{"v":-0.006548083367209044,"d":"-0.65%"}]
[2,"Index","NIFTY",{"v":10748.5,"d":"10748.50"},10681.85,{"v":10603.050000000001,"d":"10603.05"},{"v":10457.6,"d":"10457.60"},{"v":10378.800000000001,"d":"10378.80"},{"v":10827.300000000001,"d":"10827.30"},{"v":10906.1,"d":"10906.10"},{"v":11051.550000000001,"d":"11051.55"},10760.65,10536.4,28917675,{"v":0.11921010388939364,"d":"11.92%"}]
[3,"Index","NIFTYIT",{"v":14168,"d":"14168.00"},{"v":14127,"d":"14127.00"},{"v":14052,"d":"14052.00"},{"v":13936,"d":"13936.00"},{"v":13861,"d":"13861.00"},{"v":14243,"d":"14243.00"},{"v":14318,"d":"14318.00"},{"v":14434,"d":"14434.00"},14202,14011,22850,{"v":0.02696629213483146,"d":"2.70%"}]
[4,"Index","NIFTYMID50",{"v":4813.2,"d":"4813.20"},{"v":1604.3999999999999,"d":"1604.40"},{"v":3208.7999999999997,"d":"3208.80"},{"v":1604.3999999999999,"d":"1604.40"},{"v":3208.7999999999997,"d":"3208.80"},{"v":3208.7999999999997,"d":"3208.80"},{"v":1604.3999999999999,"d":"1604.40"},{"v":3208.7999999999997,"d":"3208.80"},0,0,591580,{"v":0,"d":"0.00%"}]
[5,"Cement","ACC",{"v":1480.8,"d":"1480.80"},{"v":1462.2166666666665,"d":"1462.22"},{"v":1440.483333333333,"d":"1440.48"},{"v":1400.1666666666665,"d":"1400.17"},{"v":1378.433333333333,"d":"1378.43"},{"v":1502.5333333333328,"d":"1502.53"},{"v":1524.2666666666664,"d":"1524.27"},{"v":1564.5833333333328,"d":"1564.58"},1483.95,1421.9,1494400,{"v":0.013564839934888768,"d":"1.36%"}]
[6,"Others","ADANIENT",{"v":161.2,"d":"161.20"},{"v":159.86666666666667,"d":"159.87"},{"v":156.83333333333334,"d":"156.83"},{"v":152.46666666666667,"d":"152.47"},{"v":149.43333333333334,"d":"149.43"},{"v":164.23333333333335,"d":"164.23"},{"v":167.26666666666665,"d":"167.27"},{"v":171.63333333333335,"d":"171.63"},162.9,155.5,38692000,{"v":-0.02978936810431294,"d":"-2.98%"}]
[7,"Others","ADANIPORTS",376.85,{"v":371.1333333333334,"d":"371.13"},{"v":363.71666666666675,"d":"363.72"},{"v":350.58333333333337,"d":"350.58"},{"v":343.16666666666674,"d":"343.17"},{"v":384.26666666666677,"d":"384.27"},{"v":391.6833333333334,"d":"391.68"},{"v":404.8166666666668,"d":"404.82"},378.55,358,25077500,{"v":0.03178358362476857,"d":"3.18%"}]
[8,"Power","ADANIPOWER",{"v":51,"d":"51.00"},{"v":50.78333333333333,"d":"50.78"},{"v":49.86666666666666,"d":"49.87"},{"v":48.73333333333333,"d":"48.73"},{"v":47.816666666666656,"d":"47.82"},{"v":51.916666666666664,"d":"51.92"},{"v":52.833333333333336,"d":"52.83"},{"v":53.96666666666667,"d":"53.97"},51.7,49.65,163700000,{"v":-0.05648414985590778,"d":"-5.65%"}]
[9,"Pharma","AJANTPHARM",1127.75,{"v":1122.6666666666667,"d":"1122.67"},{"v":1110.3333333333335,"d":"1110.33"},{"v":1092.9166666666667,"d":"1092.92"},{"v":1080.5833333333335,"d":"1080.58"},{"v":1140.0833333333335,"d":"1140.08"},{"v":1152.416666666667,"d":"1152.42"},{"v":1169.8333333333335,"d":"1169.83"},1135,1105.25,553000,{"v":0.01282051282051282,"d":"1.28%"}]
[10,"Banking","ALBK",46.15,{"v":45.56666666666666,"d":"45.57"},{"v":44.633333333333326,"d":"44.63"},{"v":43.11666666666666,"d":"43.12"},{"v":42.18333333333332,"d":"42.18"},{"v":47.08333333333333,"d":"47.08"},{"v":48.016666666666666,"d":"48.02"},{"v":49.53333333333333,"d":"49.53"},46.5,44.05,19876000,{"v":-0.020114375862748966,"d":"-2.01%"}]
{"$rows_left_out":213}
{"sheet":"Cash Intra","index":2,"n_rows":247,"n_cols":13,"rows_kept":247,"merged":[[7,0,8,0],[7,1,8,1],[7,2,8,2],[7,3,8,3],[7,4,7,6],[7,7,7,9]]}
[]
[]
[]
[]
[{"$nulls":12},"Back to Main Page"]
["FOR INTRA DAY TRADING",{"$nulls":9},{"$f":"Main!B10","v":"2018-12-27"}]
[]
["Sr.no","Scrip","CLOSE RATE","Pivot Point","Supports",null,null,"Resistances"]
[null,null,"Point",null,"S1","S2","S3","R1","R2","R3","HIGH","LOW","Total Trade Quanity in Lakhs"]
[1,"Nifty 50",10729.85,{"v":10670.633333333333,"d":"10670.63"},{"v":10593.766666666666,"d":"10593.77"},{"v":10457.683333333332,"d":"10457.68"},{"v":10380.816666666666,"d":"10380.82"},{"v":10806.716666666667,"d":"10806.72"},{"v":10883.583333333332,"d":"10883.58"},{"v":11019.666666666668,"d":"11019.67"},10747.5,10534.55]
[2,"Nifty Bank",26986.8,{"v":26808.033333333336,"d":"26808.03"},{"v":26586.91666666667,"d":"26586.92"},{"v":26187.033333333336,"d":"26187.03"},{"v":25965.91666666667,"d":"25965.92"},{"v":27207.91666666667,"d":"27207.92"},{"v":27429.033333333333,"d":"27429.03"},{"v":27828.91666666667,"d":"27828.92"},27029.15,26408.15]
[3,"Nifty CPSE",2034.65,{"v":2036.3333333333333,"d":"2036.33"},{"v":2017.4666666666667,"d":"2017.47"},{"v":2000.2833333333335,"d":"2000.28"},{"v":1981.416666666667,"d":"1981.42"},{"v":2053.5166666666664,"d":"2053.52"},{"v":2072.3833333333328,"d":"2072.38"},{"v":2089.566666666666,"d":"2089.57"},2055.2,2019.15]
[4,"Nifty Infra",3139.35,{"v":3116.433333333333,"d":"3116.43"},{"v":3084.916666666666,"d":"3084.92"},{"v":3030.483333333333,"d":"3030.48"},{"v":2998.9666666666662,"d":"2998.97"},{"v":3170.866666666666,"d":"3170.87"},{"v":3202.383333333333,"d":"3202.38"},{"v":3256.8166666666657,"d":"3256.82"},3147.95,3062]
[5,"Nifty IT",14158.9,{"v":14135.5,"d":"14135.50"},{"v":14041.8,"d":"14041.80"},{"v":13924.699999999999,"d":"13924.70"},{"v":13830.999999999998,"d":"13831.00"},{"v":14252.6,"d":"14252.60"},{"v":14346.300000000001,"d":"14346.30"},{"v":14463.400000000001,"d":"14463.40"},14229.2,14018.4]
[6,"Nifty PSE",3334.8,{"v":3328.9666666666667,"d":"3328.97"},{"v":3305.4333333333334,"d":"3305.43"},{"v":3276.0666666666666,"d":"3276.07"},{"v":3252.5333333333333,"d":"3252.53"},{"v":3358.3333333333335,"d":"3358.33"},{"v":3381.8666666666672,"d":"3381.87"},{"v":3411.2333333333336,"d":"3411.23"},3352.5,3299.6]
[7,"Nifty Midcap 50",4825.95,{"v":4794.216666666666,"d":"4794.22"},{"v":4751.983333333333,"d":"4751.98"},{"v":4678.016666666666,"d":"4678.02"},{"v":4635.783333333333,"d":"4635.78"},{"v":4868.1833333333325,"d":"4868.18"},{"v":4910.416666666666,"d":"4910.42"},{"v":4984.383333333332,"d":"4984.38"},4836.45,4720.25]
[8,"ABB",1295.3,{"v":1299.4333333333334,"d":"1299.43"},{"v":1280.8666666666668,"d":"1280.87"},{"v":1266.4333333333334,"d":"1266.43"},{"v":1247.8666666666668,"d":"1247.87"},{"v":1313.8666666666668,"d":"1313.87"},{"v":1332.4333333333334,"d":"1332.43"},{"v":1346.8666666666668,"d":"1346.87"},1318,1285,1.25511]
[9,"ACC",1479.4,{"v":1462.1666666666667,"d":"1462.17"},{"v":1438.3333333333335,"d":"1438.33"},{"v":1397.2666666666667,"d":"1397.27"},{"v":1373.4333333333334,"d":"1373.43"},{"v":1503.2333333333336,"d":"1503.23"},{"v":1527.066666666667,"d":"1527.07"},{"v":1568.1333333333337,"d":"1568.13"},1486,1421.1,5.97239]
[10,"AIAENG",1637.55,{"v":1621.8833333333332,"d":"1621.88"},{"v":1593.7666666666664,"d":"1593.77"},{"v":1549.9833333333331,"d":"1549.98"},{"v":1521.8666666666663,"d":"1521.87"},{"v":1665.6666666666665,"d":"1665.67"},{"v":1693.7833333333333,"d":"1693.78"},{"v":1737.5666666666666,"d":"1737.57"},1650,1578.1,0.17285]
[11,"AUBANK",592.05,{"v":592.8000000000001,"d":"592.80"},{"v":581.7500000000001,"d":"581.75"},571.45,{"v":560.4000000000001,"d":"560.40"},{"v":603.1000000000001,"d":"603.10"},{"v":614.1500000000001,"d":"614.15"},{"v":624.4500000000002,"d":"624.45"},603.85,582.5,2.9456]
{"$rows_left_out":228}
{"sheet":"MidCap Intra","index":3,"n_rows":510,"n_cols":13,"rows_kept":510,"merged":[[0,0,0,1],[8,0,9,0],[8,1,9,1],[8,2,9,2],[8,3,9,3],[8,4,8,6],[8,7,8,9]]}
[]
[]
[]
[]
[{"$nulls":11},"Back To Main Page"]
["FOR INTRA DAY TRADING",{"$nulls":9},{"$f":"Main!B10","v":"2018-12-27"}]
[null,null," "]
[]
["Sr.no","Scrip","CLOSE RATE","Pivot Point","Supports",null,null,"Resistances"]
[null,null,"Point",null,"S1","S2","S3","R1","R2","R3","HIGH","LOW","Total Trade Quanity in Lakhs"]
[1,"3MINDIA",20597.55,{"v":20347.183333333334,"d":"20347.18"},{"v":19894.36666666667,"d":"19894.37"},{"v":19191.183333333334,"d":"19191.18"},{"v":18738.36666666667,"d":"18738.37"},{"v":21050.36666666667,"d":"21050.37"},{"v":21503.183333333334,"d":"21503.18"},{"v":22206.36666666667,"d":"22206.37"},20800,19644,0.18652]
[2,"8KMILES",145.4,{"v":148.41666666666666,"d":"148.42"},{"v":141.73333333333332,"d":"141.73"},{"v":138.06666666666666,"d":"138.07"},{"v":131.38333333333333,"d":"131.38"},{"v":152.08333333333331,"d":"152.08"},{"v":158.76666666666665,"d":"158.77"},{"v":162.4333333333333,"d":"162.43"},155.1,144.75,4.5691]
[3,"AARTIIND",1427.25,{"v":1423.5166666666664,"d":"1423.52"},{"v":1402.3333333333328,"d":"1402.33"},{"v":1377.4166666666663,"d":"1377.42"},{"v":1356.2333333333327,"d":"1356.23"},{"v":1448.433333333333,"d":"1448.43"},{"v":1469.6166666666663,"d":"1469.62"},{"v":1494.533333333333,"d":"1494.53"},1444.7,1398.6,0.50102]
[4,"ABAN",73.2,72.75,71.75,{"v":70.3,"d":"70.30"},{"v":69.3,"d":"69.30"},{"v":74.2,"d":"74.20"},{"v":75.2,"d":"75.20"},76.65,73.75,71.3,3.51311]
[5,"ABB",1295.3,{"v":1299.4333333333334,"d":"1299.43"},{"v":1280.8666666666668,"d":"1280.87"},{"v":1266.4333333333334,"d":"1266.43"},{"v":1247.8666666666668,"d":"1247.87"},{"v":1313.8666666666668,"d":"1313.87"},{"v":1332.4333333333334,"d":"1332.43"},{"v":1346.8666666666668,"d":"1346.87"},1318,1285,1.25511]
[6,"ABCAPITAL",97.1,{"v":96.83333333333333,"d":"96.83"},{"v":95.91666666666666,"d":"95.92"},{"v":94.73333333333333,"d":"94.73"},{"v":93.81666666666666,"d":"93.82"},{"v":98.01666666666665,"d":"98.02"},{"v":98.93333333333331,"d":"98.93"},{"v":100.11666666666665,"d":"100.12"},97.75,95.65,12.99891]
[7,"ABFRL",205.9,{"v":206.04999999999998,"d":"206.05"},{"v":201.49999999999997,"d":"201.50"},{"v":197.1,"d":"197.10"},{"v":192.54999999999998,"d":"192.55"},{"v":210.44999999999996,"d":"210.45"},{"v":214.99999999999997,"d":"215.00"},{"v":219.39999999999995,"d":"219.40"},210.6,201.65,7.23425]
[8,"ACC",1479.4,{"v":1462.1666666666667,"d":"1462.17"},{"v":1438.3333333333335,"d":"1438.33"},{"v":1397.2666666666667,"d":"1397.27"},{"v":1373.4333333333334,"d":"1373.43"},{"v":1503.2333333333336,"d":"1503.23"},{"v":1527.066666666667,"d":"1527.07"},{"v":1568.1333333333337,"d":"1568.13"},1486,1421.1,5.97239]
[9,"ADANIPORTS",376.55,{"v":370.84999999999997,"d":"370.85"},{"v":363.19999999999993,"d":"363.20"},{"v":349.84999999999997,"d":"349.85"},{"v":342.19999999999993,"d":"342.20"},{"v":384.19999999999993,"d":"384.20"},{"v":391.8499999999999,"d":"391.85"},{"v":405.19999999999993,"d":"405.20"},378.5,357.5,45.1902]
[10,"ADANIPOWER",50.85,50.75,{"v":49.6,"d":"49.60"},48.35,{"v":47.2,"d":"47.20"},{"v":52,"d":"52.00"},{"v":53.150000000000006,"d":"53.15"},{"v":54.4,"d":"54.40"},51.9,49.5,123.24109]
{"$rows_left_out":491}
{"sheet":"Bulk Deals","index":4,"n_rows":78,"n_cols":8,"rows_kept":78,"merged":[[4,0,4,1],[4,2,4,3],[6,1,6,2]]}
[" "]
[]
[]
[]
[]
[{"$nulls":4},"Back To Main Page"]
["Subject :","BULK DEAL",null,{"$f":"Main!B10","v":"2018-12-27"}]
[]
["Date","Scrip code","Scrip Name","Client Name","Buy / Sell","Quantity Traded","Trade Price / Wt.Avg.trade price","Exchange  "]
["2018-12-26",540776,"5PAISA","SATPAL KHATTAR","SELL",{"v":246861,"d":"246,861"},190,"BSE"]
["2018-12-26",535467,"AIFL","HARSHAD HIRJI THAKKAR","SELL",{"v":128008,"d":"128,008"},31.09,"BSE"]
["2018-12-26",541702,"ASHNI","RAJNIKANT BABULAL PARIKH","BUY",{"v":31000,"d":"31,000"},8.49,"BSE"]
["2018-12-26",541702,"ASHNI","EAST WEST TRADELINK PRIVATE LIMITED","SELL",{"v":23996,"d":"23,996"},8.34,"BSE"]
["2018-12-26",511144,"ASYAINFO","RATNA SANJEEV PATEL","SELL",{"v":101369,"d":"101,369"},8,"BSE"]
["2018-12-26",511144,"ASYAINFO","DHAVAL VIPULBHAI SHAH","BUY",{"v":103992,"d":"103,992"},8.01,"BSE"]
["2018-12-26",532330,"BIOPAC","AMIT KHIMJI DEDHIA","SELL",{"v":100000,"d":"100,000"},7.77,"BSE"]
["2018-12-26",532330,"BIOPAC","KHYATI AMIT DEDHIA","BUY",{"v":102485,"d":"102,485"},7.77,"BSE"]
["2018-12-26",539335,"CHPLIND","DIMPLE SURANA","BUY",{"v":37550,"d":"37,550"},10.62,"BSE"]
["2018-12-26",539335,"CHPLIND","RASHMI RAVI SHARMA","SELL",{"v":37950,"d":"37,950"},10.62,"BSE"]
["2018-12-26",540455,"ESCORP","AMARKUMAR SHAH HIRAL","BUY",{"v":80000,"d":"80,000"},15.75,"BSE"]
{"$rows_left_out":59}
{"sheet":"Call Tracker (Equity & F&O)","index":5,"n_rows":327,"n_cols":18,"rows_kept":327,"merged":[[38,0,39,0],[38,1,39,1],[38,2,39,2],[38,9,39,9],[38,11,39,11],[38,12,39,12],[38,13,39,13],[38,14,39,14],[40,0,41,0],[40,1,41,1],[40,2,41,2],[40,9,41,9],[40,11,41,11],[40,12,41,12],[40,13,41,13],[40,14,41,14],[42,0,43,0],[42,1,43,1],[42,2,43,2],[42,9,43,9],[42,11,43,11],[42,12,43,12],[42,13,43,13],[42,14,43,14],[44,0,45,0],[44,1,45,1],[44,2,45,2],[44,9,45,9],[44,11,45,11],[44,12,45,12],[44,13,45,13],[44,14,45,14],[46,0,47,0],[46,1,47,1],[46,2,47,2],[46,9,47,9],[46,11,47,11],[46,12,47,12],[46,13,47,13],[46,14,47,14],[48,0,49,0],[48,1,49,1],[48,2,49,2],[48,9,49,9],[48,11,49,11],[48,12,49,12],[48,13,49,13],[48,14,49,14],[50,0,51,0],[50,1,51,1],[50,2,51,2],[50,9,51,9],[50,11,51,11],[50,12,51,12],[50,13,51,13],[50,14,51,14],[52,0,53,0],[52,1,53,1],[52,2,53,2],[52,9,53,9],[52,11,53,11],[52,12,53,12],[52,13,53,13],[52,14,53,14],[58,0,59,0],[58,1,59,1],[58,2,59,2],[58,9,59,9],[58,11,59,11],[58,12,59,12],[58,13,59,13],[58,14,59,14],[60,0,61,0],[60,1,61,1],[60,2,61,2],[60,9,61,9],[60,11,61,11],[60,12,61,12],[60,13,61,13],[60,14,61,14]]}
[]
[]
[]
[]
[{"$nulls":12},"Back To Main Page"]
["Retail Research Technical Calls & Fundamental Performance Report for the month of December -2018 "]
[{"$nulls":12},{"$f":"Main!B10","v":"2018-12-27"}]
[null,"Positional  Call"]
["Sr.no","Date",null,"Company","Rec","Rec Price","Stop Loss***","Call Closed At","Target","Remark","Profit / Loss per Share","Gain / Loss  %","Status","Closed Date","NSE Closed Price"]
[1,"2018-11-14",null,"ASHOKLEY","Buy",108,100.7,111.25,"122-125","Part Profit of Rs.3.25/-",{"$f":"H10-F10","v":3.25},{"$f":"K10/F10","v":{"v":0.03009259259259259,"d":"3.01%"}},"Successful","2018-11-30",{"$nulls":3},"R"]
[2,"2018-11-21",null,"ADANIPORTS","Sell",359.5,377.7,349,"322-326","Profit of Rs.10.5/-",{"$f":"F11-H11","v":10.5},{"v":0.02920723226703755,"d":"2.92%"},"Successful","2018-12-11",{"$nulls":3},"R"]
[3,"2018-11-29",null,"JSWSTEEL","Buy{}",312,297.7,{"$f":"(322+296)/2","v":309},"344-350","Loss of Rs.3/-",{"$f":"H12-F12","v":-3},{"$f":"K12/F12","v":{"v":-0.009615384615384616,"d":"-0.96%"}},"Unsuccessful","2018-12-07",{"$nulls":3},"R"]
[4,"2018-11-30",null,"RAYMOND","Sell",820,861.6,789,"745-735","Profit of Rs.31/-",{"$f":"F13-H13","v":31},{"v":0.03780487804878049,"d":"3.78%"},"Successful","2018-12-07",{"$nulls":3},"R"]
[5,"2018-11-30",null,"INFY","Buy",665,628,685,725,"Profit of Rs.20/-",20,{"$f":"K14/F14","v":{"v":0.03007518796992481,"d":"3.01%"}},"Successful","2018-12-07",{"$nulls":3},"H"]
[6,"2018-12-13",null,"JSWSTEEL","Buy",301.5,289,310.75,"325-330","Profit of Rs.9.25/-",{"$f":"H15-F15","v":9.25},{"$f":"K15/F15","v":{"v":0.03067993366500829,"d":"3.07%"}},"Successful","2018-12-19",{"$nulls":3},"H"]
[7,"2018-12-17",null,"COALINDIA","Buy",245.5,233,253.4,"260-265","Profit of Rs.7.9/-",{"$f":"H16-F16","v":7.900000000000006},{"$f":"K16/F16","v":{"v":0.03217922606924646,"d":"3.22%"}},"Successful","2018-12-20",{"$nulls":3},"H"]
[8,"2018-12-21",null,"TATAGLOBAL","Buy",217,209,223.5,"235-240","Part Profit of Rs.6.25/-",6.5,{"v":0.029953917050691243,"d":"3.00%"},"Successful","2018-12-24",{"$nulls":3},"H"]
[9,"2018-12-24",null,"JSWSTEEL","Buy","299-300",289,null,"320-325","Open",{"$nulls":4},{"$f":"VLOOKUP(D18,Sheet2!A2:M1497,6,0)","v":296.3},null,null,"H"]
[10,"2018-12-24",null,"TATAPOWER","Buy","77.2-77.4",73.7,null,"83-84","Open",{"$nulls":4},{"$f":"VLOOKUP(D19,Sheet2!A3:M1498,6,0)","v":75.95},null,null,"R"]
[11,"2018-12-26",null,"CONCOR","Buy","638-643",608.8,null,"700-710","Open",{"$nulls":4},{"$f":"VLOOKUP(D20,Sheet2!A4:M1499,6,0)","v":652.6},null,null,"R"]
{"$rows_left_out":275}
{"sheet":"Sheet2","index":6,"n_rows":1633,"n_cols":14,"rows_kept":1633,"hidden":true}
["SYMBOL","SERIES","OPEN","HIGH","LOW","CLOSE","LAST","PREVCLOSE","TOTTRDQTY","TOTTRDVAL","TIMESTAMP","TOTALTRADES","ISIN","ISIN"]
["20MICRONS","EQ",41.75,42.8,41.4,41.8,41.65,41.6,12075,505694.75,"2018-12-26",205,"INE144J01027"]
["21STCENMGM","EQ",24.8,24.8,24.75,24.75,24.75,24.85,254,6299.05,"2018-12-26",8,"INE253B01015"]
["3IINFOTECH","EQ",3.6,3.6,3.45,3.5,3.5,3.55,1672336,5853954.35,"2018-12-26",691,"INE748C01020"]
["3MINDIA","EQ",20800,20800,19644,20597.55,20500,21535.15,18652,374628567.25,"2018-12-26",4920,"INE470A01017"]
["3PLAND","EQ",11,13,11,12.4,12.4,11.15,6266,78389.35,"2018-12-26",33,"INE105C01023"]
["5PAISA","EQ",194.5,206.85,190,193.2,193,194.5,16127,3207602.3,"2018-12-26",629,"INE618L01018"]
["63MOONS","EQ",95.3,96.8,93.3,94.65,94.35,97.15,217481,20680198.15,"2018-12-26",3565,"INE111B01023"]
["8KMILES","EQ",151,155.1,144.75,145.4,145.4,152.35,456910,67345961.45,"2018-12-26",5763,"INE650K01021"]
["A2ZINFRA","EQ",12.8,13.15,12.3,12.95,12.95,12.85,173809,2222424.3,"2018-12-26",388,"INE619I01012"]
["AARTIDRUGS","EQ",567.8,579.5,558.15,574.4,572,564.8,4968,2810481.6,"2018-12-26",393,"INE767A01016"]
["AARTIIND","EQ",1418.5,1444.7,1398.6,1427.25,1421.15,1427.1,50102,71394140.05,"2018-12-26",4322,"INE769A01020"]
["AARVEEDEN","EQ",24.15,24.9,22.6,23.75,23.95,24.25,12938,306409.2,"2018-12-26",109,"INE273D01019"]
["AAVAS","EQ",788.45,868,735,800.35,800,788.4,41382,32381883.2,"2018-12-26",5555,"INE216P01012"]
["ABAN","EQ",73.7,73.75,71.3,73.2,73.05,74.2,351311,25566561.85,"2018-12-26",4622,"INE421A01028"]
["ABB","EQ",1301.2,1318,1285,1295.3,1300,1302.15,125511,163314719.1,"2018-12-26",9744,"INE117A01022"]
["ABBOTINDIA","EQ",7509,7509,7386,7498.3,7500,7466.25,1872,13976300.3,"2018-12-26",677,"INE358A01014"]
["ABCAPITAL","EQ",96.8,97.75,95.65,97.1,97,97.05,1299891,125461336.75,"2018-12-26",18413,"INE674K01013"]
["ABFRL","EQ",206.5,210.6,201.65,205.9,206,206.75,723425,149503660.95,"2018-12-26",10895,"INE647O01011"]
["ACC","EQ",1442.3,1486,1421.1,1479.4,1482,1447.65,597239,867537549.6,"2018-12-26",18726,"INE012A01025"]
{"$rows_left_out":1614}
{"sheet":"Sheet1","index":7,"n_rows":0,"n_cols":0,"rows_kept":0,"hidden":true}