{"text_format":"3","workbook":"xlsx","n_sheets":9,"sheets":["Main","Future Intra","Cash Intra","MidCap Intra","Bulk Deals","Call Tracker (Equity & F&O)","Sheet2","Sheet1","Sheet3"],"not_rendered":{"images":4,"defined_names":4},"read":"whole","date_system":"1900"}

{"sheet":"Main","index":0,"n_rows":17,"n_cols":4,"rows_kept":17}
[null,"                                                                                                 "]
{"$rows_empty":8}
[null,"2019-02-26"]
[]
[null,"Sheet No.","Template Name","Summary"]
[null,1,"Future Intra","For Intraday trading in F&O segment"]
[null,2,"Cash Intra","For Intraday trading in cash market segment"]
[null,3,"Mid-cap Intra","For Intraday trading in Mid-cap stocks"]
[null,4,"Bulk Deals","Reveals Bulk Deals carried on NSE & BSE"]
[null,5,"Call Tracker"]

{"sheet":"Future Intra","index":1,"n_rows":239,"n_cols":15,"rows_kept":239,"merged":[[8,0,9,0],[8,1,9,1],[8,2,9,2],[8,5,8,7],[8,8,8,10]]}
[]
[]
[]
[]
[{"$nulls":12},"Back to Main Page"]
["FOR INTRA DAY TRADING",{"$nulls":10},{"$f":"Main!B10","v":"2019-02-26"}]
[]
[]
["Sr.no","Sector","Scrip","CLOSE RATE","Pivot Point","Supports",null,null,"Resistances"]
[null,"Sector",null,"Point","Point","S1","S2","S3","R1","R2","R3","HIGH","LOW","OI","% Change in OI"]
[1,"Index","BANKNIFTY",27171.55,{"v":27110.18333333333,"d":"27110.18"},{"v":27011.46666666666,"d":"27011.47"},{"v":26851.383333333328,"d":"26851.38"},{"v":26752.666666666657,"d":"26752.67"},{"v":27270.266666666663,"d":"27270.27"},{"v":27368.98333333333,"d":"27368.98"},{"v":27529.066666666666,"d":"27529.07"},27208.9,26950.1,1508320,{"v":-0.010457533491661527,"d":"-1.05%"}]
[2,"Index","NIFTY",10887.05,{"v":10862.083333333332,"d":"10862.08"},{"v":10827.266666666665,"d":"10827.27"},{"v":10767.483333333332,"d":"10767.48"},{"v":10732.666666666664,"d":"10732.67"},{"v":10921.866666666665,"d":"10921.87"},{"v":10956.68333333333,"d":"10956.68"},{"v":11016.466666666665,"d":"11016.47"},10896.9,10802.3,23864850,{"v":0.010563022434513071,"d":"1.06%"}]
[3,"Index","NIFTYIT",{"v":16028,"d":"16028.00"},{"v":15943.666666666666,"d":"15943.67"},{"v":15838.333333333332,"d":"15838.33"},{"v":15648.666666666666,"d":"15648.67"},{"v":15543.333333333332,"d":"15543.33"},{"v":16133.333333333332,"d":"16133.33"},{"v":16238.666666666664,"d":"16238.67"},{"v":16428.333333333332,"d":"16428.33"},16049,15754,20950,{"v":0.052763819095477386,"d":"5.28%"}]
[4,"Cement","ACC",1381.25,{"v":1382.5166666666667,"d":"1382.52"},{"v":1370.7333333333333,"d":"1370.73"},{"v":1360.2166666666667,"d":"1360.22"},{"v":1348.4333333333334,"d":"1348.43"},{"v":1393.0333333333333,"d":"1393.03"},{"v":1404.8166666666666,"d":"1404.82"},{"v":1415.3333333333333,"d":"1415.33"},1394.3,1372,2582800,{"v":0.1,"d":"10.00%"}]
[5,"Others","ADANIENT",{"v":132.7,"d":"132.70"},{"v":130.71666666666667,"d":"130.72"},{"v":126.63333333333333,"d":"126.63"},{"v":120.56666666666666,"d":"120.57"},{"v":116.48333333333332,"d":"116.48"},{"v":136.78333333333333,"d":"136.78"},{"v":140.86666666666665,"d":"140.87"},{"v":146.93333333333334,"d":"146.93"},134.8,124.65,38104000,{"v":-0.07361664883788778,"d":"-7.36%"}]
[6,"Others","ADANIPORTS",325.85,{"v":328.53333333333336,"d":"328.53"},{"v":317.8166666666667,"d":"317.82"},{"v":309.78333333333336,"d":"309.78"},{"v":299.0666666666667,"d":"299.07"},{"v":336.5666666666667,"d":"336.57"},{"v":347.2833333333333,"d":"347.28"},{"v":355.3166666666667,"d":"355.32"},339.25,320.5,25195000,{"v":0.3779053869291769,"d":"37.79%"}]
[7,"Power","ADANIPOWER",{"v":40.5,"d":"40.50"},39.35,{"v":37.400000000000006,"d":"37.40"},{"v":34.300000000000004,"d":"34.30"},{"v":32.35000000000001,"d":"32.35"},42.45,{"v":44.400000000000006,"d":"44.40"},{"v":47.5,"d":"47.50"},41.3,36.25,161600000,{"v":-0.043447377767254644,"d":"-4.34%"}]
[8,"Pharma","AJANTPHARM",973.85,{"v":974.8000000000001,"d":"974.80"},{"v":966.4000000000001,"d":"966.40"},958.95,{"v":950.5500000000001,"d":"950.55"},{"v":982.2500000000001,"d":"982.25"},990.65,{"v":998.1000000000001,"d":"998.10"},983.2,967.35,1311500,{"v":0.004211332312404288,"d":"0.42%"}]
[9,"Banking","ALBK",42.55,{"v":42.73333333333333,"d":"42.73"},{"v":41.816666666666656,"d":"41.82"},{"v":41.08333333333333,"d":"41.08"},{"v":40.16666666666666,"d":"40.17"},{"v":43.466666666666654,"d":"43.47"},{"v":44.383333333333326,"d":"44.38"},{"v":45.11666666666665,"d":"45.12"},43.65,42,31720000,{"v":-0.07715582450832073,"d":"-7.72%"}]
[10,"Automobile","AMARAJABAT",734.85,{"v":738.9833333333332,"d":"738.98"},{"v":727.9666666666665,"d":"727.97"},{"v":721.0833333333333,"d":"721.08"},{"v":710.0666666666665,"d":"710.07"},{"v":745.8666666666664,"d":"745.87"},{"v":756.8833333333331,"d":"756.88"},{"v":763.7666666666664,"d":"763.77"},750,732.1,942200,{"v":-0.07427785419532325,"d":"-7.43%"}]
{"$rows_left_out":210}
{"sheet":"Cash Intra","index":2,"n_rows":247,"n_cols":13,"rows_kept":247,"merged":[[7,0,8,0],[7,1,8,1],[7,2,8,2],[7,3,8,3],[7,4,7,6],[7,7,7,9]]}
[]
[]
[]
[]
[{"$nulls":12},"Back to Main Page"]
["FOR INTRA DAY TRADING",{"$nulls":9},{"$f":"Main!B10","v":"2019-02-26"}]
[]
["Sr.no","Scrip","CLOSE RATE","Pivot Point","Supports",null,null,"Resistances"]
[null,null,"Point",null,"S1","S2","S3","R1","R2","R3","HIGH","LOW","Total Trade Quanity in Lakhs"]
[1,"Nifty 50",10880.1,10851.75,{"v":10816.4,"d":"10816.40"},{"v":10752.699999999999,"d":"10752.70"},{"v":10717.349999999999,"d":"10717.35"},10915.45,{"v":10950.8,"d":"10950.80"},{"v":11014.500000000002,"d":"11014.50"},10887.1,10788.05]
[2,"Nifty Bank",27159.25,{"v":27096.333333333332,"d":"27096.33"},{"v":26995.566666666666,"d":"26995.57"},{"v":26831.883333333335,"d":"26831.88"},{"v":26731.11666666667,"d":"26731.12"},{"v":27260.016666666663,"d":"27260.02"},{"v":27360.783333333333,"d":"27360.78"},{"v":27524.46666666666,"d":"27524.47"},27197.1,26932.65]
[3,"Nifty CPSE",1998.9,{"v":1990.2333333333333,"d":"1990.23"},{"v":1977.2166666666667,"d":"1977.22"},{"v":1955.5333333333333,"d":"1955.53"},{"v":1942.5166666666667,"d":"1942.52"},{"v":2011.9166666666667,"d":"2011.92"},{"v":2024.9333333333336,"d":"2024.93"},{"v":2046.6166666666668,"d":"2046.62"},2003.25,1968.55]
[4,"Nifty Infra",2897.6,{"v":2896.1999999999994,"d":"2896.20"},{"v":2878.199999999999,"d":"2878.20"},{"v":2858.7999999999997,"d":"2858.80"},{"v":2840.7999999999993,"d":"2840.80"},{"v":2915.5999999999985,"d":"2915.60"},{"v":2933.5999999999995,"d":"2933.60"},{"v":2952.999999999998,"d":"2953.00"},2914.2,2876.8]
[5,"Nifty IT",16003.7,{"v":15920.966666666667,"d":"15920.97"},{"v":15811.983333333334,"d":"15811.98"},{"v":15620.266666666666,"d":"15620.27"},{"v":15511.283333333333,"d":"15511.28"},{"v":16112.683333333334,"d":"16112.68"},{"v":16221.666666666668,"d":"16221.67"},{"v":16413.383333333335,"d":"16413.38"},16029.95,15729.25]
[6,"Nifty PSE",3176.3,{"v":3168.933333333333,"d":"3168.93"},{"v":3149.666666666666,"d":"3149.67"},{"v":3123.0333333333333,"d":"3123.03"},{"v":3103.7666666666664,"d":"3103.77"},{"v":3195.5666666666657,"d":"3195.57"},{"v":3214.833333333333,"d":"3214.83"},{"v":3241.4666666666653,"d":"3241.47"},3188.2,3142.3]
[7,"Nifty Midcap 50",4564.7,{"v":4559.3,"d":"4559.30"},{"v":4545.1,"d":"4545.10"},{"v":4525.5,"d":"4525.50"},{"v":4511.3,"d":"4511.30"},{"v":4578.900000000001,"d":"4578.90"},{"v":4593.099999999999,"d":"4593.10"},{"v":4612.700000000001,"d":"4612.70"},4573.5,4539.7]
[8,"ABB",1246.55,{"v":1251.6833333333334,"d":"1251.68"},{"v":1238.8666666666668,"d":"1238.87"},{"v":1231.1833333333334,"d":"1231.18"},{"v":1218.3666666666668,"d":"1218.37"},{"v":1259.3666666666668,"d":"1259.37"},{"v":1272.1833333333334,"d":"1272.18"},{"v":1279.8666666666668,"d":"1279.87"},1264.5,1244,0.33418]
[9,"ACC",1376.15,{"v":1379.1166666666668,"d":"1379.12"},{"v":1365.4333333333336,"d":"1365.43"},{"v":1354.716666666667,"d":"1354.72"},{"v":1341.0333333333338,"d":"1341.03"},{"v":1389.8333333333335,"d":"1389.83"},{"v":1403.5166666666669,"d":"1403.52"},{"v":1414.2333333333333,"d":"1414.23"},1392.8,1368.4,7.51219]
[10,"AIAENG",1680.15,1690.55,1657.25,{"v":1634.3500000000001,"d":"1634.35"},{"v":1601.0500000000002,"d":"1601.05"},{"v":1713.4499999999998,"d":"1713.45"},{"v":1746.7499999999995,"d":"1746.75"},{"v":1769.6499999999996,"d":"1769.65"},1723.85,1667.65,0.07326]
[11,"AUBANK",573.65,{"v":573.7833333333333,"d":"573.78"},{"v":569.8666666666666,"d":"569.87"},{"v":566.0833333333333,"d":"566.08"},{"v":562.1666666666665,"d":"562.17"},{"v":577.5666666666666,"d":"577.57"},{"v":581.4833333333333,"d":"581.48"},{"v":585.2666666666667,"d":"585.27"},577.7,570,0.38197]
{"$rows_left_out":228}
{"sheet":"MidCap Intra","index":3,"n_rows":510,"n_cols":13,"rows_kept":510,"merged":[[0,0,0,1],[8,0,9,0],[8,1,9,1],[8,2,9,2],[8,3,9,3],[8,4,8,6],[8,7,8,9]]}
[]
[]
[]
[]
[{"$nulls":11},"Back To Main Page"]
["FOR INTRA DAY TRADING",{"$nulls":9},{"$f":"Main!B10","v":"2019-02-26"}]
[null,null," "]
[]
["Sr.no","Scrip","CLOSE RATE","Pivot Point","Supports",null,null,"Resistances"]
[null,null,"Point",null,"S1","S2","S3","R1","R2","R3","HIGH","LOW","Total Trade Quanity in Lakhs"]
[1,"3MINDIA",23648.35,{"v":23789.3,"d":"23789.30"},{"v":23078.6,"d":"23078.60"},22508.85,{"v":21798.149999999998,"d":"21798.15"},24359.05,{"v":25069.750000000004,"d":"25069.75"},{"v":25639.5,"d":"25639.50"},24500,23219.55,0.04558]
[2,"8KMILES",109.8,{"v":110.83333333333333,"d":"110.83"},{"v":108.16666666666666,"d":"108.17"},{"v":106.53333333333333,"d":"106.53"},{"v":103.86666666666666,"d":"103.87"},{"v":112.46666666666665,"d":"112.47"},{"v":115.13333333333331,"d":"115.13"},{"v":116.76666666666665,"d":"116.77"},113.5,109.2,1.30176]
[3,"AARTIIND",1413.4,{"v":1414.4666666666665,"d":"1414.47"},{"v":1398.933333333333,"d":"1398.93"},{"v":1384.4666666666665,"d":"1384.47"},{"v":1368.933333333333,"d":"1368.93"},{"v":1428.933333333333,"d":"1428.93"},{"v":1444.4666666666662,"d":"1444.47"},{"v":1458.933333333333,"d":"1458.93"},1430,1400,0.66086]
[4,"ABAN",54.5,{"v":54.43333333333334,"d":"54.43"},{"v":53.56666666666668,"d":"53.57"},{"v":52.63333333333334,"d":"52.63"},{"v":51.76666666666668,"d":"51.77"},{"v":55.366666666666674,"d":"55.37"},{"v":56.233333333333334,"d":"56.23"},{"v":57.16666666666667,"d":"57.17"},55.3,53.5,4.88704]
[5,"ABB",1246.55,{"v":1251.6833333333334,"d":"1251.68"},{"v":1238.8666666666668,"d":"1238.87"},{"v":1231.1833333333334,"d":"1231.18"},{"v":1218.3666666666668,"d":"1218.37"},{"v":1259.3666666666668,"d":"1259.37"},{"v":1272.1833333333334,"d":"1272.18"},{"v":1279.8666666666668,"d":"1279.87"},1264.5,1244,0.33418]
[6,"ABCAPITAL",88.7,{"v":88.66666666666667,"d":"88.67"},{"v":87.53333333333335,"d":"87.53"},{"v":86.36666666666667,"d":"86.37"},{"v":85.23333333333335,"d":"85.23"},{"v":89.83333333333334,"d":"89.83"},{"v":90.96666666666667,"d":"90.97"},{"v":92.13333333333334,"d":"92.13"},89.8,87.5,38.64761]
[7,"ABFRL",225.8,224.35,{"v":219,"d":"219.00"},{"v":212.20000000000002,"d":"212.20"},{"v":206.85000000000002,"d":"206.85"},{"v":231.14999999999998,"d":"231.15"},{"v":236.49999999999994,"d":"236.50"},{"v":243.29999999999995,"d":"243.30"},229.7,217.55,5.79619]
[8,"ACC",1376.15,{"v":1379.1166666666668,"d":"1379.12"},{"v":1365.4333333333336,"d":"1365.43"},{"v":1354.716666666667,"d":"1354.72"},{"v":1341.0333333333338,"d":"1341.03"},{"v":1389.8333333333335,"d":"1389.83"},{"v":1403.5166666666669,"d":"1403.52"},{"v":1414.2333333333333,"d":"1414.23"},1392.8,1368.4,7.51219]
[9,"ADANIPORTS",324.55,{"v":328.23333333333335,"d":"328.23"},{"v":316.9166666666667,"d":"316.92"},{"v":309.28333333333336,"d":"309.28"},{"v":297.9666666666667,"d":"297.97"},{"v":335.8666666666667,"d":"335.87"},{"v":347.1833333333333,"d":"347.18"},{"v":354.81666666666666,"d":"354.82"},339.55,320.6,217.95407]
[10,"ADANIPOWER",40.45,{"v":39.26666666666667,"d":"39.27"},{"v":37.533333333333346,"d":"37.53"},{"v":34.616666666666674,"d":"34.62"},{"v":32.88333333333335,"d":"32.88"},{"v":42.183333333333344,"d":"42.18"},{"v":43.91666666666668,"d":"43.92"},{"v":46.83333333333334,"d":"46.83"},41,36.35,178.35657]
{"$rows_left_out":491}
{"sheet":"Bulk Deals","index":4,"n_rows":59,"n_cols":8,"rows_kept":59,"merged":[[4,0,4,1],[4,2,4,3],[6,1,6,2]]}
[" "]
[]
[]
[]
[]
[{"$nulls":4},"Back To Main Page"]
["Subject :","BULK DEAL",null,{"$f":"Main!B10","v":"2019-02-26"}]
[]
["Date","Scrip code","Scrip Name","Client Name","Buy / Sell","Quantity Traded","Trade Price / Wt.Avg.trade price","Exchange  "]
["25/02/2019",542437,"ANMOL","SUNIL KUMAR GUPTA","BUY",{"v":64000,"d":"64,000"},33.57,"BSE"]
["25/02/2019",537766,"BCP","PINKI AGARWAL","BUY",{"v":363552,"d":"363,552"},38.12,"BSE"]
["25/02/2019",537766,"BCP","PINKI AGARWAL","SELL",363552,38.12,"BSE"]
["25/02/2019",531977,"CHLOGIST","LALITKUMAR G GANDHI","BUY",500000,6.19,"BSE"]
["25/02/2019",539853,"GOLDENCAP","ROSELIN MENDES","BUY",20700,25.4,"BSE"]
["25/02/2019",539853,"GOLDENCAP","BHARATI ARVIND SHAH","BUY",35000,25.4,"BSE"]
["25/02/2019",539853,"GOLDENCAP","SONAM PANKAJKUMAR SHAH","SELL",29707,25.4,"BSE"]
["25/02/2019",531687,"KGL","IBELIVE FITNESS SOLUTIONS PRIVATE LIMITED","SELL",5500000,1.35,"BSE"]
["25/02/2019",532067,"KILPEST","ALPNA VARSHNEY","SELL",38988,66.03,"BSE"]
["25/02/2019",539520,"SHAILJA","MAHADEO VISHNU TORASKAR","SELL",23634,16.75,"BSE"]
["25/02/2019",539520,"SHAILJA","YASH MANISH MEHTA","SELL",52000,17.23,"BSE"]
{"$rows_left_out":40}
{"sheet":"Call Tracker (Equity & F&O)","index":5,"n_rows":438,"n_cols":18,"rows_kept":438,"merged":[[37,0,38,0],[37,1,38,1],[37,2,38,2],[37,9,38,9],[37,11,38,11],[37,12,38,12],[37,13,38,13],[37,14,38,14],[39,0,40,0],[39,1,40,1],[39,2,40,2],[39,9,40,9],[39,11,40,11],[39,12,40,12],[39,13,40,13],[39,14,40,14],[48,0,49,0],[48,1,49,1],[48,2,49,2],[48,9,49,9],[48,11,49,11],[48,12,49,12],[48,13,49,13],[48,14,49,14],[51,0,52,0],[51,1,52,1],[51,2,52,2],[51,9,52,9],[51,11,52,11],[51,12,52,12],[51,13,52,13],[51,14,52,14]]}
[]
[]
[]
[]
[{"$nulls":12},"Back To Main Page"]
["Retail Research Technical Calls & Fundamental Performance Report for the month of February -2019 "]
[{"$nulls":12},{"$f":"Main!B10","v":"2019-02-26"}]
[null,"Positional  Call"]
["Sr.no","Date",null,"Company","Rec","Rec Price","Stop Loss***","Call Closed At","Target","Remark","Profit / Loss per Share","Gain / Loss  %","Status","Closed Date","NSE Closed Price"]
[1,"2019-01-24",null,"ITC","Buy","279-281",268,null,305,"Open",{"$nulls":4},{"$f":"VLOOKUP(D10,Sheet2!A10:M1505,6,0)","v":276.7},null,null,"R"]
[2,"2019-01-25",null,"UBL","Sell",1435,1510,1392.5,"1300-1280"," Profit of Rs.42.50/-",42.5,{"$f":"K11/F11","v":{"v":0.029616724738675958,"d":"2.96%"}},"Successful","2019-01-28",{"$nulls":3},"H"]
[3,"2019-01-29",null,"MARUTI","Buy",6575,6290,6910,"7000-7100","Profit of Rs.335/-",{"$f":"H12-F12","v":335},{"v":0.05095057034220532,"d":"5.10%"},"Successful","2019-02-01",{"$nulls":3},"R"]
[4,"2019-01-30",null,"ULTRACEMCO","Buy",3400,3230,3592.5,"3750-3800","Profit of Rs.192.5/-",192.5,{"$f":"K13/F13","v":{"v":0.05661764705882353,"d":"5.66%"}},"Successful","2019-02-07",{"$nulls":3},"H"]
[5,"2019-02-05",null,"MCDOWELL-N","Buy",552.5,526.7,571,"600-610","Profit of Rs.18.5/-",18.5,{"v":0.0334841628959276,"d":"3.35%"},"Successful","2019-02-07",{"$nulls":3},"R"]
[6,"2019-02-07",null,"APOLLOTYRE","Buy",200,189.5,207.5,"215-220","Profit of Rs.7.5/-",{"$f":"H15-F15","v":7.5},{"$f":"K15/F15","v":{"v":0.0375,"d":"3.75%"}},"Successful","2019-02-08",{"$nulls":3},"H"]
[7,"2019-02-07",null,"CENTURYTEX","Buy",769,728,730.5,"820-840","Loss of Rs 38.5/-",-38.5,{"v":-0.05006501950585176,"d":"-5.01%"},"UnSuccessful","2019-02-13",{"$nulls":3},"H"]
[8,"2019-02-11",null,"APOLLOTYRE","Buy",200.5,189.5,207.5,"215-220","Profit of Rs.7/-",{"$f":"H17-F17","v":7},{"$f":"K17/F17","v":{"v":0.034912718204488775,"d":"3.49%"}},"Successful","2019-02-19",{"$nulls":3},"H"]
[9,"2019-02-12",null,"LT","Buy",1244,1188,1284,"1340-1370","Part Profit of Rs.40/-",{"$f":"H18-F18","v":40},{"$f":"K18/F18","v":{"v":0.03215434083601286,"d":"3.22%"}},"Successful","2019-02-21",{"$nulls":3},"H"]
[10,"2019-02-14",null,"HINDALCO","Buy",195,186.2,186,"210-215","Loss of Rs 9/-",{"$f":"H19-F19","v":-9},{"$f":"K19/F19","v":{"v":-0.046153846153846156,"d":"-4.62%"}},"UnSuccessful","2019-02-15",{"$nulls":3},"R"]
[11,"2019-02-19",null,"BRITANNIA","Buy",2955,2780,3045,"3200-3250","Part Profit of Rs.40/-",90,{"v":0.030456852791878174,"d":"3.05%"},"Successful","2019-02-25",{"$nulls":3},"R"]
{"$rows_left_out":291}
{"sheet":"Sheet2","index":6,"n_rows":1640,"n_cols":14,"rows_kept":1640,"hidden":true}
["SYMBOL","SERIES","OPEN","HIGH","LOW","CLOSE","LAST","PREVCLOSE","TOTTRDQTY","TOTTRDVAL","TIMESTAMP","TOTALTRADES","ISIN","ISIN"]
["20MICRONS","EQ",35.2,36.2,34.5,35.9,35.55,34.65,33738,1200321.9,"2019-02-25",397,"INE144J01027"]
["21STCENMGM","EQ",18.65,18.65,17.95,18,18.3,18.3,2964,53552.4,"2019-02-25",25,"INE253B01015"]
["3IINFOTECH","EQ",3.95,3.95,3.7,3.75,3.75,3.9,2498830,9422261.85,"2019-02-25",1208,"INE748C01020"]
["3MINDIA","EQ",23252.2,24500,23219.55,23648.35,23450,23362.5,4558,109353752.9,"2019-02-25",2373,"INE470A01017"]
["3PLAND","EQ",10.9,11.25,10.5,10.55,10.55,10.85,2297,25318.3,"2019-02-25",16,"INE105C01023"]
["5PAISA","EQ",228.95,235,226.35,228,229.25,224.45,1612,370669.3,"2019-02-25",76,"INE618L01018"]
["63MOONS","EQ",76.55,83.25,76.45,80.75,80.2,75.8,570219,45779329,"2019-02-25",8022,"INE111B01023"]
["8KMILES","EQ",112.4,113.5,109.2,109.8,109.7,112.2,130176,14470061.05,"2019-02-25",1505,"INE650K01021"]
["A2ZINFRA","EQ",15.35,16.05,15.05,16.05,16.05,15.3,590307,9260648.35,"2019-02-25",1099,"INE619I01012"]
["AARTIDRUGS","EQ",589.85,604.9,589,594.2,591.5,589.85,6284,3746771.05,"2019-02-25",630,"INE767A01016"]
["AARTIIND","EQ",1402,1430,1400,1413.4,1410.25,1409.75,66086,93925078.9,"2019-02-25",6911,"INE769A01020"]
["AARVEEDEN","EQ",22.75,22.75,21.05,21.75,21.75,21.45,13167,286442.2,"2019-02-25",269,"INE273D01019"]
["AAVAS","EQ",1000.3,1023,977,987.9,985,999.3,32770,32811274.4,"2019-02-25",2081,"INE216P01012"]
["ABAN","EQ",53.55,55.3,53.5,54.5,54.2,53.55,488704,26521156.15,"2019-02-25",4018,"INE421A01028"]
["ABB","EQ",1250,1264.5,1244,1246.55,1245,1248.3,33418,41943942.7,"2019-02-25",2532,"INE117A01022"]
["ABBOTINDIA","EQ",7231,7384.95,7220,7375,7375,7230.55,2228,16334601.5,"2019-02-25",514,"INE358A01014"]
["ABCAPITAL","EQ",88.1,89.8,87.5,88.7,88.5,86.8,3864761,342584113.7,"2019-02-25",51113,"INE674K01013"]
["ABFRL","EQ",220.25,229.7,217.55,225.8,225.55,220.25,579619,129658762.7,"2019-02-25",7419,"INE647O01011"]
["ABSLNN50ET","EQ",260.24,260.24,258,258,258,260.24,22,5698.4,"2019-02-25",2,"INF209KB1B87"]
{"$rows_left_out":1621}
{"sheet":"Sheet1","index":7,"n_rows":0,"n_cols":0,"rows_kept":0,"hidden":true}

{"sheet":"Sheet3","index":8,"n_rows":0,"n_cols":0,"rows_kept":0,"hidden":true}