{"text_format":"3","workbook":"xlsx","n_sheets":9,"sheets":["Main","Future Intra","Cash Intra","MidCap Intra","Bulk Deals","Call Tracker (Equity & F&O)","Call Tracker (Currency)","Sheet2","Sheet1"],"not_rendered":{"images":4,"defined_names":4},"read":"whole","date_system":"1900"}

{"sheet":"Main","index":0,"n_rows":17,"n_cols":4,"rows_kept":17}
[null,"                                                                                                 "]
{"$rows_empty":8}
[null,"2018-04-24"]
[]
[null,"Sheet No.","Template Name","Summary"]
[null,1,"Future Intra","For Intraday trading in F&O segment"]
[null,2,"Cash Intra","For Intraday trading in cash market segment"]
[null,3,"Mid-cap Intra","For Intraday trading in Mid-cap stocks"]
[null,4,"Bulk Deals","Reveals Bulk Deals carried on NSE & BSE"]
[null,5,"Call Tracker"]

{"sheet":"Future Intra","index":1,"n_rows":251,"n_cols":15,"rows_kept":251,"merged":[[8,0,9,0],[8,1,9,1],[8,2,9,2],[8,5,8,7],[8,8,8,10]]}
[]
[]
[]
[]
[{"$nulls":12},"Back to Main Page"]
["FOR INTRA DAY TRADING",{"$nulls":10},{"$f":"Main!B10","v":"2018-04-24"}]
[]
[]
["Sr.no","Sector","Scrip","CLOSE RATE","Pivot Point","Supports",null,null,"Resistances"]
[null,"Sector",null,"Point","Point","S1","S2","S3","R1","R2","R3","HIGH","LOW","OI","% Change in OI"]
[1,"Index","BANKNIFTY",{"v":24947.2,"d":"24947.20"},{"v":24969.016666666666,"d":"24969.02"},{"v":24789.88333333333,"d":"24789.88"},{"v":24632.566666666666,"d":"24632.57"},{"v":24453.43333333333,"d":"24453.43"},{"v":25126.333333333332,"d":"25126.33"},{"v":25305.46666666667,"d":"25305.47"},{"v":25462.783333333333,"d":"25462.78"},25148.15,24811.7,2127520,{"v":0.04808071254039568,"d":"4.81%"}]
[2,"Index","NIFTY",10585.45,{"v":10586.616666666667,"d":"10586.62"},{"v":10550.133333333333,"d":"10550.13"},{"v":10514.816666666666,"d":"10514.82"},{"v":10478.333333333332,"d":"10478.33"},{"v":10621.933333333334,"d":"10621.93"},{"v":10658.416666666668,"d":"10658.42"},{"v":10693.733333333335,"d":"10693.73"},10623.1,10551.3,30065025,{"v":0.01605699917877384,"d":"1.61%"}]
[3,"Index","NIFTYCPSE",2827.05,942.35,{"v":1884.7,"d":"1884.70"},942.35,{"v":1884.7,"d":"1884.70"},{"v":1884.7,"d":"1884.70"},942.35,{"v":1884.7,"d":"1884.70"},0,0,0,{"v":0,"d":"0.00%"}]
[4,"Index","NIFTYINFRA",{"v":3716.6,"d":"3716.60"},{"v":1238.8666666666666,"d":"1238.87"},{"v":2477.733333333333,"d":"2477.73"},{"v":1238.8666666666666,"d":"1238.87"},{"v":2477.733333333333,"d":"2477.73"},{"v":2477.733333333333,"d":"2477.73"},{"v":1238.8666666666666,"d":"1238.87"},{"v":2477.733333333333,"d":"2477.73"},0,0,0,{"v":0,"d":"0.00%"}]
[5,"Index","NIFTYIT",{"v":13997,"d":"13997.00"},{"v":14025.666666666666,"d":"14025.67"},{"v":13801.333333333332,"d":"13801.33"},{"v":13605.666666666666,"d":"13605.67"},{"v":13381.333333333332,"d":"13381.33"},{"v":14221.333333333332,"d":"14221.33"},{"v":14445.666666666664,"d":"14445.67"},{"v":14641.333333333332,"d":"14641.33"},14250,13830,46500,{"v":0.011969532100108813,"d":"1.20%"}]
{"$rows_left_out":230}
{"sheet":"Cash Intra","index":2,"n_rows":251,"n_cols":13,"rows_kept":251,"merged":[[7,0,8,0],[7,1,8,1],[7,2,8,2],[7,3,8,3],[7,4,7,6],[7,7,7,9]]}
[]
[]
[]
[]
[{"$nulls":12},"Back to Main Page"]
["FOR INTRA DAY TRADING",{"$nulls":9},{"$f":"Main!B10","v":"2018-04-24"}]
[]
["Sr.no","Scrip","CLOSE RATE","Pivot Point","Supports",null,null,"Resistances"]
[null,null,"Point",null,"S1","S2","S3","R1","R2","R3","HIGH","LOW","Total Trade Quanity in Lakhs"]
[1,"Nifty 50",10584.7,{"v":10579.333333333334,"d":"10579.33"},{"v":10520.316666666668,"d":"10520.32"},{"v":10455.933333333334,"d":"10455.93"},{"v":10396.916666666668,"d":"10396.92"},{"v":10643.716666666667,"d":"10643.72"},{"v":10702.733333333334,"d":"10702.73"},{"v":10767.116666666667,"d":"10767.12"},10638.35,10514.95]
[2,"Nifty Bank",24960.65,{"v":24836.966666666664,"d":"24836.97"},{"v":24589.783333333326,"d":"24589.78"},{"v":24218.91666666666,"d":"24218.92"},{"v":23971.733333333323,"d":"23971.73"},{"v":25207.83333333333,"d":"25207.83"},{"v":25455.01666666667,"d":"25455.02"},{"v":25825.88333333333,"d":"25825.88"},25084.15,24466.1]
[3,"Nifty CPSE",2420.4,{"v":2421.433333333334,"d":"2421.43"},{"v":2413.5666666666675,"d":"2413.57"},{"v":2406.7333333333336,"d":"2406.73"},{"v":2398.8666666666672,"d":"2398.87"},{"v":2428.266666666668,"d":"2428.27"},{"v":2436.1333333333337,"d":"2436.13"},{"v":2442.966666666668,"d":"2442.97"},2429.3,2414.6]
[4,"Nifty Infra",3467.2,{"v":3470.1666666666665,"d":"3470.17"},{"v":3459.383333333333,"d":"3459.38"},{"v":3451.5666666666666,"d":"3451.57"},{"v":3440.7833333333333,"d":"3440.78"},{"v":3477.983333333333,"d":"3477.98"},{"v":3488.766666666667,"d":"3488.77"},{"v":3496.583333333333,"d":"3496.58"},3480.95,3462.35]
[5,"Nifty IT",14013.95,{"v":14048.199999999999,"d":"14048.20"},{"v":13802.249999999998,"d":"13802.25"},13590.55,{"v":13344.599999999999,"d":"13344.60"},{"v":14259.899999999998,"d":"14259.90"},{"v":14505.849999999999,"d":"14505.85"},{"v":14717.549999999997,"d":"14717.55"},14294.15,13836.5]
[6,"Nifty PSE",3864.3,3865.85,{"v":3855.1499999999996,"d":"3855.15"},{"v":3845.9999999999995,"d":"3846.00"},{"v":3835.2999999999993,"d":"3835.30"},{"v":3875,"d":"3875.00"},{"v":3885.7,"d":"3885.70"},{"v":3894.8500000000004,"d":"3894.85"},3876.55,3856.7]
{"$rows_left_out":230}
{"sheet":"MidCap Intra","index":3,"n_rows":512,"n_cols":13,"rows_kept":512,"merged":[[0,0,0,1],[8,0,9,0],[8,1,9,1],[8,2,9,2],[8,3,9,3],[8,4,8,6],[8,7,8,9]]}
[]
[]
[]
[]
[{"$nulls":11},"Back To Main Page"]
["FOR INTRA DAY TRADING",{"$nulls":9},{"$f":"Main!B10","v":"2018-04-24"}]
[null,null," "]
[]
["Sr.no","Scrip","CLOSE RATE","Pivot Point","Supports",null,null,"Resistances"]
[null,null,"Point",null,"S1","S2","S3","R1","R2","R3","HIGH","LOW","Total Trade Quanity in Lakhs"]
[1,"3MINDIA",20471.15,{"v":20508.966666666667,"d":"20508.97"},{"v":20367.933333333334,"d":"20367.93"},{"v":20264.716666666667,"d":"20264.72"},{"v":20123.683333333334,"d":"20123.68"},{"v":20612.183333333334,"d":"20612.18"},{"v":20753.216666666667,"d":"20753.22"},{"v":20856.433333333334,"d":"20856.43"},20650,20405.75,0.00498]
[2,"8KMILES",784,{"v":787.6833333333334,"d":"787.68"},{"v":772.3666666666668,"d":"772.37"},{"v":760.7333333333333,"d":"760.73"},{"v":745.4166666666667,"d":"745.42"},{"v":799.3166666666668,"d":"799.32"},{"v":814.6333333333334,"d":"814.63"},{"v":826.2666666666669,"d":"826.27"},803,776.05,3.51521]
[3,"ABB",1333.3,{"v":1321.2833333333335,"d":"1321.28"},{"v":1292.566666666667,"d":"1292.57"},{"v":1251.8333333333335,"d":"1251.83"},{"v":1223.116666666667,"d":"1223.12"},{"v":1362.016666666667,"d":"1362.02"},{"v":1390.7333333333338,"d":"1390.73"},{"v":1431.4666666666672,"d":"1431.47"},1350,1280.55,2.52664]
[4,"ACC",1565.3,{"v":1566.3666666666668,"d":"1566.37"},{"v":1550.9333333333336,"d":"1550.93"},{"v":1536.5666666666668,"d":"1536.57"},{"v":1521.1333333333337,"d":"1521.13"},{"v":1580.7333333333336,"d":"1580.73"},{"v":1596.166666666667,"d":"1596.17"},{"v":1610.5333333333335,"d":"1610.53"},1581.8,1552,3.02886]
[5,"AIAENG",1417.6,{"v":1415.7,"d":"1415.70"},1397.95,{"v":1378.3,"d":"1378.30"},1360.55,{"v":1435.3500000000001,"d":"1435.35"},{"v":1453.1000000000001,"d":"1453.10"},{"v":1472.7500000000002,"d":"1472.75"},1433.45,1396.05,0.20402]
{"$rows_left_out":498}
{"sheet":"Bulk Deals","index":4,"n_rows":89,"n_cols":8,"rows_kept":89,"merged":[[4,0,4,1],[4,2,4,3],[6,1,6,2]]}
[" "]
[]
[]
[]
[]
[{"$nulls":4},"Back To Main Page"]
["Subject :","BULK DEAL",null,{"$f":"Main!B10","v":"2018-04-24"}]
[]
["Date","Scrip code","Scrip Name","Client Name","Buy / Sell","Quantity Traded","Trade Price / Wt.Avg.trade price","Exchange  "]
["2018-04-23",541144,"ACTIVE","JOHNSON AND ANDREW PROPERTIES PVT LTD","SELL",{"v":2000,"d":"2,000"},59.8,"BSE"]
["2018-04-23",541144,"ACTIVE","JOHNSON AND ANDREW PROPERTIES PVT LTD","BUY",{"v":92000,"d":"92,000"},62.62,"BSE"]
["2018-04-23",540024,"ASHARI","KAMAL KUMAR JALAN SEC. PVT. LTD","SELL",{"v":93156,"d":"93,156"},70.52,"BSE"]
["2018-04-23",540024,"ASHARI","KAMAL KUMAR JALAN SEC. PVT. LTD","BUY",{"v":93557,"d":"93,557"},70.15,"BSE"]
["2018-04-23",540024,"ASHARI","PREYASHBHAI SATHVARA","SELL",{"v":231017,"d":"231,017"},70.13,"BSE"]
["2018-04-23",540024,"ASHARI","PREYASHBHAI SATHVARA","BUY",{"v":231017,"d":"231,017"},70.99,"BSE"]
{"$rows_left_out":75}
{"sheet":"Call Tracker (Equity & F&O)","index":5,"n_rows":307,"n_cols":19,"rows_kept":307,"merged":[[8,9,8,10],[9,9,9,10],[10,9,10,10],[11,9,11,10],[12,9,12,10],[13,9,13,10],[14,9,14,10],[15,9,15,10],[16,9,16,10],[17,9,17,10],[18,9,18,10],[19,9,19,10],[20,9,20,10],[21,9,21,10],[22,9,22,10],[23,9,23,10],[24,9,24,10],[25,9,25,10],[26,9,26,10],[27,9,27,10],[28,9,28,10],[29,9,29,10],[30,9,30,10],[31,9,31,10],[32,9,32,10],[33,9,33,10],[39,9,39,10],[44,9,44,10],[45,9,45,10],[46,0,47,0],[46,1,47,1],[46,6,47,6],[46,8,47,8],[46,9,47,10],[46,13,47,13],[46,14,47,14],[46,15,47,15],[48,9,48,10],[49,9,49,10],[56,9,56,10],[57,0,58,0],[57,1,58,1],[57,6,58,6],[57,8,58,8],[57,9,58,10],[57,13,58,13],[57,14,58,14],[57,15,58,15],[59,9,59,10],[60,9,60,10],[61,9,61,10],[62,9,62,10],[63,9,63,10],[64,9,64,10],[65,9,65,10],[66,9,66,10],[68,9,68,10],[69,9,69,10],[70,9,70,10],[71,9,71,10],[72,9,72,10],[73,9,73,10],[74,9,74,10],[75,9,75,10],[76,9,76,10],[77,9,77,10],[78,9,78,10],[79,9,79,10],[80,9,80,10],[81,9,81,10],[82,9,82,10],[83,9,83,10],[84,9,84,10],[85,9,85,10],[86,9,86,10],[87,9,87,10],[88,9,88,10],[89,9,89,10],[90,9,90,10],[91,9,91,10],[92,9,92,10],[93,9,93,10],[94,9,94,10],[95,9,95,10],[101,9,101,10],[102,9,102,10],[103,9,103,10],[110,9,110,10],[111,9,111,10],[112,9,112,10],[113,9,113,10],[114,9,114,10],[115,9,115,10],[116,9,116,10],[117,9,117,10],[118,9,118,10],[119,9,119,10],[120,9,120,10],[121,9,121,10],[122,9,122,10],[123,9,123,10],[124,9,124,10],[125,9,125,10],[126,9,126,10],[127,9,127,10],[128,9,128,10],[129,9,129,10],[130,9,130,10],[131,9,131,10],[132,9,132,10],[133,9,133,10],[134,9,134,10],[135,9,135,10],[136,9,136,10],[137,9,137,10],[138,9,138,10],[139,9,139,10],[140,9,140,10],[141,9,141,10],[142,9,142,10],[143,9,143,10],[144,9,144,10],[145,9,145,10],[152,9,152,10],[153,9,153,10],[154,9,154,10],[155,9,155,10],[156,9,156,10],[157,9,157,10],[158,9,158,10],[159,9,159,10],[160,9,160,10],[161,9,161,10],[162,9,162,10],[163,9,163,10],[164,9,164,10],[165,9,165,10],[166,9,166,10],[167,9,167,10],[168,9,168,10],[169,9,169,10],[170,9,170,10],[171,9,171,10],[172,9,172,10],[173,9,173,10],[176,9,176,10],[177,9,177,10],[178,9,178,10],[179,9,179,10],[180,9,180,10],[181,9,181,10],[182,9,182,10],[183,9,183,10],[184,9,184,10],[185,9,185,10],[186,9,186,10],[187,9,187,10],[188,9,188,10],[189,9,189,10],[190,9,190,10],[191,9,191,10],[192,9,192,10],[193,9,193,10],[194,9,194,10],[195,9,195,10],[196,9,196,10],[197,9,197,10],[198,9,198,10],[199,9,199,10],[200,9,200,10],[201,9,201,10],[202,9,202,10],[203,9,203,10],[204,9,204,10],[205,9,205,10],[206,9,206,10],[207,9,207,10],[208,9,208,10],[209,9,209,10],[210,9,210,10],[211,9,211,10],[212,9,212,10],[213,9,213,10],[214,9,214,10],[215,9,215,10],[216,9,216,10],[217,9,217,10],[218,9,218,10],[219,9,219,10],[220,9,220,10],[221,9,221,10],[222,9,222,10],[223,9,223,10],[224,9,224,10],[225,9,225,10],[226,9,226,10],[227,9,227,10],[228,9,228,10],[229,9,229,10],[230,9,230,10],[231,9,231,10],[232,9,232,10],[233,9,233,10],[234,9,234,10],[235,9,235,10],[236,9,236,10],[237,9,237,10],[238,9,238,10],[239,9,239,10],[240,9,240,10],[241,9,241,10],[242,9,242,10],[244,9,244,10],[245,9,245,10],[246,9,246,10],[247,9,247,10],[248,9,248,10],[249,9,249,10],[250,9,250,10],[251,9,251,10],[252,9,252,10],[253,9,253,10],[254,9,254,10],[255,9,255,10],[256,9,256,10],[257,9,257,10],[258,9,258,10],[259,9,259,10],[260,9,260,10],[261,9,261,10],[262,9,262,10],[263,9,263,10],[264,9,264,10],[265,9,265,10],[266,9,266,10],[267,9,267,10],[268,9,268,10],[269,9,269,10],[270,9,270,10],[271,9,271,10],[272,9,272,10],[273,9,273,10],[274,9,274,10],[275,9,275,10],[276,9,276,10],[277,9,277,10],[278,9,278,10],[279,9,279,10],[280,9,280,10],[281,9,281,10],[282,9,282,10],[283,9,283,10],[284,9,284,10],[285,9,285,10],[286,9,286,10],[287,9,287,10],[288,9,288,10],[289,9,289,10],[290,9,290,10],[291,9,291,10],[292,9,292,10],[293,9,293,10],[294,10,294,11]]}
[]
[]
[]
[]
[{"$nulls":13},"Back To Main Page"]
["Retail Research Technical Calls & Fundamental Performance Report for the month of April -2018 "]
[{"$nulls":13},{"$f":"Main!B10","v":"2018-04-24"}]
[null,"Positional  Call"]
["Sr.no","Date",null,"Company","Rec","Rec Price","Stop Loss***","Call Closed At","Target","Remark",null,"Profit / Loss per Share","Gain / Loss  %","Status","Closed Date","NSE Closed Price"]
[1,"2018-02-09",null,"HINDUNILVR","Buy",1332,1275,1375,1450,"Profit of Rs.43/-",null,{"$f":"H10-F10-K10","v":43},{"$f":"L10/F10","v":{"v":0.03228228228228228,"d":"3.23%"}},"Successful","2018-04-05",{"$nulls":3},"A"]
[2,"2018-02-12",null,"ITC","Buy","271-272",250,null,310,"Open",{"$nulls":5},{"$f":"VLOOKUP(D11,Sheet2!$A$1:M2109,6,0)","v":275.5},null,null,"P"]
[3,"2018-03-08",null,"CADILAHC","Buy",385,367,397.5,420,"Profit of Rs.12.5/-",null,{"$f":"H12-F12-K12","v":12.5},{"$f":"L12/F12","v":{"v":0.032467532467532464,"d":"3.25%"}},"Successful","2018-04-04",{"$nulls":3},"R"]
[4,"2018-03-13",null,"LUPIN","Buy",772,732,802.75,850,"Profit of Rs.30.75/-",null,30.75,{"$f":"L13/F13","v":{"v":0.03983160621761658,"d":"3.98%"}},"Successful","2018-04-06",{"$nulls":3},"R"]
[5,"2018-03-16",null,"TATACHEM","Buy",686.5,658,714.5,"730-750","Profit of Rs.28/-",null,28,{"$f":"L14/F14","v":{"v":0.04078659868900218,"d":"4.08%"}},"Successful","2018-04-03",{"$nulls":3},"H"]
[6,"2018-03-19",null,"TCS","Buy",2842.5,2720,2937.5,3050,"Profit of Rs.95/-",null,95,{"v":0.03342128408091469,"d":"3.34%"},"Successful","2018-04-05",{"$nulls":3},"A"]
{"$rows_left_out":293}
{"sheet":"Call Tracker (Currency)","index":6,"n_rows":58,"n_cols":18,"rows_kept":58,"merged":[[1,8,1,9],[2,8,2,9],[3,8,3,9],[4,8,4,9],[5,8,5,9],[6,8,6,9],[7,8,7,9],[8,8,8,9],[9,8,9,9],[10,8,10,9],[11,8,11,9],[12,8,12,9],[13,8,13,9],[14,8,14,9],[15,8,15,9],[16,8,16,9],[17,8,17,9],[18,8,18,9],[19,8,19,9],[20,8,20,9],[21,8,21,9],[22,8,22,9],[23,8,23,9],[24,8,24,9],[25,8,25,9],[26,8,26,9],[27,8,27,9],[28,8,28,9],[29,8,29,9],[30,8,30,9],[31,8,31,9],[32,8,32,9],[33,8,33,9],[34,8,34,9],[35,8,35,9],[36,8,36,9],[37,8,37,9],[38,8,38,9],[39,8,39,9],[40,8,40,9],[41,8,41,9],[42,8,42,9],[43,8,43,9],[44,8,44,9],[45,8,45,9],[46,8,46,9],[47,8,47,9],[48,8,48,9],[49,8,49,9],[50,8,50,9],[51,8,51,9],[52,8,52,9],[53,8,53,9],[54,8,54,9],[55,8,55,9],[56,8,56,9],[57,8,57,9],[58,8,58,9],[59,8,59,9],[60,8,60,9],[61,8,61,9],[62,8,62,9],[63,8,63,9],[64,8,64,9],[65,8,65,9],[66,8,66,9],[67,8,67,9],[68,8,68,9],[69,8,69,9],[70,8,70,9],[71,8,71,9],[72,8,72,9],[73,8,73,9],[74,8,74,9],[75,8,75,9],[76,8,76,9],[77,8,77,9],[78,8,78,9],[79,8,79,9],[80,8,80,9],[81,8,81,9],[82,8,82,9],[83,8,83,9],[84,8,84,9],[85,8,85,9],[86,8,86,9],[87,8,87,9],[88,8,88,9],[89,8,89,9],[90,8,90,9],[91,8,91,9],[92,8,92,9],[93,8,93,9],[94,8,94,9],[95,8,95,9],[96,8,96,9],[97,8,97,9],[98,8,98,9],[99,8,99,9],[100,8,100,9],[101,8,101,9],[102,8,102,9],[103,8,103,9],[104,8,104,9],[105,8,105,9],[106,8,106,9],[107,8,107,9],[108,8,108,9],[109,8,109,9],[110,8,110,9],[111,8,111,9],[112,8,112,9],[113,8,113,9],[114,8,114,9],[115,8,115,9],[116,8,116,9],[117,8,117,9],[118,8,118,9],[119,8,119,9],[120,8,120,9],[121,8,121,9],[122,8,122,9],[123,8,123,9],[124,8,124,9]]}
["Master Trade High Risk"]
["Sr.no","Date","Company","Rec","Rec Price","Stop Loss","Call Closed At","Target","Remark",null,"Profit / Loss per share","Gain / Loss  per Lot","Lot","Status","Closed Date"]
[1,"2017-05-08","USDINR MAY FUT","Buy",64.3935,64.29,64.66,64.59,"Profit of Rs.0.27/-",null,{"v":0.2664999999999935,"d":"0.27"},266.4999999999935,1000,"Successful","2017-05-09",null,null,"P"]
[2,"2017-05-08","USDINR JUN FUT","Buy",64.6535,64.45,64.965,65.05,"Profit of Rs 0.31/-",null,{"v":0.31150000000000944,"d":"0.31"},311.50000000000944,1000,"Successful","2017-05-09",null,null,"P"]
[3,"2017-05-09","EUROINR MAY FUT","Sell",70.65,70.8,70.07,70.4,"Profit of Rs 0.58/-",null,{"v":0.580000000000013,"d":"0.58"},580.00000000001,1000,"Successful","2017-05-12",null,null,"P"]
[4,"2017-05-09","GBPINR MAY FUT","Buy",83.774,83.37,83.37,84.77,"Loss of Rs 0.40/-",null,{"v":-0.40399999999999636,"d":"-0.40"},-403.99999999999636,1000,"Unsuccessful","2017-05-11",null,null,"P"]
[5,"2017-05-11","USDINR MAY FUT","Buy",64.6555,64.55,64.55,64.86,"Loss of Rs.0.1055/-",null,-0.10550000000000637,{"$f":"K7*M7","v":{"v":-105.50000000000637,"d":"-105.50"}},1000,"Unsuccessful","2017-05-11",null,null,"P"]
[6,"2017-05-15","USDINR MAY FUT","Buy",64.2275,64.08,64.46,64.48,"Profit of Rs 0.23/-",null,{"v":0.2324999999999875,"d":"0.23"},232.4999999999875,1000,"Successful","2017-05-18",null,null,"P"]
[7,"2017-05-19","USDINR MAY FUT","Sell",64.83,65,65,64.5,"Loss of Rs.0.17/-",null,{"v":-0.1700000000000017,"d":"-0.17"},-170.0000000000017,1000,"Unsuccessful","2017-05-19",null,null,"P"]
[8,"2017-05-23","USDINR MAY FUT","Buy",64.83,64.62,64.95,65.2,"Profit of Rs 0.12/-",null,{"v":0.12000000000000455,"d":"0.12"},120.00000000000455,1000,"Successful","2017-05-24",null,null,"P"]
[9,"2017-05-25","USDINR MAY FUT","Buy",64.57,64.25,64.56,65,"Loss of Rs.0.01/-",null,-0.009999999999990905,-9.999999999990905,1000,"Neutral","2017-05-29",null,null,"P"]
[10,"2017-05-30","USDINR JUN FUT","Buy",64.9125,64.71,64.71,65.31,"Loss of Rs.0.20/-",null,{"v":-0.20250000000000057,"d":"-0.20"},-202.50000000000057,1000,"Unsuccessful","2017-05-31",null,null,"P"]
[11,"2017-06-01","USDINR JUN FUT","Buy",64.655,64.45,64.45,65.05,"Loss of Rs.0.20/-",null,{"$f":"G13-E13","v":{"v":-0.2049999999999983,"d":"-0.20"}},{"$f":"K13*M13","v":-204.9999999999983},{"v":1000,"d":"1000.00"},"Unsuccessful","2017-06-08",null,null,"P"]
[12,"2017-06-12","USDINR JUN FUT","Buy",64.45,64,64.7625,65.2,"Profit of Rs 0.31/-",null,{"v":0.3125,"d":"0.31"},312.5,1000,"Successful","2017-06-16"]
[13,"2017-06-16","USDINR JUN FUT","Buy",64.51,64.2,64.7,65.11,"Profit of Rs 0.19/-",null,{"v":0.18999999999999773,"d":"0.19"},189.99999999999773,1000,"Successful","2017-06-21"]
{"$rows_left_out":44}
{"sheet":"Sheet2","index":7,"n_rows":1504,"n_cols":13,"rows_kept":1504,"hidden":true}
["SYMBOL","SERIES","OPEN","HIGH","LOW","CLOSE","LAST","PREVCLOSE","TOTTRDQTY","TOTTRDVAL","TIMESTAMP","TOTALTRADES","ISIN"]
["20MICRONS","EQ",52.1,53,51.1,51.55,51.4,52.1,51579,2691254.55,"2018-04-23",630,"INE144J01027"]
["21STCENMGM","EQ",40.6,40.6,40.6,40.6,40.6,39.85,50,2030,"2018-04-23",1,"INE253B01015"]
["3IINFOTECH","EQ",5.75,6,5.7,5.9,5.9,5.7,6619743,38971796.5,"2018-04-23",2849,"INE748C01020"]
["3MINDIA","EQ",20469,20650,20405.75,20471.15,20450,20477.35,498,10229950.95,"2018-04-23",238,"INE470A01017"]
["63MOONS","EQ",94.1,99.25,94.1,96.85,97.05,93.7,471813,46000544.3,"2018-04-23",5519,"INE111B01023"]
["8KMILES","EQ",776.9,803,776.05,784,787.95,772.65,351521,277055742.95,"2018-04-23",12246,"INE650K01021"]
["A2ZINFRA","EQ",28,28.15,27.7,27.75,27.8,27.8,260645,7276513.45,"2018-04-23",1277,"INE619I01012"]
["AARTIDRUGS","EQ",560.35,574,551.1,565.1,565.8,554.15,6108,3433116.8,"2018-04-23",740,"INE767A01016"]
["AARTIIND","EQ",1306.1,1360,1305.5,1325.45,1314,1306.1,50603,67234611.55,"2018-04-23",3199,"INE769A01020"]
["AARVEEDEN","EQ",46,47.45,45.3,45.35,45.35,46.4,18422,851288.5,"2018-04-23",170,"INE273D01019"]
["ABAN","EQ",174,175.9,172.45,173.2,173,175.35,554923,96299075.35,"2018-04-23",7534,"INE421A01028"]
["ABB","EQ",1288,1350,1280.55,1333.3,1335,1274.4,252664,336531959.85,"2018-04-23",15170,"INE117A01022"]
["ABBOTINDIA","EQ",6100.05,6209,6100.05,6158.15,6130,6150,19291,119477592.05,"2018-04-23",891,"INE358A01014"]
["ABCAPITAL","EQ",156,159.75,156,158.65,158,156.15,1289982,203750357.75,"2018-04-23",25018,"INE674K01013"]
{"$rows_left_out":1490}
{"sheet":"Sheet1","index":8,"n_rows":0,"n_cols":0,"rows_kept":0}