{"text_format":"3","workbook":"xlsx","n_sheets":12,"sheets":["Main","Future Intra","Cash Intra","MidCap Intra","Bulk Deals","Call Tracker (Equity & F&O)","Sheet2","Sheet1","Sheet3","Sheet4","Sheet5","Call Tracker (Currency)"],"not_rendered":{"images":4,"defined_names":4},"read":"whole","date_system":"1900"}

{"sheet":"Main","index":0,"n_rows":17,"n_cols":4,"rows_kept":17}
[null,"                                                                                                 "]
{"$rows_empty":8}
[null,"2018-01-19"]
[]
[null,"Sheet No.","Template Name","Summary"]
[null,1,"Future Intra","For Intraday trading in F&O segment"]
[null,2,"Cash Intra","For Intraday trading in cash market segment"]
[null,3,"Mid-cap Intra","For Intraday trading in Mid-cap stocks"]
[null,4,"Bulk Deals","Reveals Bulk Deals carried on NSE & BSE"]
[null,5,"Call Tracker"]

{"sheet":"Future Intra","index":1,"n_rows":252,"n_cols":15,"rows_kept":252,"merged":[[8,0,9,0],[8,1,9,1],[8,2,9,2],[8,5,8,7],[8,8,8,10]]}
[]
[]
[]
[]
[{"$nulls":12},"Back to Main Page"]
["FOR INTRA DAY TRADING",{"$nulls":10},{"$f":"Main!B10","v":"2018-01-19"}]
[]
[]
["Sr.no","Sector","Scrip","CLOSE RATE","Pivot Point","Supports",null,null,"Resistances"]
[null,"Sector",null,"Point","Point","S1","S2","S3","R1","R2","R3","HIGH","LOW","OI","% Change in OI"]
[1,"Index","BANKNIFTY",{"v":26499.4,"d":"26499.40"},{"v":26550.783333333336,"d":"26550.78"},{"v":26333.616666666672,"d":"26333.62"},{"v":26167.833333333336,"d":"26167.83"},{"v":25950.66666666667,"d":"25950.67"},{"v":26716.566666666673,"d":"26716.57"},{"v":26933.733333333337,"d":"26933.73"},{"v":27099.516666666674,"d":"27099.52"},26767.95,26385,2712560,{"v":0.027220261447808897,"d":"2.72%"}]
[2,"Index","NIFTY",{"v":10810.8,"d":"10810.80"},{"v":10819.433333333332,"d":"10819.43"},{"v":10765.416666666664,"d":"10765.42"},{"v":10720.033333333331,"d":"10720.03"},{"v":10666.016666666663,"d":"10666.02"},{"v":10864.816666666666,"d":"10864.82"},{"v":10918.833333333332,"d":"10918.83"},{"v":10964.216666666667,"d":"10964.22"},10873.45,10774.05,33735075,{"v":0.018098482362128087,"d":"1.81%"}]
[3,"Index","NIFTYCPSE",{"v":2752.3,"d":"2752.30"},{"v":917.4333333333334,"d":"917.43"},{"v":1834.8666666666668,"d":"1834.87"},{"v":917.4333333333334,"d":"917.43"},{"v":1834.8666666666668,"d":"1834.87"},{"v":1834.8666666666668,"d":"1834.87"},{"v":917.4333333333334,"d":"917.43"},{"v":1834.8666666666668,"d":"1834.87"},0,0,0,{"v":0,"d":"0.00%"}]
[4,"Index","NIFTYINFRA",3636.75,1212.25,{"v":2424.5,"d":"2424.50"},1212.25,{"v":2424.5,"d":"2424.50"},{"v":2424.5,"d":"2424.50"},1212.25,{"v":2424.5,"d":"2424.50"},0,0,0,{"v":0,"d":"0.00%"}]
[5,"Index","NIFTYIT",{"v":12554,"d":"12554.00"},{"v":12505,"d":"12505.00"},{"v":12441,"d":"12441.00"},{"v":12328,"d":"12328.00"},{"v":12264,"d":"12264.00"},{"v":12618,"d":"12618.00"},{"v":12682,"d":"12682.00"},{"v":12795,"d":"12795.00"},12569,12392,24250,{"v":4.140786749482402E-3,"d":"0.41%"}]
{"$rows_left_out":231}
{"sheet":"Cash Intra","index":2,"n_rows":251,"n_cols":13,"rows_kept":251,"merged":[[7,0,8,0],[7,1,8,1],[7,2,8,2],[7,3,8,3],[7,4,7,6],[7,7,7,9]]}
[]
[]
[]
[]
[{"$nulls":12},"Back to Main Page"]
["FOR INTRA DAY TRADING",{"$nulls":9},{"$f":"Main!B10","v":"2018-01-19"}]
[]
["Sr.no","Scrip","CLOSE RATE","Pivot Point","Supports",null,null,"Resistances"]
[null,null,"Point",null,"S1","S2","S3","R1","R2","R3","HIGH","LOW","Total Trade Quanity in Lakhs"]
[1,"Nifty 50",10817,{"v":10828.966666666667,"d":"10828.97"},{"v":10770.433333333334,"d":"10770.43"},{"v":10723.866666666667,"d":"10723.87"},{"v":10665.333333333334,"d":"10665.33"},{"v":10875.533333333335,"d":"10875.53"},{"v":10934.066666666668,"d":"10934.07"},{"v":10980.633333333335,"d":"10980.63"},10887.5,10782.4]
[2,"Nifty Bank",26537.4,{"v":26616.266666666666,"d":"26616.27"},{"v":26344.88333333333,"d":"26344.88"},{"v":26152.366666666665,"d":"26152.37"},{"v":25880.98333333333,"d":"25880.98"},{"v":26808.783333333333,"d":"26808.78"},{"v":27080.16666666667,"d":"27080.17"},{"v":27272.683333333334,"d":"27272.68"},26887.65,26423.75]
[3,"Nifty CPSE",2660.25,{"v":2673.9666666666667,"d":"2673.97"},{"v":2631.0833333333335,"d":"2631.08"},{"v":2601.916666666667,"d":"2601.92"},{"v":2559.0333333333338,"d":"2559.03"},{"v":2703.133333333333,"d":"2703.13"},{"v":2746.0166666666664,"d":"2746.02"},{"v":2775.183333333333,"d":"2775.18"},2716.85,2644.8]
[4,"Nifty Infra",3637.05,{"v":3656.5333333333333,"d":"3656.53"},{"v":3597.1666666666665,"d":"3597.17"},{"v":3557.2833333333333,"d":"3557.28"},{"v":3497.9166666666665,"d":"3497.92"},{"v":3696.4166666666665,"d":"3696.42"},{"v":3755.7833333333333,"d":"3755.78"},{"v":3795.6666666666665,"d":"3795.67"},3715.9,3616.65]
[5,"Nifty IT",12570.7,{"v":12535.883333333331,"d":"12535.88"},{"v":12466.616666666663,"d":"12466.62"},{"v":12362.533333333331,"d":"12362.53"},{"v":12293.266666666663,"d":"12293.27"},{"v":12639.966666666664,"d":"12639.97"},{"v":12709.233333333334,"d":"12709.23"},{"v":12813.316666666664,"d":"12813.32"},12605.15,12431.8]
[6,"Nifty PSE",4218.55,4243.05,{"v":4173,"d":"4173.00"},4127.45,{"v":4057.3999999999996,"d":"4057.40"},{"v":4288.6,"d":"4288.60"},{"v":4358.6500000000015,"d":"4358.65"},{"v":4404.200000000001,"d":"4404.20"},4313.1,4197.5]
{"$rows_left_out":229}
{"sheet":"MidCap Intra","index":3,"n_rows":500,"n_cols":13,"rows_kept":500,"merged":[[0,0,0,1],[8,0,9,0],[8,1,9,1],[8,2,9,2],[8,3,9,3],[8,4,8,6],[8,7,8,9]]}
[]
[]
[]
[]
[{"$nulls":11},"Back To Main Page"]
["FOR INTRA DAY TRADING",{"$nulls":9},{"$f":"Main!B10","v":"2018-01-19"}]
[null,null," "]
[]
["Sr.no","Scrip","CLOSE RATE","Pivot Point","Supports",null,null,"Resistances"]
[null,null,"Point",null,"S1","S2","S3","R1","R2","R3","HIGH","LOW","Total Trade Quanity in Lakhs"]
[1,"3MINDIA",18105.35,{"v":18045.100000000002,"d":"18045.10"},{"v":17890.250000000004,"d":"17890.25"},17675.15,{"v":17520.300000000003,"d":"17520.30"},{"v":18260.200000000004,"d":"18260.20"},{"v":18415.050000000003,"d":"18415.05"},{"v":18630.150000000005,"d":"18630.15"},18199.95,17830,0.01208]
[2,"8KMILES",832.3,{"v":836.7666666666668,"d":"836.77"},{"v":812.5333333333335,"d":"812.53"},{"v":792.7666666666668,"d":"792.77"},{"v":768.5333333333335,"d":"768.53"},{"v":856.5333333333335,"d":"856.53"},{"v":880.7666666666669,"d":"880.77"},{"v":900.5333333333335,"d":"900.53"},861,817,2.08636]
[3,"AARTIIND",1112.85,{"v":1113.2833333333333,"d":"1113.28"},{"v":1106.5666666666666,"d":"1106.57"},{"v":1100.2833333333333,"d":"1100.28"},{"v":1093.5666666666666,"d":"1093.57"},{"v":1119.5666666666666,"d":"1119.57"},{"v":1126.2833333333333,"d":"1126.28"},{"v":1132.5666666666666,"d":"1132.57"},1120,1107,0.21356]
[4,"ABAN",232.9,{"v":239.28333333333333,"d":"239.28"},{"v":223.61666666666667,"d":"223.62"},{"v":214.33333333333334,"d":"214.33"},{"v":198.66666666666669,"d":"198.67"},{"v":248.56666666666666,"d":"248.57"},{"v":264.23333333333335,"d":"264.23"},{"v":273.51666666666665,"d":"273.52"},254.95,230,46.01595]
[5,"ABB",1541.9,{"v":1533.9666666666665,"d":"1533.97"},{"v":1502.933333333333,"d":"1502.93"},{"v":1463.9666666666665,"d":"1463.97"},{"v":1432.933333333333,"d":"1432.93"},{"v":1572.933333333333,"d":"1572.93"},{"v":1603.9666666666662,"d":"1603.97"},{"v":1642.933333333333,"d":"1642.93"},1565,1495,1.00083]
{"$rows_left_out":486}
{"sheet":"Bulk Deals","index":4,"n_rows":110,"n_cols":8,"rows_kept":110,"merged":[[4,0,4,1],[4,2,4,3],[6,1,6,2]]}
[" "]
[]
[]
[]
[]
[{"$nulls":4},"Back To Main Page"]
["Subject :","BULK DEAL",null,{"$f":"Main!B10","v":"2018-01-19"}]
[]
["Date","Scrip code","Scrip Name","Client Name","Buy / Sell","Quantity Traded","Trade Price / Wt.Avg.trade price","Exchange  "]
["2018-01-18",531179,"ARMANFIN","PARAM CAPITAL","BUY",{"v":325000,"d":"325,000"},255.5,"BSE"]
["2018-01-18",531179,"ARMANFIN","RELIANCE MUTUAL FUND","SELL",{"v":394798,"d":"394,798"},255.5,"BSE"]
["2018-01-18",531467,"ARNAVCORP","BP FINTRADE PRIVATE LIMITED","SELL",{"v":147009,"d":"147,009"},0.35,"BSE"]
["2018-01-18",531467,"ARNAVCORP","BP FINTRADE PRIVATE LIMITED","BUY",{"v":700014,"d":"700,014"},0.35,"BSE"]
["2018-01-18",531467,"ARNAVCORP","GEETHANJALI KALLE","BUY",{"v":500000,"d":"500,000"},0.35,"BSE"]
["2018-01-18",531467,"ARNAVCORP","SHRIRAM CREDIT COMPANY LIMITED","SELL",{"v":515946,"d":"515,946"},0.35,"BSE"]
{"$rows_left_out":96}
{"sheet":"Call Tracker (Equity & F&O)","index":5,"n_rows":283,"n_cols":19,"rows_kept":283,"merged":[[8,9,8,10],[9,9,9,10],[10,9,10,10],[11,9,11,10],[12,9,12,10],[13,9,13,10],[14,9,14,10],[15,9,15,10],[16,9,16,10],[17,9,17,10],[18,9,18,10],[19,9,19,10],[20,9,20,10],[21,9,21,10],[22,9,22,10],[23,9,23,10],[24,9,24,10],[25,9,25,10],[26,9,26,10],[27,9,27,10],[28,9,28,10],[29,9,29,10],[30,9,30,10],[31,9,31,10],[32,9,32,10],[33,9,33,10],[34,9,34,10],[35,9,35,10],[36,9,36,10],[37,9,37,10],[38,9,38,10],[39,9,39,10],[40,9,40,10],[41,9,41,10],[42,9,42,10],[43,9,43,10],[44,9,44,10],[45,9,45,10],[46,9,46,10],[47,9,47,10],[48,9,48,10],[49,9,49,10],[50,9,50,10],[51,9,51,10],[52,9,52,10],[53,9,53,10],[54,9,54,10],[55,9,55,10],[56,9,56,10],[57,9,57,10],[59,9,59,10],[64,9,64,10],[65,9,65,10],[66,0,67,0],[66,1,67,1],[66,6,67,6],[66,8,67,8],[66,9,67,10],[66,13,67,13],[66,14,67,14],[66,15,67,15],[68,9,68,10],[69,9,69,10],[70,9,70,10],[71,9,71,10],[76,9,76,10],[78,9,78,10],[79,9,79,10],[80,9,80,10],[81,9,81,10],[82,9,82,10],[83,9,83,10],[84,9,84,10],[85,9,85,10],[86,9,86,10],[87,9,87,10],[89,9,89,10],[91,9,91,10],[92,9,92,10],[93,9,93,10],[94,9,94,10],[95,9,95,10],[96,9,96,10],[97,9,97,10],[98,9,98,10],[99,9,99,10],[100,9,100,10],[101,9,101,10],[102,9,102,10],[103,9,103,10],[104,9,104,10],[105,9,105,10],[106,9,106,10],[107,9,107,10],[108,9,108,10],[109,9,109,10],[110,9,110,10],[120,9,120,10],[121,9,121,10],[129,9,129,10],[130,9,130,10],[131,9,131,10],[132,9,132,10],[133,9,133,10],[134,9,134,10],[135,9,135,10],[136,9,136,10],[137,9,137,10],[138,9,138,10],[139,9,139,10],[140,9,140,10],[141,9,141,10],[143,9,143,10],[148,9,148,10],[149,9,149,10],[150,9,150,10],[151,9,151,10],[152,9,152,10],[153,9,153,10],[154,9,154,10],[155,9,155,10],[157,9,157,10],[158,9,158,10],[159,9,159,10],[160,9,160,10],[161,9,161,10],[162,9,162,10],[163,9,163,10],[164,9,164,10],[165,9,165,10],[166,9,166,10],[167,9,167,10],[168,9,168,10],[169,9,169,10],[170,9,170,10],[171,9,171,10],[172,9,172,10],[173,9,173,10],[174,9,174,10],[175,9,175,10],[176,9,176,10],[177,9,177,10],[178,9,178,10],[179,9,179,10],[180,9,180,10],[181,9,181,10],[182,9,182,10],[183,9,183,10],[184,9,184,10],[185,9,185,10],[186,9,186,10],[187,9,187,10],[188,9,188,10],[189,9,189,10],[190,9,190,10],[191,9,191,10],[192,9,192,10],[193,9,193,10],[194,9,194,10],[195,9,195,10],[196,9,196,10],[197,9,197,10],[198,9,198,10],[199,9,199,10],[200,9,200,10],[201,9,201,10],[202,9,202,10],[203,9,203,10],[204,9,204,10],[205,9,205,10],[206,9,206,10],[207,9,207,10],[208,9,208,10],[209,9,209,10],[210,9,210,10],[211,9,211,10],[212,9,212,10],[213,9,213,10],[214,9,214,10],[215,9,215,10],[216,9,216,10],[217,9,217,10],[218,9,218,10],[219,9,219,10],[220,9,220,10],[221,9,221,10],[222,9,222,10],[223,9,223,10],[225,9,225,10],[226,9,226,10],[227,9,227,10],[228,9,228,10],[229,9,229,10],[230,9,230,10],[231,9,231,10],[232,9,232,10],[233,9,233,10],[234,9,234,10],[235,9,235,10],[236,9,236,10],[237,9,237,10],[238,9,238,10],[239,9,239,10],[240,9,240,10],[241,9,241,10],[242,9,242,10],[243,9,243,10],[244,9,244,10],[245,9,245,10],[246,9,246,10],[247,9,247,10],[248,9,248,10],[249,9,249,10],[250,9,250,10],[251,9,251,10],[252,9,252,10],[253,9,253,10],[254,9,254,10],[255,9,255,10],[256,9,256,10],[257,9,257,10],[258,9,258,10],[259,9,259,10],[260,9,260,10],[261,9,261,10],[262,9,262,10],[263,9,263,10],[264,9,264,10],[265,9,265,10],[266,9,266,10],[267,9,267,10],[268,9,268,10],[269,9,269,10],[270,10,270,11]]}
[]
[]
[]
[]
[{"$nulls":13},"Back To Main Page"]
["Retail Research Technical Calls & Fundamental Performance Report for the month of January -2018 "]
[{"$nulls":13},{"$f":"Main!B10","v":"2018-01-19"}]
[null,"Positional  Call"]
["Sr.no","Date",null,"Company","Rec","Rec Price","Stop Loss***","Call Closed At","Target","Remark",null,"Profit / Loss per Share","Gain / Loss  %","Status","Closed Date","NSE Closed Price"]
[1,"2017-12-07",null,"ITC","Buy$",260,232,273.75,300,"Part Profit of Rs.13.75/-",null,{"$f":"H10-F10","v":13.75},{"$f":"L10/F10","v":{"v":0.052884615384615384,"d":"5.29%"}},"Successful","2018-01-18",{"$nulls":3},"H"]
[2,"2017-10-31",null,"SBIN","Sell",306.5,336,296,240,"Profit of Rs.10.50/-",null,{"$f":"F11-H11","v":{"v":10.5,"d":"10.50"}},{"$f":"L11/F11","v":{"v":0.03425774877650897,"d":"3.43%"}},"Successful","2018-01-16",{"$nulls":3},"P"]
[3,"2017-11-03",null,"AXISBANK","Sell",545,595,null,445,"Open",{"$nulls":5},{"$f":"VLOOKUP(D12,Sheet2!$A$1:M1953,6,0)","v":584.8},null,null,"P"]
[4,"2017-11-06",null,"KOTAKBANK","Buy",1010,968,{"$f":"(1024+1041)/2","v":1032.5},"1080-1100","Profit of Rs.22.5/-",null,{"$f":"H13-F13","v":{"v":22.5,"d":"22.50"}},{"$f":"L13/F13","v":{"v":0.022277227722772276,"d":"2.23%"}},"Successful","2018-01-12",{"$nulls":3},"H"]
[5,"2017-11-15",null,"IDFCBANK","Buy",54.7,50,57.1,62.7,"Profit of Rs.2.40/-",null,{"v":2.3999999999999986,"d":"2.40"},{"v":0.04387568555758681,"d":"4.39%"},"Successful","2017-01-05",{"$nulls":3},"P"]
[6,"2017-12-07",null,"BANKBARODA","Buy",167.5,159,{"$f":"(173+158.5)/2","v":165.75},"185-190","Loss of Rs.1.75/-",null,{"$f":"H15-F15","v":-1.75},{"$f":"L15/F15","v":{"v":-0.010447761194029851,"d":"-1.04%"}},"Unsuccessful","2018-01-03",{"$nulls":3},"H"]
{"$rows_left_out":263}
{"sheet":"Sheet2","index":6,"n_rows":1388,"n_cols":13,"rows_kept":1388,"hidden":true}
["SYMBOL","SERIES","OPEN","HIGH","LOW","CLOSE","LAST","PREVCLOSE","TOTTRDQTY","TOTTRDVAL","TIMESTAMP","TOTALTRADES","ISIN"]
["20MICRONS","EQ",60,60,55.05,55.7,55.6,57.15,98295,5586625.2,"2018-01-18",893,"INE144J01027"]
["3IINFOTECH","EQ",7.5,8.05,7.4,7.4,7.4,7.75,23711265,178417004.25,"2018-01-18",6093,"INE748C01020"]
["3MINDIA","EQ",18008.4,18199.95,17830,18105.35,18110,18008.4,1208,21839098.3,"2018-01-18",429,"INE470A01017"]
["5PAISA","EQ",334,344.95,321.15,331.5,327.5,328.55,58965,19972804.55,"2018-01-18",1379,"INE618L01018"]
["63MOONS","EQ",113,117.75,103.85,107.35,106.5,111.9,564220,63594726.7,"2018-01-18",5755,"INE111B01023"]
["8KMILES","EQ",822,861,817,832.3,830,815.4,208636,176019839.3,"2018-01-18",8558,"INE650K01021"]
["A2ZINFRA","EQ",42.4,42.7,38.3,39.3,39.35,42.05,2597778,104187077.45,"2018-01-18",7573,"INE619I01012"]
["AARTIDRUGS","EQ",734.8,734.8,707.6,715.95,715,740.3,15230,11053298.5,"2018-01-18",955,"INE767A01016"]
["AARTIIND","EQ",1107,1120,1107,1112.85,1114.55,1112.4,21356,23797583.95,"2018-01-18",1398,"INE769A01020"]
["AARVEEDEN","EQ",52.5,56.65,49.55,54.55,54.6,51.5,1064760,59454050.8,"2018-01-18",5977,"INE273D01019"]
["ABAN","EQ",248.5,254.95,230,232.9,232.55,246,4601595,1128115102,"2018-01-18",42191,"INE421A01028"]
["ABB","EQ",1552,1565,1495,1541.9,1550,1548.5,100083,153274532.15,"2018-01-18",7826,"INE117A01022"]
["ABBOTINDIA","EQ",5475,5539.5,5390.05,5435.7,5400,5463.85,4179,22941981.3,"2018-01-18",1000,"INE358A01014"]
["ABCAPITAL","EQ",182.45,182.9,176,176.6,176.75,181.6,2991306,535182223.75,"2018-01-18",32282,"INE674K01013"]
{"$rows_left_out":1374}
{"sheet":"Sheet1","index":7,"n_rows":0,"n_cols":0,"rows_kept":0,"hidden":true}

{"sheet":"Sheet3","index":8,"n_rows":0,"n_cols":0,"rows_kept":0,"hidden":true}

{"sheet":"Sheet4","index":9,"n_rows":0,"n_cols":0,"rows_kept":0,"hidden":true}

{"sheet":"Sheet5","index":10,"n_rows":0,"n_cols":0,"rows_kept":0,"hidden":true}

{"sheet":"Call Tracker (Currency)","index":11,"n_rows":58,"n_cols":18,"rows_kept":58,"merged":[[1,8,1,9],[2,8,2,9],[3,8,3,9],[4,8,4,9],[5,8,5,9],[6,8,6,9],[7,8,7,9],[8,8,8,9],[9,8,9,9],[10,8,10,9],[11,8,11,9],[12,8,12,9],[13,8,13,9],[14,8,14,9],[15,8,15,9],[16,8,16,9],[17,8,17,9],[18,8,18,9],[19,8,19,9],[20,8,20,9],[21,8,21,9],[22,8,22,9],[23,8,23,9],[24,8,24,9],[25,8,25,9],[26,8,26,9],[27,8,27,9],[28,8,28,9],[29,8,29,9],[30,8,30,9],[31,8,31,9],[32,8,32,9],[33,8,33,9],[34,8,34,9],[35,8,35,9],[36,8,36,9],[37,8,37,9],[38,8,38,9],[39,8,39,9],[40,8,40,9],[41,8,41,9],[42,8,42,9],[43,8,43,9],[44,8,44,9],[45,8,45,9],[46,8,46,9],[47,8,47,9],[48,8,48,9],[49,8,49,9],[50,8,50,9],[51,8,51,9],[52,8,52,9],[53,8,53,9],[54,8,54,9],[55,8,55,9],[56,8,56,9],[57,8,57,9],[58,8,58,9],[59,8,59,9],[60,8,60,9],[61,8,61,9],[62,8,62,9],[63,8,63,9],[64,8,64,9],[65,8,65,9],[66,8,66,9],[67,8,67,9],[68,8,68,9],[69,8,69,9],[70,8,70,9],[71,8,71,9],[72,8,72,9],[73,8,73,9],[74,8,74,9],[75,8,75,9],[76,8,76,9],[77,8,77,9],[78,8,78,9],[79,8,79,9],[80,8,80,9],[81,8,81,9],[82,8,82,9],[83,8,83,9],[84,8,84,9],[85,8,85,9],[86,8,86,9],[87,8,87,9],[88,8,88,9],[89,8,89,9],[90,8,90,9],[91,8,91,9],[92,8,92,9],[93,8,93,9],[94,8,94,9],[95,8,95,9],[96,8,96,9],[97,8,97,9],[98,8,98,9],[99,8,99,9],[100,8,100,9],[101,8,101,9],[102,8,102,9],[103,8,103,9],[104,8,104,9],[105,8,105,9],[106,8,106,9],[107,8,107,9],[108,8,108,9],[109,8,109,9],[110,8,110,9],[111,8,111,9],[112,8,112,9],[113,8,113,9],[114,8,114,9],[115,8,115,9],[116,8,116,9],[117,8,117,9],[118,8,118,9],[119,8,119,9],[120,8,120,9],[121,8,121,9],[122,8,122,9],[123,8,123,9],[124,8,124,9]]}
["Master Trade High Risk"]
["Sr.no","Date","Company","Rec","Rec Price","Stop Loss","Call Closed At","Target","Remark",null,"Profit / Loss per share","Gain / Loss  per Lot","Lot","Status","Closed Date"]
[1,"2017-05-08","USDINR MAY FUT","Buy",64.3935,64.29,64.66,64.59,"Profit of Rs.0.27/-",null,{"v":0.2664999999999935,"d":"0.27"},266.4999999999935,1000,"Successful","2017-05-09",null,null,"P"]
[2,"2017-05-08","USDINR JUN FUT","Buy",64.6535,64.45,64.965,65.05,"Profit of Rs 0.31/-",null,{"v":0.31150000000000944,"d":"0.31"},311.50000000000944,1000,"Successful","2017-05-09",null,null,"P"]
[3,"2017-05-09","EUROINR MAY FUT","Sell",70.65,70.8,70.07,70.4,"Profit of Rs 0.58/-",null,{"v":0.580000000000013,"d":"0.58"},580.00000000001,1000,"Successful","2017-05-12",null,null,"P"]
[4,"2017-05-09","GBPINR MAY FUT","Buy",83.774,83.37,83.37,84.77,"Loss of Rs 0.40/-",null,{"v":-0.40399999999999636,"d":"-0.40"},-403.99999999999636,1000,"Unsuccessful","2017-05-11",null,null,"P"]
[5,"2017-05-11","USDINR MAY FUT","Buy",64.6555,64.55,64.55,64.86,"Loss of Rs.0.1055/-",null,-0.10550000000000637,{"$f":"K7*M7","v":{"v":-105.50000000000637,"d":"-105.50"}},1000,"Unsuccessful","2017-05-11",null,null,"P"]
[6,"2017-05-15","USDINR MAY FUT","Buy",64.2275,64.08,64.46,64.48,"Profit of Rs 0.23/-",null,{"v":0.2324999999999875,"d":"0.23"},232.4999999999875,1000,"Successful","2017-05-18",null,null,"P"]
[7,"2017-05-19","USDINR MAY FUT","Sell",64.83,65,65,64.5,"Loss of Rs.0.17/-",null,{"v":-0.1700000000000017,"d":"-0.17"},-170.0000000000017,1000,"Unsuccessful","2017-05-19",null,null,"P"]
[8,"2017-05-23","USDINR MAY FUT","Buy",64.83,64.62,64.95,65.2,"Profit of Rs 0.12/-",null,{"v":0.12000000000000455,"d":"0.12"},120.00000000000455,1000,"Successful","2017-05-24",null,null,"P"]
[9,"2017-05-25","USDINR MAY FUT","Buy",64.57,64.25,64.56,65,"Loss of Rs.0.01/-",null,-0.009999999999990905,-9.999999999990905,1000,"Neutral","2017-05-29",null,null,"P"]
[10,"2017-05-30","USDINR JUN FUT","Buy",64.9125,64.71,64.71,65.31,"Loss of Rs.0.20/-",null,{"v":-0.20250000000000057,"d":"-0.20"},-202.50000000000057,1000,"Unsuccessful","2017-05-31",null,null,"P"]
[11,"2017-06-01","USDINR JUN FUT","Buy",64.655,64.45,64.45,65.05,"Loss of Rs.0.20/-",null,{"$f":"G13-E13","v":{"v":-0.2049999999999983,"d":"-0.20"}},{"$f":"K13*M13","v":-204.9999999999983},{"v":1000,"d":"1000.00"},"Unsuccessful","2017-06-08",null,null,"P"]
[12,"2017-06-12","USDINR JUN FUT","Buy",64.45,64,64.7625,65.2,"Profit of Rs 0.31/-",null,{"v":0.3125,"d":"0.31"},312.5,1000,"Successful","2017-06-16"]
[13,"2017-06-16","USDINR JUN FUT","Buy",64.51,64.2,64.7,65.11,"Profit of Rs 0.19/-",null,{"v":0.18999999999999773,"d":"0.19"},189.99999999999773,1000,"Successful","2017-06-21"]
{"$rows_left_out":43}