{"text_format":"3","workbook":"xlsx","n_sheets":10,"sheets":["Main","Future Intra","Cash Intra","MidCap Intra","Bulk Deals","Call Tracker (Equity & F&O)","Call Tracker (Currency)","Sheet2","Sheet1","Sheet3"],"not_rendered":{"images":4,"defined_names":4},"read":"whole","date_system":"1900"}

{"sheet":"Main","index":0,"n_rows":17,"n_cols":4,"rows_kept":17}
[null,"                                                                                                 "]
{"$rows_empty":8}
[null,"2018-05-22"]
[]
[null,"Sheet No.","Template Name","Summary"]
[null,1,"Future Intra","For Intraday trading in F&O segment"]
[null,2,"Cash Intra","For Intraday trading in cash market segment"]
[null,3,"Mid-cap Intra","For Intraday trading in Mid-cap stocks"]
[null,4,"Bulk Deals","Reveals Bulk Deals carried on NSE & BSE"]
[null,5,"Call Tracker"]

{"sheet":"Future Intra","index":1,"n_rows":250,"n_cols":15,"rows_kept":250,"merged":[[8,0,9,0],[8,1,9,1],[8,2,9,2],[8,5,8,7],[8,8,8,10]]}
[]
[]
[]
[]
[{"$nulls":12},"Back to Main Page"]
["FOR INTRA DAY TRADING",{"$nulls":10},{"$f":"Main!B10","v":"2018-05-22"}]
[]
[]
["Sr.no","Sector","Scrip","CLOSE RATE","Pivot Point","Supports",null,null,"Resistances"]
[null,"Sector",null,"Point","Point","S1","S2","S3","R1","R2","R3","HIGH","LOW","OI","% Change in OI"]
[1,"Index","BANKNIFTY",25801.95,{"v":25864.8,"d":"25864.80"},{"v":25659.6,"d":"25659.60"},25517.25,25312.05,{"v":26007.149999999998,"d":"26007.15"},{"v":26212.350000000002,"d":"26212.35"},{"v":26354.699999999997,"d":"26354.70"},26070,25722.45,3094360,{"v":0.021065691696474532,"d":"2.11%"}]
[2,"Index","NIFTY",10538.75,10563.35,{"v":10496.7,"d":"10496.70"},10454.65,{"v":10388,"d":"10388.00"},{"v":10605.400000000001,"d":"10605.40"},10672.05,{"v":10714.100000000002,"d":"10714.10"},10630,10521.3,24740925,{"v":-0.030993155714831244,"d":"-3.10%"}]
[3,"Index","NIFTYCPSE",{"v":2627.4,"d":"2627.40"},{"v":875.8000000000001,"d":"875.80"},{"v":1751.6000000000001,"d":"1751.60"},{"v":875.8000000000001,"d":"875.80"},{"v":1751.6000000000001,"d":"1751.60"},{"v":1751.6000000000001,"d":"1751.60"},{"v":875.8000000000001,"d":"875.80"},{"v":1751.6000000000001,"d":"1751.60"},0,0,0,{"v":0,"d":"0.00%"}]
[4,"Index","NIFTYINFRA",{"v":3441.1,"d":"3441.10"},{"v":1147.0333333333333,"d":"1147.03"},{"v":2294.0666666666666,"d":"2294.07"},{"v":1147.0333333333333,"d":"1147.03"},{"v":2294.0666666666666,"d":"2294.07"},{"v":2294.0666666666666,"d":"2294.07"},{"v":1147.0333333333333,"d":"1147.03"},{"v":2294.0666666666666,"d":"2294.07"},0,0,0,{"v":0,"d":"0.00%"}]
[5,"Index","NIFTYIT",{"v":13498,"d":"13498.00"},{"v":13509.666666666666,"d":"13509.67"},{"v":13454.333333333332,"d":"13454.33"},{"v":13410.666666666666,"d":"13410.67"},{"v":13355.333333333332,"d":"13355.33"},{"v":13553.333333333332,"d":"13553.33"},{"v":13608.666666666664,"d":"13608.67"},{"v":13652.333333333332,"d":"13652.33"},13565,13466,57550,{"v":-0.013710368466152529,"d":"-1.37%"}]
[6,"Index","NIFTYMID50",{"v":5142,"d":"5142.00"},{"v":1714,"d":"1714.00"},{"v":3428,"d":"3428.00"},{"v":1714,"d":"1714.00"},{"v":3428,"d":"3428.00"},{"v":3428,"d":"3428.00"},{"v":1714,"d":"1714.00"},{"v":3428,"d":"3428.00"},0,0,591800,{"v":0,"d":"0.00%"}]
[7,"Index","NIFTYPSE",4077.45,{"v":1359.1499999999999,"d":"1359.15"},{"v":2718.2999999999997,"d":"2718.30"},{"v":1359.1499999999999,"d":"1359.15"},{"v":2718.2999999999997,"d":"2718.30"},{"v":2718.2999999999997,"d":"2718.30"},{"v":1359.1499999999999,"d":"1359.15"},{"v":2718.2999999999997,"d":"2718.30"},0,0,0,{"v":0,"d":"0.00%"}]
[8,"Cement","ACC",1348.55,{"v":1353.3166666666666,"d":"1353.32"},{"v":1324.2333333333331,"d":"1324.23"},{"v":1299.9166666666665,"d":"1299.92"},{"v":1270.833333333333,"d":"1270.83"},{"v":1377.6333333333332,"d":"1377.63"},{"v":1406.7166666666667,"d":"1406.72"},{"v":1431.0333333333333,"d":"1431.03"},1382.4,1329,2750000,{"v":0.04690117252931323,"d":"4.69%"}]
[9,"Others","ADANIENT",{"v":118.7,"d":"118.70"},{"v":118.64999999999999,"d":"118.65"},{"v":116.24999999999999,"d":"116.25"},{"v":113.8,"d":"113.80"},{"v":111.39999999999999,"d":"111.40"},{"v":121.09999999999998,"d":"121.10"},{"v":123.49999999999999,"d":"123.50"},{"v":125.94999999999997,"d":"125.95"},121.05,116.2,13680000,{"v":-0.06327033689400165,"d":"-6.33%"}]
[10,"Others","ADANIPORTS",{"v":385.3,"d":"385.30"},{"v":386.6333333333334,"d":"386.63"},{"v":380.76666666666677,"d":"380.77"},{"v":376.2333333333334,"d":"376.23"},{"v":370.3666666666668,"d":"370.37"},{"v":391.16666666666674,"d":"391.17"},{"v":397.0333333333334,"d":"397.03"},{"v":401.5666666666667,"d":"401.57"},392.5,382.1,16207500,{"v":0.005739993794601303,"d":"0.57%"}]
{"$rows_left_out":224}
{"sheet":"Cash Intra","index":2,"n_rows":248,"n_cols":13,"rows_kept":248,"merged":[[7,0,8,0],[7,1,8,1],[7,2,8,2],[7,3,8,3],[7,4,7,6],[7,7,7,9]]}
[]
[]
[]
[]
[{"$nulls":12},"Back to Main Page"]
["FOR INTRA DAY TRADING",{"$nulls":9},{"$f":"Main!B10","v":"2018-05-22"}]
[]
["Sr.no","Scrip","CLOSE RATE","Pivot Point","Supports",null,null,"Resistances"]
[null,null,"Point",null,"S1","S2","S3","R1","R2","R3","HIGH","LOW","Total Trade Quanity in Lakhs"]
[1,"Nifty 50",10516.7,{"v":10548.066666666668,"d":"10548.07"},{"v":10474.433333333334,"d":"10474.43"},{"v":10432.166666666666,"d":"10432.17"},{"v":10358.533333333333,"d":"10358.53"},{"v":10590.333333333336,"d":"10590.33"},{"v":10663.96666666667,"d":"10663.97"},{"v":10706.233333333337,"d":"10706.23"},10621.7,10505.8]
[2,"Nifty Bank",25750.8,{"v":25834.3,"d":"25834.30"},25601.85,{"v":25452.899999999998,"d":"25452.90"},{"v":25220.449999999997,"d":"25220.45"},25983.25,{"v":26215.700000000004,"d":"26215.70"},26364.65,26066.75,25685.35]
[3,"Nifty CPSE",2362.65,2364.65,{"v":2353.7000000000003,"d":"2353.70"},2344.75,{"v":2333.8,"d":"2333.80"},{"v":2373.6000000000004,"d":"2373.60"},2384.55,{"v":2393.5000000000005,"d":"2393.50"},2375.6,2355.7]
[4,"Nifty Infra",3248.65,{"v":3261.8333333333335,"d":"3261.83"},{"v":3230.966666666667,"d":"3230.97"},{"v":3213.2833333333338,"d":"3213.28"},{"v":3182.4166666666674,"d":"3182.42"},{"v":3279.516666666667,"d":"3279.52"},{"v":3310.3833333333328,"d":"3310.38"},{"v":3328.0666666666666,"d":"3328.07"},3292.7,3244.15]
[5,"Nifty IT",13483.85,{"v":13496.699999999999,"d":"13496.70"},{"v":13421.249999999998,"d":"13421.25"},13358.65,{"v":13283.199999999999,"d":"13283.20"},{"v":13559.299999999997,"d":"13559.30"},{"v":13634.749999999998,"d":"13634.75"},{"v":13697.349999999997,"d":"13697.35"},13572.15,13434.1]
[6,"Nifty PSE",3769.5,{"v":3773.6666666666665,"d":"3773.67"},{"v":3757.033333333333,"d":"3757.03"},{"v":3744.566666666666,"d":"3744.57"},{"v":3727.9333333333325,"d":"3727.93"},{"v":3786.133333333333,"d":"3786.13"},{"v":3802.7666666666673,"d":"3802.77"},{"v":3815.2333333333336,"d":"3815.23"},3790.3,3761.2]
[7,"Nifty Midcap 50",4936.25,{"v":4955.766666666666,"d":"4955.77"},{"v":4895.483333333333,"d":"4895.48"},{"v":4854.716666666666,"d":"4854.72"},{"v":4794.4333333333325,"d":"4794.43"},{"v":4996.533333333333,"d":"4996.53"},{"v":5056.816666666666,"d":"5056.82"},{"v":5097.583333333333,"d":"5097.58"},5016.05,4915]
[8,"ABB",1200.2,{"v":1210.6833333333334,"d":"1210.68"},{"v":1187.5166666666669,"d":"1187.52"},{"v":1174.8333333333335,"d":"1174.83"},{"v":1151.666666666667,"d":"1151.67"},{"v":1223.3666666666668,"d":"1223.37"},{"v":1246.5333333333333,"d":"1246.53"},{"v":1259.2166666666667,"d":"1259.22"},1233.85,1198,0.20256]
[9,"ACC",1344.1,{"v":1348.8666666666666,"d":"1348.87"},{"v":1317.833333333333,"d":"1317.83"},{"v":1291.5666666666664,"d":"1291.57"},{"v":1260.5333333333328,"d":"1260.53"},{"v":1375.1333333333332,"d":"1375.13"},{"v":1406.1666666666665,"d":"1406.17"},{"v":1432.4333333333334,"d":"1432.43"},1379.9,1322.6,3.80473]
[10,"AIAENG",1534.7,{"v":1548.2333333333333,"d":"1548.23"},{"v":1511.4666666666667,"d":"1511.47"},{"v":1488.2333333333333,"d":"1488.23"},{"v":1451.4666666666667,"d":"1451.47"},{"v":1571.4666666666667,"d":"1571.47"},{"v":1608.2333333333336,"d":"1608.23"},{"v":1631.4666666666667,"d":"1631.47"},1585,1525,0.28511]
[11,"AUBANK",704.6,{"v":707.5500000000001,"d":"707.55"},{"v":694.4000000000001,"d":"694.40"},{"v":684.2,"d":"684.20"},{"v":671.0500000000001,"d":"671.05"},{"v":717.7500000000001,"d":"717.75"},{"v":730.9,"d":"730.90"},{"v":741.1000000000001,"d":"741.10"},720.7,697.35,2.77081]
{"$rows_left_out":229}
{"sheet":"MidCap Intra","index":3,"n_rows":511,"n_cols":13,"rows_kept":511,"merged":[[0,0,0,1],[8,0,9,0],[8,1,9,1],[8,2,9,2],[8,3,9,3],[8,4,8,6],[8,7,8,9]]}
[]
[]
[]
[]
[{"$nulls":11},"Back To Main Page"]
["FOR INTRA DAY TRADING",{"$nulls":9},{"$f":"Main!B10","v":"2018-05-22"}]
[null,null," "]
[]
["Sr.no","Scrip","CLOSE RATE","Pivot Point","Supports",null,null,"Resistances"]
[null,null,"Point",null,"S1","S2","S3","R1","R2","R3","HIGH","LOW","Total Trade Quanity in Lakhs"]
[1,"3MINDIA",19251.75,{"v":19483.899999999998,"d":"19483.90"},{"v":18967.849999999995,"d":"18967.85"},{"v":18683.949999999997,"d":"18683.95"},{"v":18167.899999999994,"d":"18167.90"},{"v":19767.799999999996,"d":"19767.80"},20283.85,{"v":20567.749999999996,"d":"20567.75"},19999.95,19200,0.01115]
[2,"8KMILES",528.7,546.75,{"v":492,"d":"492.00"},{"v":455.3,"d":"455.30"},400.55,583.45,{"v":638.2,"d":"638.20"},{"v":674.9,"d":"674.90"},601.5,510.05,4.9203]
[3,"AARTIIND",1222.55,{"v":1225.3666666666666,"d":"1225.37"},{"v":1193.283333333333,"d":"1193.28"},{"v":1164.0166666666664,"d":"1164.02"},{"v":1131.933333333333,"d":"1131.93"},{"v":1254.6333333333332,"d":"1254.63"},{"v":1286.7166666666667,"d":"1286.72"},{"v":1315.9833333333333,"d":"1315.98"},1257.45,1196.1,0.43376]
[4,"ABAN",156.55,157.35,152.75,{"v":148.95000000000002,"d":"148.95"},{"v":144.35000000000002,"d":"144.35"},{"v":161.14999999999998,"d":"161.15"},{"v":165.74999999999994,"d":"165.75"},{"v":169.54999999999995,"d":"169.55"},161.95,153.55,7.00706]
[5,"ABB",1200.2,{"v":1210.6833333333334,"d":"1210.68"},{"v":1187.5166666666669,"d":"1187.52"},{"v":1174.8333333333335,"d":"1174.83"},{"v":1151.666666666667,"d":"1151.67"},{"v":1223.3666666666668,"d":"1223.37"},{"v":1246.5333333333333,"d":"1246.53"},{"v":1259.2166666666667,"d":"1259.22"},1233.85,1198,0.20256]
[6,"ABCAPITAL",143.85,145.25,{"v":141.6,"d":"141.60"},139.35,{"v":135.7,"d":"135.70"},{"v":147.5,"d":"147.50"},{"v":151.14999999999998,"d":"151.15"},{"v":153.4,"d":"153.40"},148.9,143,17.89491]
[7,"ABFRL",140.4,{"v":141.4,"d":"141.40"},138.05,{"v":135.70000000000002,"d":"135.70"},{"v":132.35000000000002,"d":"132.35"},143.75,{"v":147.09999999999997,"d":"147.10"},149.45,144.75,139.05,2.28887]
[8,"ACC",1344.1,{"v":1348.8666666666666,"d":"1348.87"},{"v":1317.833333333333,"d":"1317.83"},{"v":1291.5666666666664,"d":"1291.57"},{"v":1260.5333333333328,"d":"1260.53"},{"v":1375.1333333333332,"d":"1375.13"},{"v":1406.1666666666665,"d":"1406.17"},{"v":1432.4333333333334,"d":"1432.43"},1379.9,1322.6,3.80473]
[9,"ADANIPORTS",383.7,{"v":385.9166666666667,"d":"385.92"},{"v":379.28333333333336,"d":"379.28"},{"v":374.8666666666667,"d":"374.87"},{"v":368.23333333333335,"d":"368.23"},{"v":390.33333333333337,"d":"390.33"},{"v":396.9666666666667,"d":"396.97"},{"v":401.3833333333334,"d":"401.38"},392.55,381.5,15.44488]
[10,"ADANIPOWER",20.7,{"v":20.849999999999998,"d":"20.85"},{"v":20.149999999999995,"d":"20.15"},{"v":19.599999999999998,"d":"19.60"},{"v":18.899999999999995,"d":"18.90"},{"v":21.399999999999995,"d":"21.40"},{"v":22.099999999999998,"d":"22.10"},{"v":22.649999999999995,"d":"22.65"},21.55,20.3,71.86536]
{"$rows_left_out":492}
{"sheet":"Bulk Deals","index":4,"n_rows":76,"n_cols":8,"rows_kept":76,"merged":[[4,0,4,1],[4,2,4,3],[6,1,6,2]]}
[" "]
[]
[]
[]
[]
[{"$nulls":4},"Back To Main Page"]
["Subject :","BULK DEAL",null,{"$f":"Main!B10","v":"2018-05-22"}]
[]
["Date","Scrip code","Scrip Name","Client Name","Buy / Sell","Quantity Traded","Trade Price / Wt.Avg.trade price","Exchange  "]
["2018-05-21",540697,"AMFL","SAGAR RAJESHBHAI JHAVERI","SELL",{"v":80000,"d":"80,000"},13,"BSE"]
["2018-05-21",539545,"APOORVA","TIMES CAPITAL SERVICES PRIVATE LIMITED","BUY",{"v":1619000,"d":"1,619,000"},3.3,"BSE"]
["2018-05-21",539545,"APOORVA","VARIMA EXPORTS PVT LTD","SELL",{"v":1619000,"d":"1,619,000"},3.3,"BSE"]
["2018-05-21",539884,"DARSHANORNA","GUINESS SECURITIES LIMITED","SELL",{"v":26000,"d":"26,000"},90,"BSE"]
["2018-05-21",539884,"DARSHANORNA","VEERAM VENDORS PRIVATELIMITED","BUY",{"v":82000,"d":"82,000"},90,"BSE"]
["2018-05-21",536507,"FLFL","PIONEER INVESTMENT FUND","SELL",{"v":3895435,"d":"3,895,435"},434,"BSE"]
["2018-05-21",536507,"FLFL","SPECTACULAR INVESTMENTS PTE LIMITED","BUY",{"v":15581743,"d":"15,581,743"},434,"BSE"]
["2018-05-21",536507,"FLFL","PIONEER INVESTMENT FUND","SELL",{"v":3895436,"d":"3,895,436"},434,"BSE"]
["2018-05-21",536507,"FLFL","FUTURE IDEAS COMPANY LIMITED","SELL",{"v":1886619,"d":"1,886,619"},435.12,"BSE"]
["2018-05-21",536507,"FLFL","SUHANI TRADING AND INVESTMENT CONSULTANTS PRIVATE LIMITED","SELL",{"v":5924082,"d":"5,924,082"},435.18,"BSE"]
["2018-05-21",536507,"FLFL","BENNETT COLEMAN & CO LTD","BUY",{"v":3402022,"d":"3,402,022"},438,"BSE"]
{"$rows_left_out":57}
{"sheet":"Call Tracker (Equity & F&O)","index":5,"n_rows":267,"n_cols":18,"rows_kept":267,"merged":[[35,0,36,0],[35,1,36,1],[35,9,36,9],[35,12,36,12],[35,13,36,13],[35,14,36,14]]}
[]
[]
[]
[]
[{"$nulls":12},"Back To Main Page"]
["Retail Research Technical Calls & Fundamental Performance Report for the month of May -2018 "]
[{"$nulls":12},{"$f":"Main!B10","v":"2018-05-22"}]
[null,"Positional  Call"]
["Sr.no","Date",null,"Company","Rec","Rec Price","Stop Loss***","Call Closed At","Target","Remark","Profit / Loss per Share","Gain / Loss  %","Status","Closed Date","NSE Closed Price"]
[1,"2018-02-12",null,"ITC","Buy",271.5,250,285,310,"Profit of Rs.13.5/-",{"$f":"H10-F10","v":13.5},{"$f":"K10/F10","v":{"v":0.049723756906077346,"d":"4.97%"}},"Successful","2018-05-02",{"$nulls":3},"P"]
[1,"2018-04-05",null,"RECLTD","Buy",129,122,121,140,"Loss of Rs.8/-",{"$f":"H11-F11","v":-8},{"$f":"K11/F11","v":{"v":-0.06201550387596899,"d":"-6.20%"}},"Unsuccessful","2018-05-10",{"$nulls":3},"R"]
[2,"2018-04-11",null,"FEDERALBNK","Buy",98.75,94,103.45,"106-109","Profit of Rs.4.7/-",{"$f":"H12-F12","v":4.700000000000003},{"$f":"K12/F12","v":{"v":0.04759493670886079,"d":"4.76%"}},"Successful","2019-05-09",{"$nulls":3},"R"]
[4,"2018-04-18",null,"BHEL","Buy$",{"$f":"(81+88.5)/2","v":84.75},79,78.75,100,"Loss of Rs.6/-",{"$f":"H13-F13","v":-6},{"$f":"K13/F13","v":{"v":-0.07079646017699115,"d":"-7.08%"}},"Unsuccessful","2018-05-14",{"$nulls":3},"A"]
[5,"2018-04-20",null,"HINDZINC","Sell",325.5,340,314.5,"310-305","Profit of Rs.11/-",{"$f":"F14-H14","v":11},{"$f":"K14/F14","v":{"v":0.03379416282642089,"d":"3.38%"}},"Successful","2018-05-02",{"$nulls":3},"H"]
[6,"2018-04-26",null,"HCLTECH","Buy",1060,1018,1015,"1130-1150","Loss of Rs.45/-",{"$f":"H15-F15","v":-45},{"v":-0.04245283018867924,"d":"-4.25%"},"Unsuccessful","2018-05-02",{"$nulls":3},"H"]
[7,"2018-04-27",null,"PFC","Buy",85.8,82.5,89.45,"91-93","Profit of Rs.3.65/-",{"$f":"H16-F16","v":3.6500000000000057},{"v":0.042540792540792606,"d":"4.25%"},"Successful","2018-05-02",{"$nulls":3},"H"]
[8,"2018-04-30",null,"HEXAWARE","Sell",447,464,428.5,"410-400","Profit of Rs.18.5/-",{"$f":"F17-H17","v":18.5},{"v":0.04138702460850112,"d":"4.14%"},"Successful","2018-05-05",{"$nulls":3},"H"]
[9,"2018-05-04",null,"GLENMARK","Buy",544,520,513,"580-585","Loss of Rs.31/-",{"$f":"H18-F18","v":-31},{"v":-0.05698529411764706,"d":"-5.70%"},"Unsuccessful","2018-05-11",{"$nulls":3},"R"]
[10,"2018-05-04",null,"L&TFH","Buy",177.5,169,183.25,"190-195"," Profit of Rs.5.75/-",{"$f":"H19-F19","v":5.75},{"v":0.0323943661971831,"d":"3.24%"},"Successful","2018-05-08",{"$nulls":3},"H"]
[11,"2018-05-04",null,"HCLTECH","Buy","920-930",890,null,"980-990","Open",{"$nulls":4},{"$f":"VLOOKUP(D20,Sheet2!$A$1:M2159,6,0)","v":895.95},null,null,"H"]
{"$rows_left_out":248}
{"sheet":"Call Tracker (Currency)","index":6,"n_rows":58,"n_cols":18,"rows_kept":58,"hidden":true,"merged":[[1,8,1,9],[2,8,2,9],[3,8,3,9],[4,8,4,9],[5,8,5,9],[6,8,6,9],[7,8,7,9],[8,8,8,9],[9,8,9,9],[10,8,10,9],[11,8,11,9],[12,8,12,9],[13,8,13,9],[14,8,14,9],[15,8,15,9],[16,8,16,9],[17,8,17,9],[18,8,18,9],[19,8,19,9],[20,8,20,9],[21,8,21,9],[22,8,22,9],[23,8,23,9],[24,8,24,9],[25,8,25,9],[26,8,26,9],[27,8,27,9],[28,8,28,9],[29,8,29,9],[30,8,30,9],[31,8,31,9],[32,8,32,9],[33,8,33,9],[34,8,34,9],[35,8,35,9],[36,8,36,9],[37,8,37,9],[38,8,38,9],[39,8,39,9],[40,8,40,9],[41,8,41,9],[42,8,42,9],[43,8,43,9],[44,8,44,9],[45,8,45,9],[46,8,46,9],[47,8,47,9],[48,8,48,9],[49,8,49,9],[50,8,50,9],[51,8,51,9],[52,8,52,9],[53,8,53,9],[54,8,54,9],[55,8,55,9],[56,8,56,9],[57,8,57,9],[58,8,58,9],[59,8,59,9],[60,8,60,9],[61,8,61,9],[62,8,62,9],[63,8,63,9],[64,8,64,9],[65,8,65,9],[66,8,66,9],[67,8,67,9],[68,8,68,9],[69,8,69,9],[70,8,70,9],[71,8,71,9],[72,8,72,9],[73,8,73,9],[74,8,74,9],[75,8,75,9],[76,8,76,9],[77,8,77,9],[78,8,78,9],[79,8,79,9],[80,8,80,9],[81,8,81,9],[82,8,82,9],[83,8,83,9],[84,8,84,9],[85,8,85,9],[86,8,86,9],[87,8,87,9],[88,8,88,9],[89,8,89,9],[90,8,90,9],[91,8,91,9],[92,8,92,9],[93,8,93,9],[94,8,94,9],[95,8,95,9],[96,8,96,9],[97,8,97,9],[98,8,98,9],[99,8,99,9],[100,8,100,9],[101,8,101,9],[102,8,102,9],[103,8,103,9],[104,8,104,9],[105,8,105,9],[106,8,106,9],[107,8,107,9],[108,8,108,9],[109,8,109,9],[110,8,110,9],[111,8,111,9],[112,8,112,9],[113,8,113,9],[114,8,114,9],[115,8,115,9],[116,8,116,9],[117,8,117,9],[118,8,118,9],[119,8,119,9],[120,8,120,9],[121,8,121,9],[122,8,122,9],[123,8,123,9],[124,8,124,9]]}
["Master Trade High Risk"]
["Sr.no","Date","Company","Rec","Rec Price","Stop Loss","Call Closed At","Target","Remark",null,"Profit / Loss per share","Gain / Loss  per Lot","Lot","Status","Closed Date"]
[1,"2017-05-08","USDINR MAY FUT","Buy",64.3935,64.29,64.66,64.59,"Profit of Rs.0.27/-",null,{"v":0.2664999999999935,"d":"0.27"},266.4999999999935,1000,"Successful","2017-05-09",null,null,"P"]
[2,"2017-05-08","USDINR JUN FUT","Buy",64.6535,64.45,64.965,65.05,"Profit of Rs 0.31/-",null,{"v":0.31150000000000944,"d":"0.31"},311.50000000000944,1000,"Successful","2017-05-09",null,null,"P"]
[3,"2017-05-09","EUROINR MAY FUT","Sell",70.65,70.8,70.07,70.4,"Profit of Rs 0.58/-",null,{"v":0.580000000000013,"d":"0.58"},580.00000000001,1000,"Successful","2017-05-12",null,null,"P"]
[4,"2017-05-09","GBPINR MAY FUT","Buy",83.774,83.37,83.37,84.77,"Loss of Rs 0.40/-",null,{"v":-0.40399999999999636,"d":"-0.40"},-403.99999999999636,1000,"Unsuccessful","2017-05-11",null,null,"P"]
[5,"2017-05-11","USDINR MAY FUT","Buy",64.6555,64.55,64.55,64.86,"Loss of Rs.0.1055/-",null,-0.10550000000000637,{"$f":"K7*M7","v":{"v":-105.50000000000637,"d":"-105.50"}},1000,"Unsuccessful","2017-05-11",null,null,"P"]
[6,"2017-05-15","USDINR MAY FUT","Buy",64.2275,64.08,64.46,64.48,"Profit of Rs 0.23/-",null,{"v":0.2324999999999875,"d":"0.23"},232.4999999999875,1000,"Successful","2017-05-18",null,null,"P"]
[7,"2017-05-19","USDINR MAY FUT","Sell",64.83,65,65,64.5,"Loss of Rs.0.17/-",null,{"v":-0.1700000000000017,"d":"-0.17"},-170.0000000000017,1000,"Unsuccessful","2017-05-19",null,null,"P"]
[8,"2017-05-23","USDINR MAY FUT","Buy",64.83,64.62,64.95,65.2,"Profit of Rs 0.12/-",null,{"v":0.12000000000000455,"d":"0.12"},120.00000000000455,1000,"Successful","2017-05-24",null,null,"P"]
[9,"2017-05-25","USDINR MAY FUT","Buy",64.57,64.25,64.56,65,"Loss of Rs.0.01/-",null,-0.009999999999990905,-9.999999999990905,1000,"Neutral","2017-05-29",null,null,"P"]
[10,"2017-05-30","USDINR JUN FUT","Buy",64.9125,64.71,64.71,65.31,"Loss of Rs.0.20/-",null,{"v":-0.20250000000000057,"d":"-0.20"},-202.50000000000057,1000,"Unsuccessful","2017-05-31",null,null,"P"]
[11,"2017-06-01","USDINR JUN FUT","Buy",64.655,64.45,64.45,65.05,"Loss of Rs.0.20/-",null,{"$f":"G13-E13","v":{"v":-0.2049999999999983,"d":"-0.20"}},{"$f":"K13*M13","v":-204.9999999999983},{"v":1000,"d":"1000.00"},"Unsuccessful","2017-06-08",null,null,"P"]
[12,"2017-06-12","USDINR JUN FUT","Buy",64.45,64,64.7625,65.2,"Profit of Rs 0.31/-",null,{"v":0.3125,"d":"0.31"},312.5,1000,"Successful","2017-06-16"]
[13,"2017-06-16","USDINR JUN FUT","Buy",64.51,64.2,64.7,65.11,"Profit of Rs 0.19/-",null,{"v":0.18999999999999773,"d":"0.19"},189.99999999999773,1000,"Successful","2017-06-21"]
[14,"2017-06-22","USDINR JUN FUT","Buy",64.56,64.2,64.2,65.1,"Loss of Rs.0.36/-",null,{"v":-0.35999999999999943,"d":"-0.36"},-359.99999999999943,{"v":1000,"d":"1000.00"},"Unsuccessful","2017-06-30"]
[15,"2017-07-10","USDINR JUL FUT","Buy",64.67,64.4,64.4,65.15,"Loss of Rs.0.27/-",null,{"v":-0.269999999999996,"d":"-0.27"},-269.999999999996,{"v":1000,"d":"1000.00"},"Unsuccessful","2017-07-31"]
[16,"2017-08-02","USDINR AUG FUT","Buy",64.235,63.98,63.98,64.75,"Loss of Rs.0.26/-",null,{"v":-0.25500000000000256,"d":"-0.26"},-255.00000000000256,{"v":1000,"d":"1000.00"},"Unsuccessful","2017-08-02"]
[17,"2017-08-08","USDINR AUG FUT","Buy",63.9425,63.6,64.15,64.5,"Profit of Rs 0.21/-",null,{"v":0.20750000000000313,"d":"0.21"},207.50000000000313,1000,"Successful","2017-08-10"]
[18,"2017-08-22","USDINR AUG FUT","Buy",64.1175,63.9,64.01,64.5,"Loss of Rs.0.11/-",null,{"$f":"G20-E20","v":{"v":-0.1075000000000017,"d":"-0.11"}},{"$f":"K20*M20","v":-107.5000000000017},{"v":1000,"d":"1000.00"},"Unsuccessful","2017-08-29"]
{"$rows_left_out":39}
{"sheet":"Sheet2","index":7,"n_rows":1646,"n_cols":14,"rows_kept":1646,"hidden":true}
["SYMBOL","SERIES","OPEN","HIGH","LOW","CLOSE","LAST","PREVCLOSE","TOTTRDQTY","TOTTRDVAL","TIMESTAMP","TOTALTRADES","ISIN","ISIN"]
["20MICRONS","EQ",43.55,43.55,41.25,41.45,41.8,42.55,33382,1404355.4,"2018-05-21",392,"INE144J01027"]
["21STCENMGM","EQ",39.9,39.9,39.9,39.9,39.9,40.7,221,8817.9,"2018-05-21",4,"INE253B01015"]
["3IINFOTECH","EQ",4.4,4.5,4.2,4.5,4.5,4.3,2625057,11674737.2,"2018-05-21",1318,"INE748C01020"]
["3MINDIA","EQ",19990,19999.95,19200,19251.75,19300,19870.75,1115,21721060.05,"2018-05-21",432,"INE470A01017"]
["3PLAND","EQ",13.3,13.8,13.1,13.3,13.3,13.05,2472,33133.8,"2018-05-21",17,"INE105C01023"]
["5PAISA","EQ",400.05,419.55,392.45,392.45,392.45,413.1,12999,5167544.15,"2018-05-21",214,"INE618L01018"]
["63MOONS","EQ",80.25,83,79.35,81.65,81.2,80.3,229065,18605450.25,"2018-05-21",3812,"INE111B01023"]
["8KMILES","EQ",598.45,601.5,510.05,528.7,530.55,597.95,492030,264841859.4,"2018-05-21",16014,"INE650K01021"]
["A2ZINFRA","EQ",21.2,21.85,19.8,20.15,20.3,21.3,548775,11300511.85,"2018-05-21",2808,"INE619I01012"]
["AARTIDRUGS","EQ",550,555.05,535.1,540,538.15,549.85,1673,910549.95,"2018-05-21",203,"INE767A01016"]
["AARTIIND","EQ",1252.05,1257.45,1196.1,1222.55,1220,1260.5,43376,52643872.6,"2018-05-21",4281,"INE769A01020"]
["AARVEEDEN","EQ",40.6,41.6,38.5,39,39,40.55,47628,1864119.4,"2018-05-21",124,"INE273D01019"]
["ABAN","EQ",161.6,161.95,153.55,156.55,156.65,161.6,700706,110394176.3,"2018-05-21",9081,"INE421A01028"]
["ABB","EQ",1220,1233.85,1198,1200.2,1198.9,1216.35,20256,24427269.3,"2018-05-21",1601,"INE117A01022"]
["ABBOTINDIA","EQ",6847,6847,6555.25,6606.6,6581,6727.85,5243,34921033.45,"2018-05-21",2223,"INE358A01014"]
["ABCAPITAL","EQ",148.4,148.9,143,143.85,143.8,147.5,1789491,259964321.8,"2018-05-21",19908,"INE674K01013"]
["ABFRL","EQ",144.1,144.75,139.05,140.4,141,143.65,228887,32247621.55,"2018-05-21",6419,"INE647O01011"]
["ABMINTLTD","BE",23.1,23.1,22.55,22.55,22.55,23.7,2,45.65,"2018-05-21",2,"INE251C01017"]
["ACC","EQ",1379,1379.9,1322.6,1344.1,1349.65,1374.35,380473,511664797.95,"2018-05-21",17553,"INE012A01025"]
{"$rows_left_out":1627}
{"sheet":"Sheet1","index":8,"n_rows":0,"n_cols":0,"rows_kept":0,"hidden":true}

{"sheet":"Sheet3","index":9,"n_rows":0,"n_cols":0,"rows_kept":0,"hidden":true}