{"text_format":"3","workbook":"xlsx","n_sheets":12,"sheets":["Main","Future Intra","Cash Intra","MidCap Intra","Bulk Deals","Call Tracker (Equity & F&O)","Sheet2","Sheet1","Sheet3","Sheet4","Sheet5","Call Tracker (Currency)"],"not_rendered":{"images":4,"defined_names":4},"read":"whole","date_system":"1900"}

{"sheet":"Main","index":0,"n_rows":17,"n_cols":4,"rows_kept":17}
[null,"                                                                                                 "]
{"$rows_empty":8}
[null,"2018-02-22"]
[]
[null,"Sheet No.","Template Name","Summary"]
[null,1,"Future Intra","For Intraday trading in F&O segment"]
[null,2,"Cash Intra","For Intraday trading in cash market segment"]
[null,3,"Mid-cap Intra","For Intraday trading in Mid-cap stocks"]
[null,4,"Bulk Deals","Reveals Bulk Deals carried on NSE & BSE"]
[null,5,"Call Tracker"]

{"sheet":"Future Intra","index":1,"n_rows":252,"n_cols":15,"rows_kept":252,"merged":[[8,0,9,0],[8,1,9,1],[8,2,9,2],[8,5,8,7],[8,8,8,10]]}
[]
[]
[]
[]
[{"$nulls":12},"Back to Main Page"]
["FOR INTRA DAY TRADING",{"$nulls":10},{"$f":"Main!B10","v":"2018-02-22"}]
[]
[]
["Sr.no","Sector","Scrip","CLOSE RATE","Pivot Point","Supports",null,null,"Resistances"]
[null,"Sector",null,"Point","Point","S1","S2","S3","R1","R2","R3","HIGH","LOW","OI","% Change in OI"]
[1,"Index","BANKNIFTY",{"v":24928.8,"d":"24928.80"},{"v":24905.13333333333,"d":"24905.13"},{"v":24799.766666666663,"d":"24799.77"},{"v":24670.73333333333,"d":"24670.73"},{"v":24565.36666666666,"d":"24565.37"},{"v":25034.166666666664,"d":"25034.17"},{"v":25139.533333333333,"d":"25139.53"},{"v":25268.566666666666,"d":"25268.57"},25010.5,24776.1,2638480,{"v":-0.022263725838965968,"d":"-2.23%"}]
[2,"Index","NIFTY",{"v":10392.9,"d":"10392.90"},{"v":10381.383333333333,"d":"10381.38"},{"v":10352.916666666666,"d":"10352.92"},{"v":10312.933333333332,"d":"10312.93"},{"v":10284.466666666665,"d":"10284.47"},{"v":10421.366666666667,"d":"10421.37"},{"v":10449.833333333334,"d":"10449.83"},{"v":10489.816666666668,"d":"10489.82"},10409.85,10341.4,28101150,{"v":-0.03635138471667833,"d":"-3.64%"}]
[3,"Index","NIFTYCPSE",2661.05,{"v":887.0166666666668,"d":"887.02"},{"v":1774.0333333333335,"d":"1774.03"},{"v":887.0166666666668,"d":"887.02"},{"v":1774.0333333333335,"d":"1774.03"},{"v":1774.0333333333335,"d":"1774.03"},{"v":887.0166666666668,"d":"887.02"},{"v":1774.0333333333335,"d":"1774.03"},0,0,0,{"v":0,"d":"0.00%"}]
[4,"Index","NIFTYINFRA",{"v":3569.3,"d":"3569.30"},{"v":1189.7666666666667,"d":"1189.77"},{"v":2379.5333333333333,"d":"2379.53"},{"v":1189.7666666666667,"d":"1189.77"},{"v":2379.5333333333333,"d":"2379.53"},{"v":2379.5333333333333,"d":"2379.53"},{"v":1189.7666666666667,"d":"1189.77"},{"v":2379.5333333333333,"d":"2379.53"},0,0,0,{"v":0,"d":"0.00%"}]
[5,"Index","NIFTYIT",{"v":12656,"d":"12656.00"},{"v":12592,"d":"12592.00"},{"v":12489,"d":"12489.00"},{"v":12322,"d":"12322.00"},{"v":12219,"d":"12219.00"},{"v":12759,"d":"12759.00"},{"v":12862,"d":"12862.00"},{"v":13029,"d":"13029.00"},12695,12425,40150,{"v":-0.031363088057901084,"d":"-3.14%"}]
{"$rows_left_out":231}
{"sheet":"Cash Intra","index":2,"n_rows":251,"n_cols":13,"rows_kept":251,"merged":[[7,0,8,0],[7,1,8,1],[7,2,8,2],[7,3,8,3],[7,4,7,6],[7,7,7,9]]}
[]
[]
[]
[]
[{"$nulls":12},"Back to Main Page"]
["FOR INTRA DAY TRADING",{"$nulls":9},{"$f":"Main!B10","v":"2018-02-22"}]
[]
["Sr.no","Scrip","CLOSE RATE","Pivot Point","Supports",null,null,"Resistances"]
[null,null,"Point",null,"S1","S2","S3","R1","R2","R3","HIGH","LOW","Total Trade Quanity in Lakhs"]
[1,"Nifty 50",10397.45,{"v":10391.050000000001,"d":"10391.05"},{"v":10356.000000000002,"d":"10356.00"},{"v":10314.550000000001,"d":"10314.55"},{"v":10279.500000000002,"d":"10279.50"},{"v":10432.500000000002,"d":"10432.50"},{"v":10467.550000000001,"d":"10467.55"},{"v":10509.000000000002,"d":"10509.00"},10426.1,10349.6]
[2,"Nifty Bank",24936.7,{"v":24910.916666666668,"d":"24910.92"},{"v":24822.133333333335,"d":"24822.13"},{"v":24707.566666666666,"d":"24707.57"},{"v":24618.783333333333,"d":"24618.78"},{"v":25025.483333333337,"d":"25025.48"},{"v":25114.26666666667,"d":"25114.27"},{"v":25228.83333333334,"d":"25228.83"},24999.7,24796.35]
[3,"Nifty CPSE",2598.1,{"v":2589.0666666666666,"d":"2589.07"},{"v":2575.2833333333333,"d":"2575.28"},{"v":2552.4666666666667,"d":"2552.47"},{"v":2538.6833333333334,"d":"2538.68"},{"v":2611.883333333333,"d":"2611.88"},{"v":2625.666666666666,"d":"2625.67"},{"v":2648.483333333333,"d":"2648.48"},2602.85,2566.25]
[4,"Nifty Infra",3386.7,{"v":3391,"d":"3391.00"},{"v":3371.4,"d":"3371.40"},{"v":3356.1,"d":"3356.10"},{"v":3336.5,"d":"3336.50"},{"v":3406.3,"d":"3406.30"},{"v":3425.9000000000005,"d":"3425.90"},{"v":3441.2000000000003,"d":"3441.20"},3410.6,3375.7]
[5,"Nifty IT",12660.05,{"v":12605.416666666666,"d":"12605.42"},{"v":12506.983333333332,"d":"12506.98"},{"v":12353.916666666666,"d":"12353.92"},{"v":12255.483333333332,"d":"12255.48"},{"v":12758.483333333332,"d":"12758.48"},{"v":12856.916666666666,"d":"12856.92"},{"v":13009.983333333332,"d":"13009.98"},12703.85,12452.35]
[6,"Nifty PSE",4051.7,4049.85,4022.75,{"v":3993.8,"d":"3993.80"},{"v":3966.7000000000003,"d":"3966.70"},{"v":4078.7999999999997,"d":"4078.80"},{"v":4105.9,"d":"4105.90"},{"v":4134.849999999999,"d":"4134.85"},4076.95,4020.9]
{"$rows_left_out":230}
{"sheet":"MidCap Intra","index":3,"n_rows":512,"n_cols":13,"rows_kept":512,"merged":[[0,0,0,1],[8,0,9,0],[8,1,9,1],[8,2,9,2],[8,3,9,3],[8,4,8,6],[8,7,8,9]]}
[]
[]
[]
[]
[{"$nulls":11},"Back To Main Page"]
["FOR INTRA DAY TRADING",{"$nulls":9},{"$f":"Main!B10","v":"2018-02-22"}]
[null,null," "]
[]
["Sr.no","Scrip","CLOSE RATE","Pivot Point","Supports",null,null,"Resistances"]
[null,null,"Point",null,"S1","S2","S3","R1","R2","R3","HIGH","LOW","Total Trade Quanity in Lakhs"]
[1,"3MINDIA",20543.45,{"v":20626.483333333334,"d":"20626.48"},{"v":20346.966666666667,"d":"20346.97"},{"v":20150.483333333334,"d":"20150.48"},{"v":19870.966666666667,"d":"19870.97"},{"v":20822.966666666667,"d":"20822.97"},{"v":21102.483333333337,"d":"21102.48"},{"v":21298.966666666667,"d":"21298.97"},20906,20430,0.01446]
[2,"8KMILES",766.9,{"v":772.9666666666667,"d":"772.97"},{"v":757.9333333333334,"d":"757.93"},{"v":748.9666666666667,"d":"748.97"},{"v":733.9333333333334,"d":"733.93"},{"v":781.9333333333334,"d":"781.93"},{"v":796.9666666666667,"d":"796.97"},{"v":805.9333333333334,"d":"805.93"},788,764,1.205]
[3,"ABB",1511.4,{"v":1517.5,"d":"1517.50"},1500.05,{"v":1488.7,"d":"1488.70"},1471.25,1528.85,{"v":1546.2999999999997,"d":"1546.30"},{"v":1557.6499999999999,"d":"1557.65"},1534.95,1506.15,0.35217]
[4,"ACC",1645.25,1648.75,{"v":1635.5,"d":"1635.50"},1625.75,{"v":1612.5,"d":"1612.50"},{"v":1658.5,"d":"1658.50"},1671.75,{"v":1681.5,"d":"1681.50"},1662,1639,3.22498]
[5,"AIAENG",1461.45,{"v":1447.8,"d":"1447.80"},{"v":1429.6499999999999,"d":"1429.65"},1397.85,{"v":1379.6999999999998,"d":"1379.70"},{"v":1479.6,"d":"1479.60"},1497.75,1529.55,1465.95,1416,0.18004]
{"$rows_left_out":498}
{"sheet":"Bulk Deals","index":4,"n_rows":67,"n_cols":8,"rows_kept":67,"merged":[[4,0,4,1],[4,2,4,3],[6,1,6,2]]}
[" "]
[]
[]
[]
[]
[{"$nulls":4},"Back To Main Page"]
["Subject :","BULK DEAL",null,{"$f":"Main!B10","v":"2018-02-22"}]
[]
["Date","Scrip code","Scrip Name","Client Name","Buy / Sell","Quantity Traded","Trade Price / Wt.Avg.trade price","Exchange  "]
["2018-02-21",540146,"ACML","NISHIL SURENDRABHAI MARFATIA","BUY",{"v":100000,"d":"100,000"},234.88,"BSE"]
["2018-02-21",530245,"ARYAMAN","YOGDARSHAN COMMERCIAL TRADING PRIVATE LIMITED","SELL",{"v":85000,"d":"85,000"},47.75,"BSE"]
["2018-02-21",540956,"BHATIA","JACKPOT VINTRADE PRIVATE LIMITED","BUY",{"v":74000,"d":"74,000"},150.17,"BSE"]
["2018-02-21",538521,"CROWNTOURS","JAYANTILAL BHIMRAJ JAIN","SELL",{"v":31000,"d":"31,000"},15.75,"BSE"]
["2018-02-21",538521,"CROWNTOURS","JAYSHRIBEN DHIRENDRAKUMAR MANIAR","BUY",{"v":25000,"d":"25,000"},15.75,"BSE"]
["2018-02-21",514474,"FAIRDSY","RAJESH GOPALKRISHNA RATHI","BUY",{"v":53806,"d":"53,806"},57.4,"BSE"]
{"$rows_left_out":53}
{"sheet":"Call Tracker (Equity & F&O)","index":5,"n_rows":266,"n_cols":19,"rows_kept":266,"merged":[[8,9,8,10],[9,9,9,10],[10,9,10,10],[11,9,11,10],[12,9,12,10],[13,9,13,10],[14,9,14,10],[15,9,15,10],[16,9,16,10],[17,9,17,10],[18,9,18,10],[19,9,19,10],[20,9,20,10],[21,9,21,10],[22,9,22,10],[23,9,23,10],[24,9,24,10],[25,9,25,10],[26,9,26,10],[27,9,27,10],[28,9,28,10],[29,9,29,10],[30,9,30,10],[31,9,31,10],[32,9,32,10],[33,9,33,10],[34,9,34,10],[35,9,35,10],[36,9,36,10],[37,9,37,10],[38,9,38,10],[39,9,39,10],[40,9,40,10],[41,9,41,10],[42,9,42,10],[43,9,43,10],[44,9,44,10],[45,9,45,10],[46,9,46,10],[48,9,48,10],[49,9,49,10],[54,9,54,10],[55,9,55,10],[56,9,56,10],[57,0,58,0],[57,1,58,1],[57,6,58,6],[57,8,58,8],[57,9,58,10],[57,13,58,13],[57,14,58,14],[57,15,58,15],[59,9,59,10],[60,9,60,10],[64,9,64,10],[65,0,66,0],[65,1,66,1],[65,8,66,8],[65,9,66,10],[65,12,66,12],[65,13,66,13],[65,14,66,14],[65,15,66,15],[67,9,67,10],[68,9,68,10],[69,9,69,10],[70,9,70,10],[71,9,71,10],[72,9,72,10],[73,9,73,10],[78,9,78,10],[79,9,79,10],[80,9,80,10],[81,9,81,10],[82,9,82,10],[83,9,83,10],[84,9,84,10],[85,9,85,10],[86,9,86,10],[87,9,87,10],[88,9,88,10],[89,9,89,10],[90,9,90,10],[91,9,91,10],[92,9,92,10],[93,9,93,10],[94,9,94,10],[95,9,95,10],[96,9,96,10],[97,9,97,10],[100,9,100,10],[106,9,106,10],[107,9,107,10],[114,9,114,10],[115,9,115,10],[116,9,116,10],[117,9,117,10],[118,9,118,10],[119,9,119,10],[120,9,120,10],[121,9,121,10],[128,9,128,10],[129,9,129,10],[130,9,130,10],[131,9,131,10],[132,9,132,10],[133,9,133,10],[134,9,134,10],[135,9,135,10],[137,9,137,10],[138,9,138,10],[139,9,139,10],[140,9,140,10],[141,9,141,10],[142,9,142,10],[143,9,143,10],[144,9,144,10],[145,9,145,10],[146,9,146,10],[147,9,147,10],[148,9,148,10],[149,9,149,10],[150,9,150,10],[151,9,151,10],[152,9,152,10],[153,9,153,10],[154,9,154,10],[155,9,155,10],[156,9,156,10],[157,9,157,10],[158,9,158,10],[159,9,159,10],[160,9,160,10],[161,9,161,10],[162,9,162,10],[163,9,163,10],[164,9,164,10],[165,9,165,10],[166,9,166,10],[167,9,167,10],[168,9,168,10],[169,9,169,10],[170,9,170,10],[171,9,171,10],[172,9,172,10],[173,9,173,10],[174,9,174,10],[175,9,175,10],[176,9,176,10],[177,9,177,10],[178,9,178,10],[179,9,179,10],[180,9,180,10],[181,9,181,10],[182,9,182,10],[183,9,183,10],[184,9,184,10],[185,9,185,10],[186,9,186,10],[187,9,187,10],[188,9,188,10],[189,9,189,10],[190,9,190,10],[191,9,191,10],[192,9,192,10],[193,9,193,10],[194,9,194,10],[195,9,195,10],[196,9,196,10],[197,9,197,10],[198,9,198,10],[199,9,199,10],[200,9,200,10],[201,9,201,10],[202,9,202,10],[203,9,203,10],[205,9,205,10],[206,9,206,10],[207,9,207,10],[208,9,208,10],[209,9,209,10],[210,9,210,10],[211,9,211,10],[212,9,212,10],[213,9,213,10],[214,9,214,10],[215,9,215,10],[216,9,216,10],[217,9,217,10],[218,9,218,10],[219,9,219,10],[220,9,220,10],[221,9,221,10],[222,9,222,10],[223,9,223,10],[224,9,224,10],[225,9,225,10],[226,9,226,10],[227,9,227,10],[228,9,228,10],[229,9,229,10],[230,9,230,10],[231,9,231,10],[232,9,232,10],[233,9,233,10],[234,9,234,10],[235,9,235,10],[236,9,236,10],[237,9,237,10],[238,9,238,10],[239,9,239,10],[240,9,240,10],[241,9,241,10],[242,9,242,10],[243,9,243,10],[244,9,244,10],[245,9,245,10],[246,9,246,10],[247,9,247,10],[248,9,248,10],[249,9,249,10],[250,9,250,10],[252,9,252,10],[253,10,253,11]]}
[]
[]
[]
[]
[{"$nulls":13},"Back To Main Page"]
["Retail Research Technical Calls & Fundamental Performance Report for the month of February -2018 "]
[{"$nulls":13},{"$f":"Main!B10","v":"2018-02-22"}]
[null,"Positional  Call"]
["Sr.no","Date",null,"Company","Rec","Rec Price","Stop Loss***","Call Closed At","Target","Remark",null,"Profit / Loss per Share","Gain / Loss  %","Status","Closed Date","NSE Closed Price"]
[1,"2017-12-21",null,"M&M","Sell",750,825,724.5,600,"Profit  of Rs.25.50/-",null,{"$f":"F10-H10","v":25.5},{"$f":"L10/F10","v":{"v":0.034,"d":"3.40%"}},"Successful","2018-02-19",{"$nulls":3},"P"]
[2,"2018-01-11",null,"SUNPHARMA","Buy",593.5,560,557.5,650,"Loss of Rs.36/-",null,{"$f":"H11-F11-K11","v":{"v":-36,"d":"-36.00"}},{"$f":"L11/F11","v":{"v":-0.060657118786857624,"d":"-6.07%"}},"Unsuccessful","2018-02-01",{"$nulls":3},"R"]
[3,"2018-01-12",null,"GRANULES","Buy",{"$f":"(145.5+133.5)/2","v":139.5},131,131,"160-162","Loss of Rs.8.5/-",null,{"$f":"H12-F12-K12","v":{"v":-8.5,"d":"-8.50"}},{"$f":"L12/F12","v":{"v":-0.06093189964157706,"d":"-6.09%"}},"Unsuccessful","2018-02-01",{"$nulls":3},"H"]
[4,"2018-01-16",null,"PIDILITIND","Buy",906.5,880,870,965,"Loss of Rs.36.5/-",null,{"$f":"H13-F13-K13","v":{"v":-36.5,"d":"-36.50"}},{"v":-0.04026475455046884,"d":"-4.03%"},"Unsuccessful","2018-02-02",{"$nulls":3},"R"]
[5,"2018-01-18",null,"AUROPHARMA","Buy",660.5,634,626,"720-730","Loss of Rs.34.5/-",null,{"$f":"H14-F14-K14","v":{"v":-34.5,"d":"-34.50"}},{"$f":"L14/F14","v":{"v":-0.052233156699470096,"d":"-5.22%"}},"Unsuccessful","2018-02-01",{"$nulls":3},"H"]
[6,"2018-01-19",null,"ENGINERSIN","Buy$",171,160,null,"195-200","Open",{"$nulls":5},{"$f":"VLOOKUP(D15,Sheet2!$A$1:M2077,6,0)","v":163.55},null,null,"H"]
{"$rows_left_out":246}
{"sheet":"Sheet2","index":6,"n_rows":1530,"n_cols":13,"rows_kept":1530,"hidden":true}
["SYMBOL","SERIES","OPEN","HIGH","LOW","CLOSE","LAST","PREVCLOSE","TOTTRDQTY","TOTTRDVAL","TIMESTAMP","TOTALTRADES","ISIN"]
["20MICRONS","EQ",51.75,52,50.05,50.35,50.45,51,46224,2352357.05,"2018-02-21",554,"INE144J01027"]
["3IINFOTECH","EQ",5.75,5.85,5.6,5.7,5.7,5.7,2910036,16738797.8,"2018-02-21",1239,"INE748C01020"]
["3MINDIA","EQ",20799,20906,20430,20543.45,20540,20497.95,1446,29854169.2,"2018-02-21",661,"INE470A01017"]
["5PAISA","EQ",333.15,350.6,333.15,350.6,350.6,333.95,8535,2934661.6,"2018-02-21",284,"INE618L01018"]
["63MOONS","EQ",95.95,96.65,93.5,93.75,93.65,94.75,161186,15278879.85,"2018-02-21",1877,"INE111B01023"]
["8KMILES","EQ",783,788,764,766.9,767.05,776.8,120500,93284345.1,"2018-02-21",5494,"INE650K01021"]
["A2ZINFRA","EQ",33.65,33.95,32.85,33.1,33.05,33.45,416615,13880465.05,"2018-02-21",1921,"INE619I01012"]
["AARTIDRUGS","EQ",630,632.05,603.6,607.7,608.8,629.05,9095,5546884.3,"2018-02-21",832,"INE767A01016"]
["AARTIIND","EQ",1179.9,1179.9,1158.05,1167.25,1158.05,1169.95,19661,23055002.75,"2018-02-21",5803,"INE769A01020"]
["AARVEEDEN","EQ",48.8,49.55,47,48.25,48.05,48.65,16826,814234.7,"2018-02-21",187,"INE273D01019"]
["ABAN","EQ",173,173.5,167.2,168.75,168.45,171.35,623932,105890418.5,"2018-02-21",8178,"INE421A01028"]
["ABB","EQ",1524.35,1534.95,1506.15,1511.4,1511.45,1509.3,35217,53387667.9,"2018-02-21",2833,"INE117A01022"]
["ABBOTINDIA","EQ",5667.45,5798,5621.65,5640.3,5655,5611.35,4550,25954209.95,"2018-02-21",998,"INE358A01014"]
["ABCAPITAL","EQ",165,166.9,163.3,165.15,165.4,164.55,1768396,291609498.3,"2018-02-21",14369,"INE674K01013"]
{"$rows_left_out":1516}
{"sheet":"Sheet1","index":7,"n_rows":0,"n_cols":0,"rows_kept":0,"hidden":true}

{"sheet":"Sheet3","index":8,"n_rows":0,"n_cols":0,"rows_kept":0,"hidden":true}

{"sheet":"Sheet4","index":9,"n_rows":0,"n_cols":0,"rows_kept":0,"hidden":true}

{"sheet":"Sheet5","index":10,"n_rows":0,"n_cols":0,"rows_kept":0,"hidden":true}

{"sheet":"Call Tracker (Currency)","index":11,"n_rows":58,"n_cols":18,"rows_kept":58,"hidden":true,"merged":[[1,8,1,9],[2,8,2,9],[3,8,3,9],[4,8,4,9],[5,8,5,9],[6,8,6,9],[7,8,7,9],[8,8,8,9],[9,8,9,9],[10,8,10,9],[11,8,11,9],[12,8,12,9],[13,8,13,9],[14,8,14,9],[15,8,15,9],[16,8,16,9],[17,8,17,9],[18,8,18,9],[19,8,19,9],[20,8,20,9],[21,8,21,9],[22,8,22,9],[23,8,23,9],[24,8,24,9],[25,8,25,9],[26,8,26,9],[27,8,27,9],[28,8,28,9],[29,8,29,9],[30,8,30,9],[31,8,31,9],[32,8,32,9],[33,8,33,9],[34,8,34,9],[35,8,35,9],[36,8,36,9],[37,8,37,9],[38,8,38,9],[39,8,39,9],[40,8,40,9],[41,8,41,9],[42,8,42,9],[43,8,43,9],[44,8,44,9],[45,8,45,9],[46,8,46,9],[47,8,47,9],[48,8,48,9],[49,8,49,9],[50,8,50,9],[51,8,51,9],[52,8,52,9],[53,8,53,9],[54,8,54,9],[55,8,55,9],[56,8,56,9],[57,8,57,9],[58,8,58,9],[59,8,59,9],[60,8,60,9],[61,8,61,9],[62,8,62,9],[63,8,63,9],[64,8,64,9],[65,8,65,9],[66,8,66,9],[67,8,67,9],[68,8,68,9],[69,8,69,9],[70,8,70,9],[71,8,71,9],[72,8,72,9],[73,8,73,9],[74,8,74,9],[75,8,75,9],[76,8,76,9],[77,8,77,9],[78,8,78,9],[79,8,79,9],[80,8,80,9],[81,8,81,9],[82,8,82,9],[83,8,83,9],[84,8,84,9],[85,8,85,9],[86,8,86,9],[87,8,87,9],[88,8,88,9],[89,8,89,9],[90,8,90,9],[91,8,91,9],[92,8,92,9],[93,8,93,9],[94,8,94,9],[95,8,95,9],[96,8,96,9],[97,8,97,9],[98,8,98,9],[99,8,99,9],[100,8,100,9],[101,8,101,9],[102,8,102,9],[103,8,103,9],[104,8,104,9],[105,8,105,9],[106,8,106,9],[107,8,107,9],[108,8,108,9],[109,8,109,9],[110,8,110,9],[111,8,111,9],[112,8,112,9],[113,8,113,9],[114,8,114,9],[115,8,115,9],[116,8,116,9],[117,8,117,9],[118,8,118,9],[119,8,119,9],[120,8,120,9],[121,8,121,9],[122,8,122,9],[123,8,123,9],[124,8,124,9]]}
["Master Trade High Risk"]
["Sr.no","Date","Company","Rec","Rec Price","Stop Loss","Call Closed At","Target","Remark",null,"Profit / Loss per share","Gain / Loss  per Lot","Lot","Status","Closed Date"]
[1,"2017-05-08","USDINR MAY FUT","Buy",64.3935,64.29,64.66,64.59,"Profit of Rs.0.27/-",null,{"v":0.2664999999999935,"d":"0.27"},266.4999999999935,1000,"Successful","2017-05-09",null,null,"P"]
[2,"2017-05-08","USDINR JUN FUT","Buy",64.6535,64.45,64.965,65.05,"Profit of Rs 0.31/-",null,{"v":0.31150000000000944,"d":"0.31"},311.50000000000944,1000,"Successful","2017-05-09",null,null,"P"]
[3,"2017-05-09","EUROINR MAY FUT","Sell",70.65,70.8,70.07,70.4,"Profit of Rs 0.58/-",null,{"v":0.580000000000013,"d":"0.58"},580.00000000001,1000,"Successful","2017-05-12",null,null,"P"]
[4,"2017-05-09","GBPINR MAY FUT","Buy",83.774,83.37,83.37,84.77,"Loss of Rs 0.40/-",null,{"v":-0.40399999999999636,"d":"-0.40"},-403.99999999999636,1000,"Unsuccessful","2017-05-11",null,null,"P"]
[5,"2017-05-11","USDINR MAY FUT","Buy",64.6555,64.55,64.55,64.86,"Loss of Rs.0.1055/-",null,-0.10550000000000637,{"$f":"K7*M7","v":{"v":-105.50000000000637,"d":"-105.50"}},1000,"Unsuccessful","2017-05-11",null,null,"P"]
[6,"2017-05-15","USDINR MAY FUT","Buy",64.2275,64.08,64.46,64.48,"Profit of Rs 0.23/-",null,{"v":0.2324999999999875,"d":"0.23"},232.4999999999875,1000,"Successful","2017-05-18",null,null,"P"]
[7,"2017-05-19","USDINR MAY FUT","Sell",64.83,65,65,64.5,"Loss of Rs.0.17/-",null,{"v":-0.1700000000000017,"d":"-0.17"},-170.0000000000017,1000,"Unsuccessful","2017-05-19",null,null,"P"]
[8,"2017-05-23","USDINR MAY FUT","Buy",64.83,64.62,64.95,65.2,"Profit of Rs 0.12/-",null,{"v":0.12000000000000455,"d":"0.12"},120.00000000000455,1000,"Successful","2017-05-24",null,null,"P"]
[9,"2017-05-25","USDINR MAY FUT","Buy",64.57,64.25,64.56,65,"Loss of Rs.0.01/-",null,-0.009999999999990905,-9.999999999990905,1000,"Neutral","2017-05-29",null,null,"P"]
[10,"2017-05-30","USDINR JUN FUT","Buy",64.9125,64.71,64.71,65.31,"Loss of Rs.0.20/-",null,{"v":-0.20250000000000057,"d":"-0.20"},-202.50000000000057,1000,"Unsuccessful","2017-05-31",null,null,"P"]
[11,"2017-06-01","USDINR JUN FUT","Buy",64.655,64.45,64.45,65.05,"Loss of Rs.0.20/-",null,{"$f":"G13-E13","v":{"v":-0.2049999999999983,"d":"-0.20"}},{"$f":"K13*M13","v":-204.9999999999983},{"v":1000,"d":"1000.00"},"Unsuccessful","2017-06-08",null,null,"P"]
[12,"2017-06-12","USDINR JUN FUT","Buy",64.45,64,64.7625,65.2,"Profit of Rs 0.31/-",null,{"v":0.3125,"d":"0.31"},312.5,1000,"Successful","2017-06-16"]
[13,"2017-06-16","USDINR JUN FUT","Buy",64.51,64.2,64.7,65.11,"Profit of Rs 0.19/-",null,{"v":0.18999999999999773,"d":"0.19"},189.99999999999773,1000,"Successful","2017-06-21"]
{"$rows_left_out":43}