{"text_format":"3","workbook":"xlsx","n_sheets":8,"sheets":["Main","Future Intra","Cash Intra","MidCap Intra","Bulk Deals","Call Tracker (Equity & F&O)","Sheet2","Sheet1"],"not_rendered":{"images":4,"defined_names":4},"read":"whole","date_system":"1900"}

{"sheet":"Main","index":0,"n_rows":17,"n_cols":4,"rows_kept":17}
[null,"                                                                                                 "]
{"$rows_empty":8}
[null,"2019-01-22"]
[]
[null,"Sheet No.","Template Name","Summary"]
[null,1,"Future Intra","For Intraday trading in F&O segment"]
[null,2,"Cash Intra","For Intraday trading in cash market segment"]
[null,3,"Mid-cap Intra","For Intraday trading in Mid-cap stocks"]
[null,4,"Bulk Deals","Reveals Bulk Deals carried on NSE & BSE"]
[null,5,"Call Tracker"]

{"sheet":"Future Intra","index":1,"n_rows":240,"n_cols":15,"rows_kept":240,"merged":[[8,0,9,0],[8,1,9,1],[8,2,9,2],[8,5,8,7],[8,8,8,10]]}
[]
[]
[]
[]
[{"$nulls":12},"Back to Main Page"]
["FOR INTRA DAY TRADING",{"$nulls":10},{"$f":"Main!B10","v":"2019-01-22"}]
[]
[]
["Sr.no","Sector","Scrip","CLOSE RATE","Pivot Point","Supports",null,null,"Resistances"]
[null,"Sector",null,"Point","Point","S1","S2","S3","R1","R2","R3","HIGH","LOW","OI","% Change in OI"]
[1,"Index","BANKNIFTY",{"v":27573,"d":"27573.00"},{"v":27565.666666666668,"d":"27565.67"},{"v":27456.383333333335,"d":"27456.38"},{"v":27339.766666666666,"d":"27339.77"},{"v":27230.483333333334,"d":"27230.48"},{"v":27682.283333333336,"d":"27682.28"},{"v":27791.56666666667,"d":"27791.57"},{"v":27908.183333333338,"d":"27908.18"},27674.95,27449.05,2153700,{"v":0.014938737040527804,"d":"1.49%"}]
[2,"Index","NIFTY",{"v":10969.7,"d":"10969.70"},{"v":10958.433333333334,"d":"10958.43"},{"v":10913.416666666668,"d":"10913.42"},{"v":10857.133333333333,"d":"10857.13"},{"v":10812.116666666667,"d":"10812.12"},{"v":11014.716666666669,"d":"11014.72"},{"v":11059.733333333335,"d":"11059.73"},{"v":11116.01666666667,"d":"11116.02"},11003.45,10902.15,28420800,{"v":0.008575489324553792,"d":"0.86%"}]
[3,"Index","NIFTYIT",{"v":14944,"d":"14944.00"},{"v":14961,"d":"14961.00"},{"v":14833,"d":"14833.00"},{"v":14722,"d":"14722.00"},{"v":14594,"d":"14594.00"},{"v":15072,"d":"15072.00"},{"v":15200,"d":"15200.00"},{"v":15311,"d":"15311.00"},15089,14850,16550,{"v":-0.11021505376344086,"d":"-11.02%"}]
[4,"Cement","ACC",1434.75,{"v":1441.3166666666666,"d":"1441.32"},{"v":1422.6333333333332,"d":"1422.63"},{"v":1410.5166666666667,"d":"1410.52"},{"v":1391.8333333333333,"d":"1391.83"},{"v":1453.4333333333332,"d":"1453.43"},{"v":1472.1166666666666,"d":"1472.12"},{"v":1484.2333333333331,"d":"1484.23"},1460,1429.2,1648000,{"v":0.05613945142271212,"d":"5.61%"}]
[5,"Others","ADANIENT",146.35,{"v":146.46666666666667,"d":"146.47"},{"v":144.48333333333335,"d":"144.48"},{"v":142.61666666666667,"d":"142.62"},{"v":140.63333333333335,"d":"140.63"},{"v":148.33333333333334,"d":"148.33"},{"v":150.31666666666663,"d":"150.32"},{"v":152.18333333333334,"d":"152.18"},148.45,144.6,42392000,{"v":0.06277577216205375,"d":"6.28%"}]
[6,"Others","ADANIPORTS",396.75,{"v":397.6000000000001,"d":"397.60"},{"v":392.00000000000017,"d":"392.00"},{"v":387.2500000000001,"d":"387.25"},{"v":381.6500000000002,"d":"381.65"},{"v":402.35000000000014,"d":"402.35"},{"v":407.95000000000005,"d":"407.95"},{"v":412.7000000000001,"d":"412.70"},403.2,392.85,22652500,{"v":-7.0136986301369865E-3,"d":"-0.70%"}]
[7,"Power","ADANIPOWER",{"v":50.8,"d":"50.80"},{"v":50.71666666666667,"d":"50.72"},{"v":49.733333333333334,"d":"49.73"},{"v":48.666666666666664,"d":"48.67"},{"v":47.68333333333333,"d":"47.68"},{"v":51.78333333333334,"d":"51.78"},{"v":52.76666666666667,"d":"52.77"},{"v":53.83333333333334,"d":"53.83"},51.7,49.65,155140000,{"v":5.1592931768347733E-4,"d":"0.05%"}]
[8,"Pharma","AJANTPHARM",1148.05,{"v":1148.1499999999999,"d":"1148.15"},{"v":1141.0999999999997,"d":"1141.10"},{"v":1134.1499999999999,"d":"1134.15"},{"v":1127.0999999999997,"d":"1127.10"},{"v":1155.0999999999997,"d":"1155.10"},{"v":1162.1499999999999,"d":"1162.15"},{"v":1169.0999999999997,"d":"1169.10"},1155.2,1141.2,671500,{"v":-0.01827485380116959,"d":"-1.83%"}]
[9,"Banking","ALBK",42.45,{"v":42.71666666666667,"d":"42.72"},{"v":41.63333333333334,"d":"41.63"},{"v":40.81666666666667,"d":"40.82"},{"v":39.73333333333334,"d":"39.73"},{"v":43.53333333333334,"d":"43.53"},{"v":44.61666666666667,"d":"44.62"},{"v":45.43333333333334,"d":"45.43"},43.8,41.9,21944000,{"v":0.05565978736710444,"d":"5.57%"}]
[10,"Automobile","AMARAJABAT",{"v":776,"d":"776.00"},778.85,770.35,{"v":764.7,"d":"764.70"},{"v":756.2,"d":"756.20"},{"v":784.5,"d":"784.50"},{"v":793,"d":"793.00"},798.65,787.35,773.2,1096900,{"v":0.12329749103942653,"d":"12.33%"}]
{"$rows_left_out":211}
{"sheet":"Cash Intra","index":2,"n_rows":247,"n_cols":13,"rows_kept":247,"merged":[[7,0,8,0],[7,1,8,1],[7,2,8,2],[7,3,8,3],[7,4,7,6],[7,7,7,9]]}
[]
[]
[]
[]
[{"$nulls":12},"Back to Main Page"]
["FOR INTRA DAY TRADING",{"$nulls":9},{"$f":"Main!B10","v":"2019-01-22"}]
[]
["Sr.no","Scrip","CLOSE RATE","Pivot Point","Supports",null,null,"Resistances"]
[null,null,"Point",null,"S1","S2","S3","R1","R2","R3","HIGH","LOW","Total Trade Quanity in Lakhs"]
[1,"Nifty 50",10961.85,{"v":10945.016666666668,"d":"10945.02"},{"v":10902.583333333336,"d":"10902.58"},{"v":10843.316666666668,"d":"10843.32"},{"v":10800.883333333335,"d":"10800.88"},{"v":11004.283333333336,"d":"11004.28"},{"v":11046.716666666667,"d":"11046.72"},{"v":11105.983333333337,"d":"11105.98"},10987.45,10885.75]
[2,"Nifty Bank",27533.6,{"v":27514.766666666666,"d":"27514.77"},{"v":27407.333333333332,"d":"27407.33"},{"v":27281.066666666666,"d":"27281.07"},{"v":27173.63333333333,"d":"27173.63"},{"v":27641.033333333333,"d":"27641.03"},{"v":27748.466666666667,"d":"27748.47"},{"v":27874.733333333334,"d":"27874.73"},27622.2,27388.5]
[3,"Nifty CPSE",2006,2014.25,{"v":1992.7,"d":"1992.70"},{"v":1979.4,"d":"1979.40"},{"v":1957.8500000000001,"d":"1957.85"},2027.55,{"v":2049.1000000000004,"d":"2049.10"},{"v":2062.3999999999996,"d":"2062.40"},2035.8,2000.95]
[4,"Nifty Infra",3035.15,{"v":3041.1166666666663,"d":"3041.12"},{"v":3016.4833333333327,"d":"3016.48"},{"v":2997.816666666666,"d":"2997.82"},{"v":2973.1833333333325,"d":"2973.18"},{"v":3059.783333333333,"d":"3059.78"},{"v":3084.416666666667,"d":"3084.42"},{"v":3103.083333333333,"d":"3103.08"},3065.75,3022.45]
[5,"Nifty IT",14966.4,{"v":14972.199999999999,"d":"14972.20"},{"v":14844.199999999997,"d":"14844.20"},{"v":14721.999999999998,"d":"14722.00"},{"v":14593.999999999996,"d":"14594.00"},{"v":15094.399999999998,"d":"15094.40"},{"v":15222.400000000001,"d":"15222.40"},{"v":15344.599999999999,"d":"15344.60"},15100.2,14850]
[6,"Nifty PSE",3254.7,{"v":3263.7000000000003,"d":"3263.70"},{"v":3239.5000000000005,"d":"3239.50"},{"v":3224.3,"d":"3224.30"},{"v":3200.1000000000004,"d":"3200.10"},{"v":3278.9000000000005,"d":"3278.90"},{"v":3303.1000000000004,"d":"3303.10"},{"v":3318.3000000000006,"d":"3318.30"},3287.9,3248.5]
[7,"Nifty Midcap 50",4828.3,{"v":4841.533333333333,"d":"4841.53"},{"v":4804.566666666666,"d":"4804.57"},{"v":4780.833333333333,"d":"4780.83"},{"v":4743.866666666666,"d":"4743.87"},{"v":4865.2666666666655,"d":"4865.27"},{"v":4902.233333333333,"d":"4902.23"},{"v":4925.966666666665,"d":"4925.97"},4878.5,4817.8]
[8,"ABB",1281.1,{"v":1286.3666666666666,"d":"1286.37"},{"v":1269.7333333333331,"d":"1269.73"},{"v":1258.3666666666666,"d":"1258.37"},{"v":1241.7333333333331,"d":"1241.73"},{"v":1297.7333333333331,"d":"1297.73"},{"v":1314.3666666666668,"d":"1314.37"},{"v":1325.7333333333331,"d":"1325.73"},1303,1275,2.22935]
[9,"ACC",1429.3,{"v":1434.2333333333333,"d":"1434.23"},{"v":1418.9166666666667,"d":"1418.92"},{"v":1408.5333333333333,"d":"1408.53"},{"v":1393.2166666666667,"d":"1393.22"},{"v":1444.6166666666668,"d":"1444.62"},{"v":1459.9333333333334,"d":"1459.93"},{"v":1470.3166666666668,"d":"1470.32"},1449.55,1423.85,3.49933]
[10,"AIAENG",1661.85,1678.95,{"v":1632.9,"d":"1632.90"},1603.95,{"v":1557.9,"d":"1557.90"},{"v":1707.9,"d":"1707.90"},{"v":1753.9499999999998,"d":"1753.95"},{"v":1782.9,"d":"1782.90"},1725,1650,0.35425]
[11,"AUBANK",608.7,{"v":612.5333333333333,"d":"612.53"},{"v":603.1666666666666,"d":"603.17"},{"v":597.6333333333333,"d":"597.63"},{"v":588.2666666666667,"d":"588.27"},{"v":618.0666666666666,"d":"618.07"},{"v":627.4333333333334,"d":"627.43"},{"v":632.9666666666666,"d":"632.97"},621.9,607,3.59668]
{"$rows_left_out":228}
{"sheet":"MidCap Intra","index":3,"n_rows":510,"n_cols":13,"rows_kept":510,"merged":[[0,0,0,1],[8,0,9,0],[8,1,9,1],[8,2,9,2],[8,3,9,3],[8,4,8,6],[8,7,8,9]]}
[]
[]
[]
[]
[{"$nulls":11},"Back To Main Page"]
["FOR INTRA DAY TRADING",{"$nulls":9},{"$f":"Main!B10","v":"2019-01-22"}]
[null,null," "]
[]
["Sr.no","Scrip","CLOSE RATE","Pivot Point","Supports",null,null,"Resistances"]
[null,null,"Point",null,"S1","S2","S3","R1","R2","R3","HIGH","LOW","Total Trade Quanity in Lakhs"]
[1,"3MINDIA",20895.9,{"v":20975.61666666667,"d":"20975.62"},{"v":20775.233333333337,"d":"20775.23"},{"v":20654.56666666667,"d":"20654.57"},{"v":20454.183333333338,"d":"20454.18"},{"v":21096.283333333336,"d":"21096.28"},{"v":21296.666666666668,"d":"21296.67"},{"v":21417.333333333336,"d":"21417.33"},21176,20854.95,0.00524]
[2,"8KMILES",144.85,{"v":148.63333333333335,"d":"148.63"},{"v":140.5166666666667,"d":"140.52"},{"v":136.18333333333337,"d":"136.18"},{"v":128.06666666666672,"d":"128.07"},{"v":152.9666666666667,"d":"152.97"},{"v":161.08333333333331,"d":"161.08"},{"v":165.41666666666669,"d":"165.42"},156.75,144.3,4.34163]
[3,"AARTIIND",1570.05,{"v":1564.9833333333333,"d":"1564.98"},{"v":1558.0666666666666,"d":"1558.07"},{"v":1546.0833333333333,"d":"1546.08"},{"v":1539.1666666666665,"d":"1539.17"},{"v":1576.9666666666667,"d":"1576.97"},{"v":1583.8833333333332,"d":"1583.88"},{"v":1595.8666666666668,"d":"1595.87"},1571.9,1553,0.38673]
[4,"ABAN",73.15,{"v":73,"d":"73.00"},{"v":72.5,"d":"72.50"},71.85,71.35,73.65,74.15,{"v":74.80000000000001,"d":"74.80"},73.5,72.35,2.33102]
[5,"ABB",1281.1,{"v":1286.3666666666666,"d":"1286.37"},{"v":1269.7333333333331,"d":"1269.73"},{"v":1258.3666666666666,"d":"1258.37"},{"v":1241.7333333333331,"d":"1241.73"},{"v":1297.7333333333331,"d":"1297.73"},{"v":1314.3666666666668,"d":"1314.37"},{"v":1325.7333333333331,"d":"1325.73"},1303,1275,2.22935]
[6,"ABCAPITAL",92.6,{"v":92.93333333333334,"d":"92.93"},{"v":91.96666666666667,"d":"91.97"},{"v":91.33333333333333,"d":"91.33"},{"v":90.36666666666666,"d":"90.37"},{"v":93.56666666666668,"d":"93.57"},{"v":94.53333333333335,"d":"94.53"},{"v":95.16666666666669,"d":"95.17"},93.9,92.3,9.79392]
[7,"ABFRL",201.75,{"v":202.61666666666667,"d":"202.62"},{"v":200.23333333333335,"d":"200.23"},{"v":198.71666666666667,"d":"198.72"},{"v":196.33333333333334,"d":"196.33"},{"v":204.13333333333335,"d":"204.13"},{"v":206.51666666666668,"d":"206.52"},{"v":208.03333333333336,"d":"208.03"},205,201.1,4.70057]
[8,"ACC",1429.3,{"v":1434.2333333333333,"d":"1434.23"},{"v":1418.9166666666667,"d":"1418.92"},{"v":1408.5333333333333,"d":"1408.53"},{"v":1393.2166666666667,"d":"1393.22"},{"v":1444.6166666666668,"d":"1444.62"},{"v":1459.9333333333334,"d":"1459.93"},{"v":1470.3166666666668,"d":"1470.32"},1449.55,1423.85,3.49933]
[9,"ADANIPORTS",396.2,{"v":397,"d":"397.00"},{"v":391.3,"d":"391.30"},{"v":386.40000000000003,"d":"386.40"},{"v":380.70000000000005,"d":"380.70"},{"v":401.9,"d":"401.90"},{"v":407.6,"d":"407.60"},{"v":412.49999999999994,"d":"412.50"},402.7,392.1,25.63705]
[10,"ADANIPOWER",49.8,50.15,{"v":48.9,"d":"48.90"},{"v":48,"d":"48.00"},46.75,51.05,{"v":52.3,"d":"52.30"},{"v":53.199999999999996,"d":"53.20"},51.4,49.25,131.43168]
{"$rows_left_out":491}
{"sheet":"Bulk Deals","index":4,"n_rows":60,"n_cols":8,"rows_kept":60,"merged":[[4,0,4,1],[4,2,4,3],[6,1,6,2]]}
[" "]
[]
[]
[]
[]
[{"$nulls":4},"Back To Main Page"]
["Subject :","BULK DEAL",null,{"$f":"Main!B10","v":"2019-01-22"}]
[]
["Date","Scrip code","Scrip Name","Client Name","Buy / Sell","Quantity Traded","Trade Price / Wt.Avg.trade price","Exchange  "]
["2019-01-21",517494,"ACCEL","RAMAMORTHI GANESH","SELL",{"v":345000,"d":"345,000"},5.18,"BSE"]
["2019-01-21",537766,"BCP","JINESH ASHWIN MATALIA","BUY",{"v":25000,"d":"25,000"},42.45,"BSE"]
["2019-01-21",537766,"BCP","JINESH ASHWIN MATALIA","SELL",{"v":325443,"d":"325,443"},37.7,"BSE"]
["2019-01-21",537766,"BCP","NIRAJ RAJNIKANT SHAH","BUY",{"v":730000,"d":"730,000"},38.27,"BSE"]
["2019-01-21",537766,"BCP","KAMAL BASANTKUMAR DHAND","BUY",{"v":370125,"d":"370,125"},37.16,"BSE"]
["2019-01-21",537766,"BCP","KAMAL BASANTKUMAR DHAND","SELL",{"v":370125,"d":"370,125"},37.81,"BSE"]
["2019-01-21",537766,"BCP","HANIF AMIR MANJEE","BUY",{"v":467435,"d":"467,435"},39,"BSE"]
["2019-01-21",537766,"BCP","HANIF AMIR MANJEE","SELL",{"v":466898,"d":"466,898"},39.58,"BSE"]
["2019-01-21",540268,"DHANVARSHA","VORA JINALBEN BHAVIKBHAI","SELL",{"v":169173,"d":"169,173"},48.15,"BSE"]
["2019-01-21",540268,"DHANVARSHA","ARTI ASHISH SHAH","BUY",{"v":75000,"d":"75,000"},48.15,"BSE"]
["2019-01-21",500125,"EIDPARRY","ARDHYA INVESTORS .","SELL",{"v":983304,"d":"983,304"},200.09,"BSE"]
{"$rows_left_out":41}
{"sheet":"Call Tracker (Equity & F&O)","index":5,"n_rows":436,"n_cols":18,"rows_kept":436,"merged":[[30,0,31,0],[30,1,31,1],[30,2,31,2],[30,9,31,9],[30,11,31,11],[30,12,31,12],[30,13,31,13],[30,14,31,14],[32,0,33,0],[32,1,33,1],[32,2,33,2],[32,9,33,9],[32,11,33,11],[32,12,33,12],[32,13,33,13],[32,14,33,14]]}
[]
[]
[]
[]
[{"$nulls":12},"Back To Main Page"]
["Retail Research Technical Calls & Fundamental Performance Report for the month of January -2019 "]
[{"$nulls":12},{"$f":"Main!B10","v":"2019-01-22"}]
[null,"Positional  Call"]
["Sr.no","Date",null,"Company","Rec","Rec Price","Stop Loss***","Call Closed At","Target","Remark","Profit / Loss per Share","Gain / Loss  %","Status","Closed Date","NSE Closed Price"]
[1,"2018-12-21",null,"TATAGLOBAL","Buy",217,209,223.5,"235-240","Part Profit of Rs.6.25/-",{"$f":"H10-F10","v":6.5},{"$f":"K10/F10","v":{"v":0.029953917050691243,"d":"3.00%"}},"Successful","2018-12-24",{"$nulls":3},"H"]
[2,"2018-12-24",null,"JSWSTEEL","Buy",299.5,289,285.5,"320-325","Loss of Rs.14/-",-14,{"v":-0.04674457429048414,"d":"-4.67%"},"Unsuccessful","2019-01-03",{"$nulls":3},"H"]
[3,"2018-12-24",null,"TATAPOWER","Buy","77.2-77.4",73.7,null,"83-84","Open",{"$nulls":4},{"$f":"VLOOKUP(D12,Sheet2!A3:M1498,6,0)","v":75.95},null,null,"R"]
[4,"2018-12-27",null,"TVSMOTOR","Buy",552.5,519,571.75,"600-620","Profit of Rs.19.25/-",{"$f":"H13-F13","v":19.25},{"$f":"K13/F13","v":{"v":0.03484162895927602,"d":"3.48%"}},"Successful","2019-01-02",{"$nulls":3},"H"]
[5,"2019-01-01",null,"ASHOKLEY","Buy",101,96,94.5,"110-112","Loss of Rs.6.5/-",-6.5,{"v":-0.06435643564356436,"d":"-6.44%"},"Unsuccessful","2019-01-07",{"$nulls":3},"R"]
[6,"2019-01-03",null,"PEL","Buy","2340-2350",2222.2,null,"2565-2585","Open",{"$nulls":4},{"$f":"VLOOKUP(D15,Sheet2!A6:M1501,6,0)","v":2281.7},null,null,"R"]
[7,"2019-01-04",null,"M&M","Buy","716-722",688,null,"770-780","Open",{"$nulls":4},{"$f":"VLOOKUP(D16,Sheet2!A7:M1502,6,0)","v":730.3},null,null,"H"]
[8,"2019-01-16",null,"BHARTIARTL","Sell",339,356.6,324.75,"310-305","Profit of Rs.14.25/-",14.25,{"$f":"K17/F17","v":{"v":0.0420353982300885,"d":"4.20%"}},"Successful","2019-01-18",{"$nulls":3},"R"]
[9,"2019-01-18",null,"TORNTPHARM","Sell","1900-1910",1990,null,"1780-1740","Open",{"$nulls":4},{"$f":"VLOOKUP(D18,Sheet2!A9:M1504,6,0)","v":1874.3},null,null,"H"]
{"$rows_empty":7}
["CLBS = Closing Basis ***",{"$nulls":4},"Reinitiated $"]
{"$rows_left_out":254}
{"sheet":"Sheet2","index":6,"n_rows":1636,"n_cols":14,"rows_kept":1636}
["SYMBOL","SERIES","OPEN","HIGH","LOW","CLOSE","LAST","PREVCLOSE","TOTTRDQTY","TOTTRDVAL","TIMESTAMP","TOTALTRADES","ISIN","ISIN"]
["20MICRONS","EQ",42.15,42.15,41,41.3,41.2,41.7,18473,763468.75,"2019-01-21",246,"INE144J01027"]
["21STCENMGM","EQ",22.55,22.6,22.1,22.1,22.1,22.55,650,14470.9,"2019-01-21",15,"INE253B01015"]
["3IINFOTECH","EQ",3.9,4,3.65,3.65,3.7,3.9,2912821,11047820.8,"2019-01-21",1451,"INE748C01020"]
["3MINDIA","EQ",20990.05,21176,20854.95,20895.9,20862,20984.5,524,11025376.35,"2019-01-21",264,"INE470A01017"]
["3PLAND","EQ",12.3,12.3,10.95,11,11,10.95,4006,44624.4,"2019-01-21",63,"INE105C01023"]
["5PAISA","EQ",274.5,274.95,259.45,259.45,259.45,273.1,8823,2315271.4,"2019-01-21",307,"INE618L01018"]
["63MOONS","EQ",90,91.65,89,89.75,89.25,90.15,175219,15823990.2,"2019-01-21",4358,"INE111B01023"]
["8KMILES","EQ",149.2,156.75,144.3,144.85,144.8,151.8,434163,64977050.65,"2019-01-21",5425,"INE650K01021"]
["A2ZINFRA","EQ",12.6,12.9,12.4,12.55,12.55,12.7,176262,2229583.1,"2019-01-21",243,"INE619I01012"]
["AARTIDRUGS","EQ",600.3,609.9,597.65,605.45,604,600.3,8093,4890334.75,"2019-01-21",364,"INE767A01016"]
["AARTIIND","EQ",1563,1571.9,1553,1570.05,1570,1549.55,38673,60557133,"2019-01-21",2221,"INE769A01020"]
["AARVEEDEN","EQ",25.45,25.95,25.2,25.6,25.55,25.65,7621,194193.45,"2019-01-21",91,"INE273D01019"]
["AAVAS","EQ",832,850,830,837.25,835,842.6,3788,3191608.15,"2019-01-21",786,"INE216P01012"]
["ABAN","EQ",72.75,73.5,72.35,73.15,72.95,72.95,233102,17017656.7,"2019-01-21",2947,"INE421A01028"]
["ABB","EQ",1281.2,1303,1275,1281.1,1281.75,1276.1,222935,289225275.9,"2019-01-21",5818,"INE117A01022"]
["ABBOTINDIA","EQ",8122.45,8250,8086,8212.9,8200,8098.35,3174,26033495.7,"2019-01-21",889,"INE358A01014"]
["ABCAPITAL","EQ",93.75,93.9,92.3,92.6,92.45,93.7,979392,91114493.65,"2019-01-21",9097,"INE674K01013"]
["ABFRL","EQ",204.4,205,201.1,201.75,201.7,203.25,470057,95566733.1,"2019-01-21",5973,"INE647O01011"]
["ABSLNN50ET","EQ",275,275,275,275,275,275,6,1650,"2019-01-21",2,"INF209KB1B87"]
{"$rows_left_out":1617}
{"sheet":"Sheet1","index":7,"n_rows":0,"n_cols":0,"rows_kept":0,"hidden":true}