{"text_format":"3","workbook":"xlsx","n_sheets":7,"sheets":["Main","Future Intra","Cash Intra","MidCap Intra","Bulk Deals","Call Tracker (Equity & F&O)","Sheet2"],"not_rendered":{"images":4,"defined_names":4},"read":"whole","date_system":"1900"}

{"sheet":"Main","index":0,"n_rows":17,"n_cols":4,"rows_kept":17}
[null,"                                                                                                 "]
{"$rows_empty":8}
[null,"2018-11-21"]
[]
[null,"Sheet No.","Template Name","Summary"]
[null,1,"Future Intra","For Intraday trading in F&O segment"]
[null,2,"Cash Intra","For Intraday trading in cash market segment"]
[null,3,"Mid-cap Intra","For Intraday trading in Mid-cap stocks"]
[null,4,"Bulk Deals","Reveals Bulk Deals carried on NSE & BSE"]
[null,5,"Call Tracker"]

{"sheet":"Future Intra","index":1,"n_rows":245,"n_cols":15,"rows_kept":245,"merged":[[8,0,9,0],[8,1,9,1],[8,2,9,2],[8,5,8,7],[8,8,8,10]]}
[]
[]
[]
[]
[{"$nulls":12},"Back to Main Page"]
["FOR INTRA DAY TRADING",{"$nulls":10},{"$f":"Main!B10","v":"2018-11-21"}]
[]
[]
["Sr.no","Sector","Scrip","CLOSE RATE","Pivot Point","Supports",null,null,"Resistances"]
[null,"Sector",null,"Point","Point","S1","S2","S3","R1","R2","R3","HIGH","LOW","OI","% Change in OI"]
[1,"Index","BANKNIFTY",{"v":26157.9,"d":"26157.90"},{"v":26167.149999999998,"d":"26167.15"},{"v":26071.499999999996,"d":"26071.50"},{"v":25985.1,"d":"25985.10"},{"v":25889.449999999997,"d":"25889.45"},{"v":26253.549999999996,"d":"26253.55"},{"v":26349.199999999997,"d":"26349.20"},{"v":26435.599999999995,"d":"26435.60"},26262.8,26080.75,1836420,{"v":-2.6130981544994286E-4,"d":"-0.03%"}]
[2,"Index","NIFTY",10671.95,{"v":10690.716666666667,"d":"10690.72"},{"v":10632.433333333334,"d":"10632.43"},{"v":10592.916666666668,"d":"10592.92"},{"v":10534.633333333335,"d":"10534.63"},{"v":10730.233333333334,"d":"10730.23"},{"v":10788.516666666666,"d":"10788.52"},{"v":10828.033333333333,"d":"10828.03"},10749,10651.2,25846875,{"v":-0.023584143884810553,"d":"-2.36%"}]
[5,"Index","NIFTYIT",{"v":14312,"d":"14312.00"},{"v":14384,"d":"14384.00"},{"v":14218,"d":"14218.00"},{"v":14124,"d":"14124.00"},{"v":13958,"d":"13958.00"},{"v":14478,"d":"14478.00"},{"v":14644,"d":"14644.00"},{"v":14738,"d":"14738.00"},14550,14290,19150,{"v":0.3927272727272727,"d":"39.27%"}]
[6,"Index","NIFTYMID50",{"v":4848,"d":"4848.00"},{"v":1616,"d":"1616.00"},{"v":3232,"d":"3232.00"},{"v":1616,"d":"1616.00"},{"v":3232,"d":"3232.00"},{"v":3232,"d":"3232.00"},{"v":1616,"d":"1616.00"},{"v":3232,"d":"3232.00"},0,0,694870,{"v":0,"d":"0.00%"}]
[8,"Cement","ACC",{"v":1475,"d":"1475.00"},{"v":1483.2833333333335,"d":"1483.28"},{"v":1464.066666666667,"d":"1464.07"},{"v":1453.1333333333334,"d":"1453.13"},{"v":1433.916666666667,"d":"1433.92"},{"v":1494.2166666666672,"d":"1494.22"},{"v":1513.4333333333338,"d":"1513.43"},{"v":1524.3666666666672,"d":"1524.37"},1502.5,1472.35,1082800,{"v":1.1094674556213018E-3,"d":"0.11%"}]
[9,"Others","ADANIENT",{"v":160.7,"d":"160.70"},{"v":160.70000000000002,"d":"160.70"},{"v":157.40000000000003,"d":"157.40"},{"v":154.10000000000002,"d":"154.10"},{"v":150.80000000000004,"d":"150.80"},{"v":164.00000000000003,"d":"164.00"},{"v":167.30000000000004,"d":"167.30"},{"v":170.60000000000002,"d":"170.60"},164,157.4,45128000,{"v":-0.009655898876404494,"d":"-0.97%"}]
[10,"Others","ADANIPORTS",{"v":354.8,"d":"354.80"},{"v":353.81666666666666,"d":"353.82"},{"v":350.23333333333335,"d":"350.23"},{"v":345.6666666666667,"d":"345.67"},{"v":342.08333333333337,"d":"342.08"},{"v":358.3833333333333,"d":"358.38"},{"v":361.9666666666667,"d":"361.97"},{"v":366.5333333333333,"d":"366.53"},357.4,349.25,17527500,{"v":-0.010165184243964422,"d":"-1.02%"}]
[11,"Power","ADANIPOWER",47.45,{"v":47.88333333333333,"d":"47.88"},{"v":46.46666666666667,"d":"46.47"},{"v":45.483333333333334,"d":"45.48"},{"v":44.06666666666667,"d":"44.07"},{"v":48.86666666666667,"d":"48.87"},{"v":50.28333333333334,"d":"50.28"},{"v":51.266666666666666,"d":"51.27"},49.3,46.9,154640000,{"v":-0.005914116739521728,"d":"-0.59%"}]
[12,"Pharma","AJANTPHARM",{"v":1109.1,"d":"1109.10"},{"v":1118.0666666666666,"d":"1118.07"},{"v":1092.2333333333331,"d":"1092.23"},{"v":1075.3666666666666,"d":"1075.37"},{"v":1049.533333333333,"d":"1049.53"},{"v":1134.9333333333332,"d":"1134.93"},{"v":1160.7666666666667,"d":"1160.77"},{"v":1177.6333333333332,"d":"1177.63"},1143.9,1101.2,766000,{"v":-0.02544529262086514,"d":"-2.54%"}]
[13,"Banking","ALBK",44.75,{"v":44.01666666666667,"d":"44.02"},{"v":42.933333333333344,"d":"42.93"},{"v":41.116666666666674,"d":"41.12"},{"v":40.033333333333346,"d":"40.03"},{"v":45.83333333333334,"d":"45.83"},{"v":46.91666666666667,"d":"46.92"},{"v":48.73333333333334,"d":"48.73"},45.1,42.2,21654000,{"v":0.14214884751305448,"d":"14.21%"}]
{"$rows_left_out":219}
{"sheet":"Cash Intra","index":2,"n_rows":248,"n_cols":13,"rows_kept":248,"merged":[[7,0,8,0],[7,1,8,1],[7,2,8,2],[7,3,8,3],[7,4,7,6],[7,7,7,9]]}
[]
[]
[]
[]
[{"$nulls":12},"Back to Main Page"]
["FOR INTRA DAY TRADING",{"$nulls":9},{"$f":"Main!B10","v":"2018-11-21"}]
[]
["Sr.no","Scrip","CLOSE RATE","Pivot Point","Supports",null,null,"Resistances"]
[null,null,"Point",null,"S1","S2","S3","R1","R2","R3","HIGH","LOW","Total Trade Quanity in Lakhs"]
[1,"Nifty 50",10656.2,{"v":10679.300000000001,"d":"10679.30"},{"v":10617.750000000002,"d":"10617.75"},{"v":10579.300000000001,"d":"10579.30"},{"v":10517.750000000002,"d":"10517.75"},{"v":10717.750000000002,"d":"10717.75"},{"v":10779.300000000001,"d":"10779.30"},{"v":10817.750000000002,"d":"10817.75"},10740.85,10640.85]
[2,"Nifty Bank",26113.35,{"v":26138.183333333334,"d":"26138.18"},{"v":26016.966666666667,"d":"26016.97"},{"v":25920.583333333332,"d":"25920.58"},{"v":25799.366666666665,"d":"25799.37"},{"v":26234.56666666667,"d":"26234.57"},{"v":26355.783333333336,"d":"26355.78"},{"v":26452.16666666667,"d":"26452.17"},26259.4,26041.8]
[3,"Nifty CPSE",2131.45,{"v":2144.3,"d":"2144.30"},{"v":2114.4500000000003,"d":"2114.45"},{"v":2097.4500000000003,"d":"2097.45"},{"v":2067.6000000000004,"d":"2067.60"},{"v":2161.3,"d":"2161.30"},{"v":2191.1500000000005,"d":"2191.15"},2208.15,2174.15,2127.3]
[4,"Nifty Infra",3121.25,{"v":3125.7166666666667,"d":"3125.72"},{"v":3109.1833333333334,"d":"3109.18"},{"v":3097.116666666667,"d":"3097.12"},{"v":3080.5833333333335,"d":"3080.58"},{"v":3137.7833333333333,"d":"3137.78"},{"v":3154.316666666667,"d":"3154.32"},{"v":3166.383333333333,"d":"3166.38"},3142.25,3113.65]
[5,"Nifty IT",14285.05,{"v":14374.199999999999,"d":"14374.20"},{"v":14173.149999999998,"d":"14173.15"},{"v":14061.249999999998,"d":"14061.25"},{"v":13860.199999999997,"d":"13860.20"},{"v":14486.099999999999,"d":"14486.10"},{"v":14687.149999999998,"d":"14687.15"},14799.05,14575.25,14262.3]
[6,"Nifty PSE",3381.85,{"v":3396.683333333333,"d":"3396.68"},{"v":3361.5666666666657,"d":"3361.57"},{"v":3341.283333333333,"d":"3341.28"},{"v":3306.1666666666656,"d":"3306.17"},{"v":3416.966666666666,"d":"3416.97"},{"v":3452.0833333333335,"d":"3452.08"},{"v":3472.366666666666,"d":"3472.37"},3431.8,3376.4]
[7,"Nifty Midcap 50",4786.7,{"v":4807.033333333333,"d":"4807.03"},{"v":4756.416666666666,"d":"4756.42"},{"v":4726.133333333333,"d":"4726.13"},{"v":4675.516666666666,"d":"4675.52"},{"v":4837.316666666666,"d":"4837.32"},{"v":4887.9333333333325,"d":"4887.93"},{"v":4918.216666666665,"d":"4918.22"},4857.65,4776.75]
[8,"ABB",1342.7,{"v":1343.2,"d":"1343.20"},{"v":1336.4,"d":"1336.40"},{"v":1330.1000000000001,"d":"1330.10"},{"v":1323.3000000000002,"d":"1323.30"},{"v":1349.5,"d":"1349.50"},{"v":1356.2999999999997,"d":"1356.30"},{"v":1362.6,"d":"1362.60"},1350,1336.9,0.3758]
[9,"ACC",1469.95,{"v":1478.5166666666667,"d":"1478.52"},{"v":1458.7333333333333,"d":"1458.73"},{"v":1447.5166666666667,"d":"1447.52"},{"v":1427.7333333333333,"d":"1427.73"},{"v":1489.7333333333333,"d":"1489.73"},{"v":1509.5166666666667,"d":"1509.52"},{"v":1520.7333333333333,"d":"1520.73"},1498.3,1467.3,4.62997]
[10,"AIAENG",1641.05,1646.45,{"v":1619.6000000000001,"d":"1619.60"},1598.15,{"v":1571.3000000000002,"d":"1571.30"},{"v":1667.9,"d":"1667.90"},1694.75,{"v":1716.2,"d":"1716.20"},1673.3,1625,0.53178]
[11,"AUBANK",588.75,{"v":584.3333333333334,"d":"584.33"},{"v":564.7666666666668,"d":"564.77"},{"v":540.7833333333334,"d":"540.78"},{"v":521.2166666666668,"d":"521.22"},{"v":608.3166666666667,"d":"608.32"},{"v":627.8833333333333,"d":"627.88"},{"v":651.8666666666667,"d":"651.87"},603.9,560.35,4.07832]
{"$rows_left_out":229}
{"sheet":"MidCap Intra","index":3,"n_rows":510,"n_cols":13,"rows_kept":510,"merged":[[0,0,0,1],[8,0,9,0],[8,1,9,1],[8,2,9,2],[8,3,9,3],[8,4,8,6],[8,7,8,9]]}
[]
[]
[]
[]
[{"$nulls":11},"Back To Main Page"]
["FOR INTRA DAY TRADING",{"$nulls":9},{"$f":"Main!B10","v":"2018-11-21"}]
[null,null," "]
[]
["Sr.no","Scrip","CLOSE RATE","Pivot Point","Supports",null,null,"Resistances"]
[null,null,"Point",null,"S1","S2","S3","R1","R2","R3","HIGH","LOW","Total Trade Quanity in Lakhs"]
[1,"3MINDIA",20290.2,{"v":20330,"d":"20330.00"},{"v":20160.2,"d":"20160.20"},{"v":20030.2,"d":"20030.20"},{"v":19860.4,"d":"19860.40"},{"v":20460,"d":"20460.00"},{"v":20629.800000000003,"d":"20629.80"},{"v":20759.8,"d":"20759.80"},20499.8,20200,0.01274]
[2,"8KMILES",130.8,{"v":127.73333333333335,"d":"127.73"},{"v":124.66666666666669,"d":"124.67"},{"v":118.53333333333333,"d":"118.53"},{"v":115.46666666666667,"d":"115.47"},{"v":133.8666666666667,"d":"133.87"},{"v":136.93333333333337,"d":"136.93"},{"v":143.06666666666672,"d":"143.07"},130.8,121.6,8.16549]
[3,"AARTIIND",1491.65,1481.55,{"v":1461.1,"d":"1461.10"},1430.55,{"v":1410.1,"d":"1410.10"},{"v":1512.1,"d":"1512.10"},{"v":1532.5500000000002,"d":"1532.55"},{"v":1563.1,"d":"1563.10"},1502,1451,1.19984]
[4,"ABAN",81.45,{"v":81.96666666666667,"d":"81.97"},{"v":80.13333333333334,"d":"80.13"},{"v":78.81666666666668,"d":"78.82"},{"v":76.98333333333335,"d":"76.98"},{"v":83.28333333333333,"d":"83.28"},{"v":85.11666666666665,"d":"85.12"},{"v":86.43333333333332,"d":"86.43"},83.8,80.65,5.90732]
[5,"ABB",1342.7,{"v":1343.2,"d":"1343.20"},{"v":1336.4,"d":"1336.40"},{"v":1330.1000000000001,"d":"1330.10"},{"v":1323.3000000000002,"d":"1323.30"},{"v":1349.5,"d":"1349.50"},{"v":1356.2999999999997,"d":"1356.30"},{"v":1362.6,"d":"1362.60"},1350,1336.9,0.3758]
[6,"ABCAPITAL",112.8,{"v":113.61666666666667,"d":"113.62"},{"v":111.48333333333335,"d":"111.48"},{"v":110.16666666666667,"d":"110.17"},{"v":108.03333333333335,"d":"108.03"},{"v":114.93333333333335,"d":"114.93"},{"v":117.06666666666668,"d":"117.07"},{"v":118.38333333333335,"d":"118.38"},115.75,112.3,15.58279]
[7,"ABFRL",187.6,188.15,{"v":185.70000000000002,"d":"185.70"},{"v":183.8,"d":"183.80"},{"v":181.35000000000002,"d":"181.35"},190.05,{"v":192.5,"d":"192.50"},{"v":194.4,"d":"194.40"},190.6,186.25,5.51764]
[8,"ACC",1469.95,{"v":1478.5166666666667,"d":"1478.52"},{"v":1458.7333333333333,"d":"1458.73"},{"v":1447.5166666666667,"d":"1447.52"},{"v":1427.7333333333333,"d":"1427.73"},{"v":1489.7333333333333,"d":"1489.73"},{"v":1509.5166666666667,"d":"1509.52"},{"v":1520.7333333333333,"d":"1520.73"},1498.3,1467.3,4.62997]
[9,"ADANIPORTS",355.25,{"v":353.26666666666665,"d":"353.27"},{"v":348.9833333333333,"d":"348.98"},{"v":342.71666666666664,"d":"342.72"},{"v":338.4333333333333,"d":"338.43"},{"v":359.5333333333333,"d":"359.53"},{"v":363.8166666666666,"d":"363.82"},{"v":370.0833333333333,"d":"370.08"},357.55,347,57.78336]
[10,"ADANIPOWER",47.25,{"v":47.666666666666664,"d":"47.67"},{"v":46.33333333333333,"d":"46.33"},{"v":45.416666666666664,"d":"45.42"},{"v":44.08333333333333,"d":"44.08"},{"v":48.58333333333333,"d":"48.58"},{"v":49.91666666666666,"d":"49.92"},{"v":50.83333333333333,"d":"50.83"},49,46.75,141.51952]
{"$rows_left_out":491}
{"sheet":"Bulk Deals","index":4,"n_rows":82,"n_cols":8,"rows_kept":82,"merged":[[4,0,4,1],[4,2,4,3],[6,1,6,2]]}
[" "]
[]
[]
[]
[]
[{"$nulls":4},"Back To Main Page"]
["Subject :","BULK DEAL",null,{"$f":"Main!B10","v":"2018-11-21"}]
[]
["Date","Scrip code","Scrip Name","Client Name","Buy / Sell","Quantity Traded","Trade Price / Wt.Avg.trade price","Exchange  "]
["2018-11-20",532172,"ADROITINFO","PARO SECURITIES P LTD","BUY",{"v":102647,"d":"102,647"},18.55,"BSE"]
["2018-11-20",532172,"ADROITINFO","PARO SECURITIES P LTD","SELL",11,18.68,"BSE"]
["2018-11-20",532172,"ADROITINFO","AMBE SECURITIES PRIVATE LIMITED","SELL",{"v":104400,"d":"104,400"},18.55,"BSE"]
["2018-11-20",500102,"BALLARPUR","FINQUEST FINANCIAL SOLUTIONS PVT. LTD.","SELL",{"v":40150000,"d":"40,150,000"},6.51,"BSE"]
["2018-11-20",500102,"BALLARPUR","HYPNOS FUND LIMITED","BUY",{"v":40000000,"d":"40,000,000"},6.51,"BSE"]
["2018-11-20",538521,"CROWNTOURS","JAY BHAVSAR","BUY",{"v":26768,"d":"26,768"},21.69,"BSE"]
["2018-11-20",532332,"CURATECH","PRAVEEN GUPTA & SONS HUF","BUY",{"v":54001,"d":"54,001"},3.91,"BSE"]
["2018-11-20",532332,"CURATECH","SATISH KUMAR","BUY",{"v":50000,"d":"50,000"},3.9,"BSE"]
["2018-11-20",532332,"CURATECH","KADAYAM RAMNATHAN BHARAT","SELL",{"v":104001,"d":"104,001"},3.9,"BSE"]
["2018-11-20",533137,"DEN","SHAILENDER NATH SHARMA","SELL",{"v":1000000,"d":"1,000,000"},68,"BSE"]
["2018-11-20",531502,"ESARIND","CRB TRUSTEE LIMITED","SELL",{"v":170924,"d":"170,924"},0.64,"BSE"]
{"$rows_left_out":63}
{"sheet":"Call Tracker (Equity & F&O)","index":5,"n_rows":285,"n_cols":18,"rows_kept":285,"merged":[[28,0,29,0],[28,1,29,1],[28,9,29,9],[28,11,29,11],[28,12,29,12],[28,13,29,13],[28,14,29,14],[28,17,29,17],[30,0,31,0],[30,1,31,1],[30,9,31,9],[30,11,31,11],[30,12,31,12],[30,13,31,13],[30,14,31,14],[30,17,31,17],[32,0,33,0],[32,1,33,1],[32,9,33,9],[32,11,33,11],[32,12,33,12],[32,13,33,13],[32,14,33,14],[32,17,33,17],[34,0,35,0],[34,1,35,1],[34,2,35,2],[34,9,35,9],[34,11,35,11],[34,12,35,12],[34,13,35,13],[34,14,35,14],[46,0,47,0],[46,1,47,1],[46,2,47,2],[46,9,47,9],[46,11,47,11],[46,12,47,12],[46,13,47,13],[46,14,47,14],[48,0,49,0],[48,1,49,1],[48,2,49,2],[48,9,49,9],[48,11,49,11],[48,12,49,12],[48,13,49,13],[48,14,49,14]]}
[]
[]
[]
[]
[{"$nulls":12},"Back To Main Page"]
["Retail Research Technical Calls & Fundamental Performance Report for the month of November -2018 "]
[{"$nulls":12},{"$f":"Main!B10","v":"2018-11-21"}]
[null,"Positional  Call"]
["Sr.no","Date",null,"Company","Rec","Rec Price","Stop Loss***","Call Closed At","Target","Remark","Profit / Loss per Share","Gain / Loss  %","Status","Closed Date","NSE Closed Price"]
[1,"2018-10-25",null,"SUNPHARMA","Buy{}",569,528,587.5,"620-630","Profit of Rs.18.5/-",{"$f":"H10-F10","v":18.5},{"$f":"K10/F10","v":{"v":0.03251318101933216,"d":"3.25%"}},"Successful","2018-11-09",{"$nulls":3},"H"]
[2,"2018-11-02",null,"MARUTI","Buy{}",6860,6580,7140,"7300-7500","Profit of Rs.280/-",{"$f":"H11-F11","v":280},{"$f":"K11/F11","v":{"v":0.04081632653061224,"d":"4.08%"}},"Successful","2018-11-05",{"$nulls":3},"H"]
[3,"2018-11-09",null,"RECLTD","Buy",122.5,116.3,127,"133-137","Part profit of Rs.4.5/-",{"$f":"H12-F12","v":4.5},{"$f":"K12/F12","v":{"v":0.036734693877551024,"d":"3.67%"}},"Successful","2018-11-12",{"$nulls":3},"R"]
[4,"2018-11-12",null,"SRF","Buy",2040,1940,2105,"2200-2250","Part profit of Rs.65/-",{"$f":"H13-F13","v":65},{"$f":"K13/F13","v":{"v":0.031862745098039214,"d":"3.19%"}},"Successful","2018-11-19",{"$nulls":3},"H"]
[5,"2018-11-12",null,"GAIL","Buy",363.5,348,346,"385-395","Loss of Rs.17.50/-",{"$f":"H14-F14","v":-17.5},{"$f":"K14/F14","v":{"v":-0.048143053645116916,"d":"-4.81%"}},"Unuccessful","2018-11-16",{"$nulls":3},"H"]
[6,"2018-11-13",null,"IOC","Buy",137.5,134,142.25,"146-150","Profit of Rs.4.75/-",{"$f":"H15-F15","v":4.75},{"$f":"K15/F15","v":{"v":0.034545454545454546,"d":"3.45%"}},"Successful","2018-11-13",{"$nulls":3},"H"]
[7,"2018-11-13",null,"NIITTECH","Buy",1195,1144.4,1144.4,"1300-1310","Loss of Rs.50.6/-",{"$f":"H16-F16","v":-50.59999999999991},{"$f":"K16/F16","v":{"v":-0.04234309623430955,"d":"-4.23%"}},"Unuccessful","2018-11-14",{"$nulls":3},"R"]
[8,"2018-11-14",null,"ASHOKLEY","Buy","107.5-108.5",100.7,null,"122-125","Open",{"$nulls":4},{"$f":"VLOOKUP(D17,Sheet2!A6:M1642,6,0)","v":107.65},null,null,"R"]
[9,"2018-11-16",null,"JSWSTEEL","Buy","337-339",324,null,"365-375","Open",{"$nulls":4},{"$f":"VLOOKUP(D18,Sheet2!A7:M1643,6,0)","v":328.25},null,null,"H"]
[10,"2018-11-20",null,"GLENMARK","Buy","625-630",598.7,null,"700-710","Open",{"$nulls":4},{"$f":"VLOOKUP(D19,Sheet2!A8:M1644,6,0)","v":635.4},null,null,"R"]
[11,"2018-11-20",null,"NIITTECH","Buy","1120-1127",1078,null,"1180-1200","Open",{"$nulls":4},{"$f":"VLOOKUP(D20,Sheet2!A9:M1645,6,0)","v":1108.65},null,null,"H"]
{"$rows_left_out":254}
{"sheet":"Sheet2","index":6,"n_rows":1639,"n_cols":14,"rows_kept":1639,"hidden":true}
["SYMBOL","SERIES","OPEN","HIGH","LOW","CLOSE","LAST","PREVCLOSE","TOTTRDQTY","TOTTRDVAL","TIMESTAMP","TOTALTRADES","ISIN","ISIN"]
["20MICRONS","EQ",46,46.8,44.2,44.55,44.65,46.5,37379,1693195.25,"2018-11-20",588,"INE144J01027"]
["21STCENMGM","EQ",23.2,23.65,23.2,23.4,23.5,23.2,1560,36619.4,"2018-11-20",20,"INE253B01015"]
["3IINFOTECH","EQ",4.4,4.75,4.05,4.35,4.35,4.4,16982862,75321352.7,"2018-11-20",6852,"INE748C01020"]
["3MINDIA","EQ",20400,20499.8,20200,20290.2,20280,20433.75,1274,25913741.35,"2018-11-20",363,"INE470A01017"]
["5PAISA","EQ",202.9,202.9,197,199.75,197.65,200.1,3095,620892.6,"2018-11-20",131,"INE618L01018"]
["63MOONS","EQ",87.5,88,83.1,83.9,83.2,87.95,240007,20605309.5,"2018-11-20",5374,"INE111B01023"]
["8KMILES","EQ",130.8,130.8,121.6,130.8,130.8,124.6,816549,106467359,"2018-11-20",3521,"INE650K01021"]
["A2ZINFRA","EQ",14.1,14.1,13.5,13.8,14,14.1,143823,1981536.3,"2018-11-20",450,"INE619I01012"]
["AARTIDRUGS","EQ",567.95,567.95,475,546.5,554.95,566,124291,65748828.45,"2018-11-20",7177,"INE767A01016"]
["AARTIIND","EQ",1458,1502,1451,1491.65,1475.05,1452.25,119984,178035784.5,"2018-11-20",7590,"INE769A01020"]
["AARVEEDEN","EQ",24.7,24.7,24.3,24.35,24.3,24.8,814,19855.2,"2018-11-20",14,"INE273D01019"]
["AAVAS","EQ",680.45,695,676.55,690.25,690,685.2,7517,5170107.05,"2018-11-20",1452,"INE216P01012"]
["ABAN","EQ",81.5,83.8,80.65,81.45,80.85,82,590732,48587803.5,"2018-11-20",7063,"INE421A01028"]
["ABB","EQ",1348,1350,1336.9,1342.7,1340,1350.7,37580,50475147.3,"2018-11-20",3673,"INE117A01022"]
["ABBOTINDIA","EQ",7600,7691,7516.05,7619.7,7656,7630.55,3118,23691301.85,"2018-11-20",1457,"INE358A01014"]
["ABCAPITAL","EQ",115.65,115.75,112.3,112.8,112.75,116.15,1558279,177970154.45,"2018-11-20",14448,"INE674K01013"]
["ABFRL","EQ",190.6,190.6,186.25,187.6,186.8,191.1,551764,104587245.6,"2018-11-20",3454,"INE647O01011"]
["ACC","EQ",1491,1498.3,1467.3,1469.95,1470,1501.65,462997,686288620.15,"2018-11-20",15521,"INE012A01025"]
["ACCELYA","EQ",946,951.2,936.05,943.3,944.4,946,1752,1651565.1,"2018-11-20",204,"INE793A01012"]
{"$rows_left_out":1619}