{"text_format":"3","workbook":"xlsx","n_sheets":9,"sheets":["Main","Future Intra","Cash Intra","MidCap Intra","Bulk Deals","Call Tracker (Equity & F&O)","Sheet2","Sheet1","Sheet3"],"not_rendered":{"images":4,"defined_names":4},"read":"whole","date_system":"1900"}

{"sheet":"Main","index":0,"n_rows":17,"n_cols":4,"rows_kept":17}
[null,"                                                                                                 "]
{"$rows_empty":8}
[null,"2019-02-21"]
[]
[null,"Sheet No.","Template Name","Summary"]
[null,1,"Future Intra","For Intraday trading in F&O segment"]
[null,2,"Cash Intra","For Intraday trading in cash market segment"]
[null,3,"Mid-cap Intra","For Intraday trading in Mid-cap stocks"]
[null,4,"Bulk Deals","Reveals Bulk Deals carried on NSE & BSE"]
[null,5,"Call Tracker"]

{"sheet":"Future Intra","index":1,"n_rows":239,"n_cols":15,"rows_kept":239,"merged":[[8,0,9,0],[8,1,9,1],[8,2,9,2],[8,5,8,7],[8,8,8,10]]}
[]
[]
[]
[]
[{"$nulls":12},"Back to Main Page"]
["FOR INTRA DAY TRADING",{"$nulls":10},{"$f":"Main!B10","v":"2019-02-21"}]
[]
[]
["Sr.no","Sector","Scrip","CLOSE RATE","Pivot Point","Supports",null,null,"Resistances"]
[null,"Sector",null,"Point","Point","S1","S2","S3","R1","R2","R3","HIGH","LOW","OI","% Change in OI"]
[1,"Index","BANKNIFTY",27017.95,{"v":26933.483333333337,"d":"26933.48"},{"v":26814.616666666676,"d":"26814.62"},{"v":26611.28333333334,"d":"26611.28"},{"v":26492.41666666668,"d":"26492.42"},{"v":27136.816666666673,"d":"27136.82"},{"v":27255.683333333334,"d":"27255.68"},{"v":27459.01666666667,"d":"27459.02"},27052.35,26730.15,1523080,{"v":-0.07088477868332439,"d":"-7.09%"}]
[2,"Index","NIFTY",10751.85,{"v":10723.933333333332,"d":"10723.93"},{"v":10677.866666666665,"d":"10677.87"},{"v":10603.883333333333,"d":"10603.88"},{"v":10557.816666666666,"d":"10557.82"},{"v":10797.916666666664,"d":"10797.92"},{"v":10843.983333333334,"d":"10843.98"},{"v":10917.966666666664,"d":"10917.97"},10770,10649.95,24342900,{"v":-0.002945955991902461,"d":"-0.29%"}]
[3,"Index","NIFTYIT",{"v":15641,"d":"15641.00"},{"v":15573.666666666666,"d":"15573.67"},{"v":15462.333333333332,"d":"15462.33"},{"v":15283.666666666666,"d":"15283.67"},{"v":15172.333333333332,"d":"15172.33"},{"v":15752.333333333332,"d":"15752.33"},{"v":15863.666666666664,"d":"15863.67"},{"v":16042.333333333332,"d":"16042.33"},15685,15395,23600,{"v":-0.19039451114922812,"d":"-19.04%"}]
[4,"Cement","ACC",1390.15,{"v":1383.1166666666668,"d":"1383.12"},{"v":1369.2333333333336,"d":"1369.23"},{"v":1348.3166666666668,"d":"1348.32"},{"v":1334.4333333333336,"d":"1334.43"},{"v":1404.0333333333335,"d":"1404.03"},{"v":1417.9166666666667,"d":"1417.92"},{"v":1438.8333333333335,"d":"1438.83"},1397,1362.2,2246400,{"v":1.6051364365971107E-3,"d":"0.16%"}]
[5,"Others","ADANIENT",{"v":120.8,"d":"120.80"},{"v":120.40000000000002,"d":"120.40"},{"v":118.80000000000004,"d":"118.80"},{"v":116.80000000000003,"d":"116.80"},{"v":115.20000000000005,"d":"115.20"},{"v":122.40000000000003,"d":"122.40"},{"v":124.00000000000003,"d":"124.00"},{"v":126.00000000000003,"d":"126.00"},122,118.4,41420000,{"v":0,"d":"0.00%"}]
[6,"Others","ADANIPORTS",{"v":355,"d":"355.00"},{"v":350.98333333333335,"d":"350.98"},{"v":345.6166666666667,"d":"345.62"},{"v":336.23333333333335,"d":"336.23"},{"v":330.8666666666667,"d":"330.87"},{"v":360.3666666666667,"d":"360.37"},{"v":365.73333333333335,"d":"365.73"},{"v":375.1166666666667,"d":"375.12"},356.35,341.6,19802500,{"v":-0.030121219542059506,"d":"-3.01%"}]
[7,"Power","ADANIPOWER",39.95,{"v":39.38333333333333,"d":"39.38"},{"v":37.36666666666667,"d":"37.37"},{"v":34.78333333333333,"d":"34.78"},{"v":32.766666666666666,"d":"32.77"},{"v":41.96666666666667,"d":"41.97"},{"v":43.983333333333334,"d":"43.98"},{"v":46.56666666666667,"d":"46.57"},41.4,36.8,163940000,{"v":0.012725475660983445,"d":"1.27%"}]
[8,"Pharma","AJANTPHARM",{"v":970.4,"d":"970.40"},{"v":963.8833333333332,"d":"963.88"},{"v":951.5666666666664,"d":"951.57"},{"v":932.7333333333331,"d":"932.73"},{"v":920.4166666666663,"d":"920.42"},{"v":982.7166666666665,"d":"982.72"},{"v":995.0333333333333,"d":"995.03"},{"v":1013.8666666666666,"d":"1013.87"},976.2,945.05,1207500,{"v":-0.01589242053789731,"d":"-1.59%"}]
[9,"Banking","ALBK",41.55,{"v":40.93333333333333,"d":"40.93"},{"v":39.91666666666666,"d":"39.92"},{"v":38.283333333333324,"d":"38.28"},{"v":37.26666666666665,"d":"37.27"},{"v":42.56666666666666,"d":"42.57"},{"v":43.58333333333333,"d":"43.58"},{"v":45.21666666666667,"d":"45.22"},41.95,39.3,32422000,{"v":0.05857385398981324,"d":"5.86%"}]
[10,"Automobile","AMARAJABAT",725.35,{"v":727.0666666666666,"d":"727.07"},{"v":710.6333333333332,"d":"710.63"},{"v":695.9166666666666,"d":"695.92"},{"v":679.4833333333332,"d":"679.48"},{"v":741.7833333333332,"d":"741.78"},{"v":758.2166666666666,"d":"758.22"},{"v":772.9333333333332,"d":"772.93"},743.5,712.35,1099700,{"v":0.01880674448767834,"d":"1.88%"}]
{"$rows_left_out":210}
{"sheet":"Cash Intra","index":2,"n_rows":247,"n_cols":13,"rows_kept":247,"merged":[[7,0,8,0],[7,1,8,1],[7,2,8,2],[7,3,8,3],[7,4,7,6],[7,7,7,9]]}
[]
[]
[]
[]
[{"$nulls":12},"Back to Main Page"]
["FOR INTRA DAY TRADING",{"$nulls":9},{"$f":"Main!B10","v":"2019-02-21"}]
[]
["Sr.no","Scrip","CLOSE RATE","Pivot Point","Supports",null,null,"Resistances"]
[null,null,"Point",null,"S1","S2","S3","R1","R2","R3","HIGH","LOW","Total Trade Quanity in Lakhs"]
[1,"Nifty 50",10735.45,{"v":10711.516666666668,"d":"10711.52"},{"v":10670.333333333336,"d":"10670.33"},{"v":10605.216666666667,"d":"10605.22"},{"v":10564.033333333335,"d":"10564.03"},{"v":10776.633333333337,"d":"10776.63"},{"v":10817.816666666668,"d":"10817.82"},{"v":10882.933333333338,"d":"10882.93"},10752.7,10646.4]
[2,"Nifty Bank",26955.5,{"v":26891.216666666664,"d":"26891.22"},{"v":26796.933333333327,"d":"26796.93"},{"v":26638.366666666665,"d":"26638.37"},{"v":26544.08333333333,"d":"26544.08"},{"v":27049.783333333326,"d":"27049.78"},{"v":27144.06666666666,"d":"27144.07"},{"v":27302.633333333324,"d":"27302.63"},26985.5,26732.65]
[3,"Nifty CPSE",1944.1,{"v":1936.4333333333334,"d":"1936.43"},{"v":1916.3666666666668,"d":"1916.37"},{"v":1888.6333333333334,"d":"1888.63"},{"v":1868.5666666666668,"d":"1868.57"},{"v":1964.1666666666667,"d":"1964.17"},{"v":1984.2333333333333,"d":"1984.23"},{"v":2011.9666666666667,"d":"2011.97"},1956.5,1908.7]
[4,"Nifty Infra",2900.8,{"v":2891.616666666667,"d":"2891.62"},{"v":2875.4833333333336,"d":"2875.48"},{"v":2850.166666666667,"d":"2850.17"},{"v":2834.0333333333338,"d":"2834.03"},{"v":2916.9333333333334,"d":"2916.93"},{"v":2933.0666666666666,"d":"2933.07"},{"v":2958.383333333333,"d":"2958.38"},2907.75,2866.3]
[5,"Nifty IT",15609.45,15530.65,{"v":15409.599999999999,"d":"15409.60"},{"v":15209.749999999998,"d":"15209.75"},{"v":15088.699999999997,"d":"15088.70"},{"v":15730.5,"d":"15730.50"},15851.55,{"v":16051.400000000001,"d":"16051.40"},15651.7,15330.8]
[6,"Nifty PSE",3130.15,{"v":3119.5833333333335,"d":"3119.58"},{"v":3094.366666666667,"d":"3094.37"},{"v":3058.5833333333335,"d":"3058.58"},{"v":3033.366666666667,"d":"3033.37"},{"v":3155.366666666667,"d":"3155.37"},{"v":3180.583333333333,"d":"3180.58"},{"v":3216.366666666667,"d":"3216.37"},3144.8,3083.8]
[7,"Nifty Midcap 50",4468.05,{"v":4458,"d":"4458.00"},4442.75,4417.45,{"v":4402.2,"d":"4402.20"},{"v":4483.3,"d":"4483.30"},4498.55,4523.85,4473.25,4432.7]
[8,"ABB",1250.5,{"v":1256.8500000000001,"d":"1256.85"},{"v":1239.2000000000003,"d":"1239.20"},{"v":1227.9,"d":"1227.90"},{"v":1210.2500000000002,"d":"1210.25"},{"v":1268.1500000000003,"d":"1268.15"},{"v":1285.8000000000004,"d":"1285.80"},{"v":1297.1000000000004,"d":"1297.10"},1274.5,1245.55,0.63952]
[9,"ACC",1382.5,{"v":1378.1666666666667,"d":"1378.17"},{"v":1364.3333333333335,"d":"1364.33"},{"v":1346.1666666666667,"d":"1346.17"},{"v":1332.3333333333335,"d":"1332.33"},{"v":1396.3333333333335,"d":"1396.33"},{"v":1410.166666666667,"d":"1410.17"},{"v":1428.3333333333335,"d":"1428.33"},1392,1360,7.06935]
[10,"AIAENG",1615.2,1624.45,{"v":1600.8000000000002,"d":"1600.80"},{"v":1586.4,"d":"1586.40"},{"v":1562.7500000000002,"d":"1562.75"},{"v":1638.8500000000001,"d":"1638.85"},{"v":1662.5000000000002,"d":"1662.50"},{"v":1676.9,"d":"1676.90"},1648.1,1610.05,0.09284]
[11,"AUBANK",564.4,{"v":564.9666666666667,"d":"564.97"},{"v":557.4333333333334,"d":"557.43"},{"v":550.4666666666667,"d":"550.47"},{"v":542.9333333333334,"d":"542.93"},{"v":571.9333333333334,"d":"571.93"},{"v":579.4666666666667,"d":"579.47"},{"v":586.4333333333334,"d":"586.43"},572.5,558,1.34989]
{"$rows_left_out":228}
{"sheet":"MidCap Intra","index":3,"n_rows":510,"n_cols":13,"rows_kept":510,"merged":[[0,0,0,1],[8,0,9,0],[8,1,9,1],[8,2,9,2],[8,3,9,3],[8,4,8,6],[8,7,8,9]]}
[]
[]
[]
[]
[{"$nulls":11},"Back To Main Page"]
["FOR INTRA DAY TRADING",{"$nulls":9},{"$f":"Main!B10","v":"2019-02-21"}]
[null,null," "]
[]
["Sr.no","Scrip","CLOSE RATE","Pivot Point","Supports",null,null,"Resistances"]
[null,null,"Point",null,"S1","S2","S3","R1","R2","R3","HIGH","LOW","Total Trade Quanity in Lakhs"]
[1,"3MINDIA",21971.9,{"v":21899.3,"d":"21899.30"},{"v":21685.6,"d":"21685.60"},{"v":21399.3,"d":"21399.30"},{"v":21185.6,"d":"21185.60"},{"v":22185.6,"d":"22185.60"},{"v":22399.300000000003,"d":"22399.30"},{"v":22685.6,"d":"22685.60"},22113,21613,0.02185]
[2,"8KMILES",111.15,{"v":110.53333333333335,"d":"110.53"},{"v":108.11666666666669,"d":"108.12"},{"v":105.08333333333334,"d":"105.08"},{"v":102.66666666666669,"d":"102.67"},{"v":113.56666666666669,"d":"113.57"},{"v":115.98333333333335,"d":"115.98"},{"v":119.0166666666667,"d":"119.02"},112.95,107.5,2.5361]
[3,"AARTIIND",1308.65,{"v":1325.8,"d":"1325.80"},1282.85,1257.05,{"v":1214.1,"d":"1214.10"},{"v":1351.6,"d":"1351.60"},{"v":1394.5500000000002,"d":"1394.55"},1420.35,1368.75,1300,4.20513]
[4,"ABAN",52.95,{"v":53.333333333333336,"d":"53.33"},{"v":51.866666666666674,"d":"51.87"},{"v":50.78333333333334,"d":"50.78"},{"v":49.31666666666668,"d":"49.32"},{"v":54.41666666666667,"d":"54.42"},{"v":55.883333333333326,"d":"55.88"},{"v":56.96666666666667,"d":"56.97"},54.8,52.25,7.29983]
[5,"ABB",1250.5,{"v":1256.8500000000001,"d":"1256.85"},{"v":1239.2000000000003,"d":"1239.20"},{"v":1227.9,"d":"1227.90"},{"v":1210.2500000000002,"d":"1210.25"},{"v":1268.1500000000003,"d":"1268.15"},{"v":1285.8000000000004,"d":"1285.80"},{"v":1297.1000000000004,"d":"1297.10"},1274.5,1245.55,0.63952]
[6,"ABCAPITAL",81.65,{"v":81.56666666666668,"d":"81.57"},{"v":80.73333333333335,"d":"80.73"},{"v":79.81666666666668,"d":"79.82"},{"v":78.98333333333335,"d":"78.98"},{"v":82.48333333333335,"d":"82.48"},{"v":83.31666666666669,"d":"83.32"},{"v":84.23333333333335,"d":"84.23"},82.4,80.65,24.42672]
[7,"ABFRL",218.45,217.15,{"v":213.3,"d":"213.30"},208.15,{"v":204.3,"d":"204.30"},{"v":222.3,"d":"222.30"},{"v":226.14999999999998,"d":"226.15"},{"v":231.3,"d":"231.30"},221,212,4.14526]
[8,"ACC",1382.5,{"v":1378.1666666666667,"d":"1378.17"},{"v":1364.3333333333335,"d":"1364.33"},{"v":1346.1666666666667,"d":"1346.17"},{"v":1332.3333333333335,"d":"1332.33"},{"v":1396.3333333333335,"d":"1396.33"},{"v":1410.166666666667,"d":"1410.17"},{"v":1428.3333333333335,"d":"1428.33"},1392,1360,7.06935]
[9,"ADANIPORTS",354.75,{"v":350.68333333333334,"d":"350.68"},{"v":345.01666666666665,"d":"345.02"},{"v":335.2833333333333,"d":"335.28"},{"v":329.6166666666666,"d":"329.62"},{"v":360.4166666666667,"d":"360.42"},{"v":366.0833333333333,"d":"366.08"},{"v":375.8166666666667,"d":"375.82"},356.35,340.95,48.85571]
[10,"ADANIPOWER",39.55,{"v":39.166666666666664,"d":"39.17"},{"v":37.23333333333333,"d":"37.23"},{"v":34.916666666666664,"d":"34.92"},{"v":32.98333333333333,"d":"32.98"},{"v":41.48333333333333,"d":"41.48"},{"v":43.416666666666664,"d":"43.42"},{"v":45.73333333333333,"d":"45.73"},41.1,36.85,116.57825]
{"$rows_left_out":491}
{"sheet":"Bulk Deals","index":4,"n_rows":116,"n_cols":8,"rows_kept":116,"merged":[[4,0,4,1],[4,2,4,3],[6,1,6,2]]}
[" "]
[]
[]
[]
[]
[{"$nulls":4},"Back To Main Page"]
["Subject :","BULK DEAL",null,{"$f":"Main!B10","v":"2019-02-21"}]
[]
["Date","Scrip code","Scrip Name","Client Name","Buy / Sell","Quantity Traded","Trade Price / Wt.Avg.trade price","Exchange  "]
["2019-02-20",530043,"ACKNIT","ABHISHEK JAIN","BUY",{"v":35333,"d":"35,333"},103.02,"BSE"]
["2019-02-20",530043,"ACKNIT","ABHISHEK JAIN","SELL",{"v":35333,"d":"35,333"},102.17,"BSE"]
["2019-02-20",530245,"ARYAMAN","SHAH BABULAL VADILAL HUF","BUY",59000,47.3,"BSE"]
["2019-02-20",530245,"ARYAMAN","SAJANKUMAR RAMESHWARLAL BAJAJ","SELL",133150,47.3,"BSE"]
["2019-02-20",511144,"ASYAINFO","CHANDER PRAKASH KEWLANI","BUY",90000,4.72,"BSE"]
["2019-02-20",511144,"ASYAINFO","ALPA RASHESH PAUN","SELL",87600,4.72,"BSE"]
["2019-02-20",537766,"BCP","ACHINTYA COMMODITIES PRIVATE LIMITED","BUY",664196,39.68,"BSE"]
["2019-02-20",537766,"BCP","ACHINTYA COMMODITIES PRIVATE LIMITED","SELL",664196,38.61,"BSE"]
["2019-02-20",532813,"CANDC","ALPHA LEON ENTERPRISES LLP","BUY",153514,14,"BSE"]
["2019-02-20",532813,"CANDC","ALPHA LEON ENTERPRISES LLP","SELL",4514,14.67,"BSE"]
["2019-02-20",523232,"CONTPTR","DHEERAJ KUMAR LOHIA","BUY",27517,32.3,"BSE"]
{"$rows_left_out":97}
{"sheet":"Call Tracker (Equity & F&O)","index":5,"n_rows":431,"n_cols":18,"rows_kept":431,"merged":[[37,0,38,0],[37,1,38,1],[37,2,38,2],[37,9,38,9],[37,11,38,11],[37,12,38,12],[37,13,38,13],[37,14,38,14],[48,0,49,0],[48,1,49,1],[48,2,49,2],[48,9,49,9],[48,11,49,11],[48,12,49,12],[48,13,49,13],[48,14,49,14],[51,0,52,0],[51,1,52,1],[51,2,52,2],[51,9,52,9],[51,11,52,11],[51,12,52,12],[51,13,52,13],[51,14,52,14]]}
[]
[]
[]
[]
[{"$nulls":12},"Back To Main Page"]
["Retail Research Technical Calls & Fundamental Performance Report for the month of February -2019 "]
[{"$nulls":12},{"$f":"Main!B10","v":"2019-02-21"}]
[null,"Positional  Call"]
["Sr.no","Date",null,"Company","Rec","Rec Price","Stop Loss***","Call Closed At","Target","Remark","Profit / Loss per Share","Gain / Loss  %","Status","Closed Date","NSE Closed Price"]
[1,"2019-01-24",null,"ITC","Buy","279-281",268,null,305,"Open",{"$nulls":4},{"$f":"VLOOKUP(D10,Sheet2!A10:M1505,6,0)","v":275.85},null,null,"R"]
[2,"2019-01-25",null,"UBL","Sell",1435,1510,1392.5,"1300-1280"," Profit of Rs.42.50/-",42.5,{"$f":"K11/F11","v":{"v":0.029616724738675958,"d":"2.96%"}},"Successful","2019-01-28",{"$nulls":3},"H"]
[3,"2019-01-29",null,"MARUTI","Buy",6575,6290,6910,"7000-7100","Profit of Rs.335/-",{"$f":"H12-F12","v":335},{"v":0.05095057034220532,"d":"5.10%"},"Successful","2019-02-01",{"$nulls":3},"R"]
[4,"2019-01-30",null,"ULTRACEMCO","Buy",3400,3230,3592.5,"3750-3800","Profit of Rs.192.5/-",192.5,{"$f":"K13/F13","v":{"v":0.05661764705882353,"d":"5.66%"}},"Successful","2019-02-07",{"$nulls":3},"H"]
[5,"2019-02-05",null,"MCDOWELL-N","Buy",552.5,526.7,571,"600-610","Profit of Rs.18.5/-",18.5,{"v":0.0334841628959276,"d":"3.35%"},"Successful","2019-02-07",{"$nulls":3},"R"]
[6,"2019-02-07",null,"APOLLOTYRE","Buy",200,189.5,207.5,"215-220","Profit of Rs.7.5/-",{"$f":"H15-F15","v":7.5},{"$f":"K15/F15","v":{"v":0.0375,"d":"3.75%"}},"Successful","2019-02-08",{"$nulls":3},"H"]
[7,"2019-02-07",null,"CENTURYTEX","Buy",769,728,730.5,"820-840","Loss of Rs 38.5/-",-38.5,{"v":-0.05006501950585176,"d":"-5.01%"},"UnSuccessful","2019-02-13",{"$nulls":3},"H"]
[8,"2019-02-11",null,"APOLLOTYRE","Buy",200.5,189.5,207.5,"215-220","Profit of Rs.7/-",{"$f":"H17-F17","v":7},{"$f":"K17/F17","v":{"v":0.034912718204488775,"d":"3.49%"}},"Successful","2019-02-19",{"$nulls":3},"H"]
[9,"2019-02-12",null,"LT","Buy","1240-1248",1188,null,"1340-1370","Open",{"$nulls":4},{"$f":"VLOOKUP(D18,Sheet2!A18:M1513,6,0)","v":1276.55},null,null,"H"]
[10,"2019-02-14",null,"HINDALCO","Buy",195,186.2,186,"210-215","Loss of Rs 9/-",{"$f":"H19-F19","v":-9},{"$f":"K19/F19","v":{"v":-0.046153846153846156,"d":"-4.62%"}},"UnSuccessful","2019-02-15",{"$nulls":3},"R"]
[11,"2019-02-19",null,"BRITANNIA","Buy","2950-2960",2780,null,"3200-3250","Open",{"$nulls":4},{"$f":"VLOOKUP(D20,Sheet2!A20:M1515,6,0)","v":2922.3},null,null,"R"]
{"$rows_left_out":265}
{"sheet":"Sheet2","index":6,"n_rows":1640,"n_cols":14,"rows_kept":1640,"hidden":true}
["SYMBOL","SERIES","OPEN","HIGH","LOW","CLOSE","LAST","PREVCLOSE","TOTTRDQTY","TOTTRDVAL","TIMESTAMP","TOTALTRADES","ISIN","ISIN"]
["20MICRONS","EQ",34.35,36.5,33.25,34.95,34.65,34,43426,1522444.5,"2019-02-20",477,"INE144J01027"]
["21STCENMGM","EQ",18.55,19,18.55,18.95,18.9,18.9,86,1606.05,"2019-02-20",9,"INE253B01015"]
["3IINFOTECH","EQ",3,3.5,2.95,3.45,3.4,2.95,7391922,24129118.1,"2019-02-20",2602,"INE748C01020"]
["3MINDIA","EQ",22113,22113,21613,21971.9,21900,21927.55,2185,47908972.35,"2019-02-20",1311,"INE470A01017"]
["3PLAND","EQ",10.1,10.75,10.1,10.2,10.15,10.85,70,711.6,"2019-02-20",7,"INE105C01023"]
["5PAISA","EQ",230.1,238.45,221.1,230.6,230.65,229.95,7473,1718443.05,"2019-02-20",151,"INE618L01018"]
["63MOONS","EQ",75.95,76.45,74,74.35,74.1,75,123623,9282351.75,"2019-02-20",2572,"INE111B01023"]
["8KMILES","EQ",112.95,112.95,107.5,111.15,111.4,108.9,253610,28103557.4,"2019-02-20",3211,"INE650K01021"]
["A2ZINFRA","EQ",14.7,14.7,13.3,13.95,14.15,14,552298,7887488.7,"2019-02-20",1070,"INE619I01012"]
["AARTIDRUGS","EQ",584.05,588.45,576.2,585.6,585,584.9,4001,2331568.9,"2019-02-20",499,"INE767A01016"]
["AARTIIND","EQ",1350,1368.75,1300,1308.65,1314,1326.85,420513,555131628.35,"2019-02-20",26503,"INE769A01020"]
["AARVEEDEN","EQ",20.35,20.4,20,20.25,20.35,20.1,4288,86341.5,"2019-02-20",61,"INE273D01019"]
["AAVAS","EQ",904.95,945,904.95,938.9,944.5,907.4,81520,76136064.35,"2019-02-20",3231,"INE216P01012"]
["ABAN","EQ",53.8,54.8,52.25,52.95,52.9,51.05,729983,38906580.65,"2019-02-20",6674,"INE421A01028"]
["ABB","EQ",1255,1274.5,1245.55,1250.5,1252.9,1242.95,63952,80596878.75,"2019-02-20",4277,"INE117A01022"]
["ABBOTINDIA","EQ",7250,7315,7250,7295.1,7280,7234.75,1760,12833577.5,"2019-02-20",458,"INE358A01014"]
["ABCAPITAL","EQ",80.65,82.4,80.65,81.65,81.65,80.6,2442672,199822460.7,"2019-02-20",39098,"INE674K01013"]
["ABFRL","EQ",215.1,221,212,218.45,219.45,215.2,414526,89523516.55,"2019-02-20",9712,"INE647O01011"]
["ACC","EQ",1360,1392,1360,1382.5,1390,1353.1,706935,973017091.65,"2019-02-20",25849,"INE012A01025"]
{"$rows_left_out":1621}
{"sheet":"Sheet1","index":7,"n_rows":0,"n_cols":0,"rows_kept":0,"hidden":true}

{"sheet":"Sheet3","index":8,"n_rows":0,"n_cols":0,"rows_kept":0,"hidden":true}