{"text_format":"3","workbook":"xlsx","n_sheets":10,"sheets":["Main","Future Intra","Cash Intra","MidCap Intra","Bulk Deals","Call Tracker (Equity & F&O)","Sheet2","Sheet1","Sheet3","Sheet4"],"not_rendered":{"images":4,"defined_names":4},"read":"whole","date_system":"1900"}

{"sheet":"Main","index":0,"n_rows":17,"n_cols":4,"rows_kept":17}
[null,"                                                                                                 "]
{"$rows_empty":8}
[null,"2019-03-18"]
[]
[null,"Sheet No.","Template Name","Summary"]
[null,1,"Future Intra","For Intraday trading in F&O segment"]
[null,2,"Cash Intra","For Intraday trading in cash market segment"]
[null,3,"Mid-cap Intra","For Intraday trading in Mid-cap stocks"]
[null,4,"Bulk Deals","Reveals Bulk Deals carried on NSE & BSE"]
[null,5,"Call Tracker"]

{"sheet":"Future Intra","index":1,"n_rows":237,"n_cols":15,"rows_kept":237,"merged":[[8,0,9,0],[8,1,9,1],[8,2,9,2],[8,5,8,7],[8,8,8,10]]}
[]
[]
[]
[]
[{"$nulls":12},"Back to Main Page"]
["FOR INTRA DAY TRADING",{"$nulls":10},{"$f":"Main!B10","v":"2019-03-18"}]
[]
[]
["Sr.no","Sector","Scrip","CLOSE RATE","Pivot Point","Supports",null,null,"Resistances"]
[null,"Sector",null,"Point","Point","S1","S2","S3","R1","R2","R3","HIGH","LOW","OI","% Change in OI"]
[1,"Index","BANKNIFTY",{"v":29465.5,"d":"29465.50"},{"v":29388.016666666666,"d":"29388.02"},{"v":29117.733333333334,"d":"29117.73"},{"v":28769.966666666667,"d":"28769.97"},{"v":28499.683333333334,"d":"28499.68"},{"v":29735.783333333333,"d":"29735.78"},{"v":30006.066666666666,"d":"30006.07"},{"v":30353.833333333332,"d":"30353.83"},29658.3,29040.25,3060260,{"v":0.06390538304292806,"d":"6.39%"}]
[2,"Index","NIFTY",11470.45,{"v":11464.316666666666,"d":"11464.32"},{"v":11396.133333333331,"d":"11396.13"},{"v":11321.816666666666,"d":"11321.82"},{"v":11253.633333333331,"d":"11253.63"},{"v":11538.633333333331,"d":"11538.63"},{"v":11606.816666666666,"d":"11606.82"},{"v":11681.133333333331,"d":"11681.13"},11532.5,11390,23927250,{"v":0.15270661858754328,"d":"15.27%"}]
[3,"Index","NIFTYIT",{"v":15619,"d":"15619.00"},{"v":15583.666666666666,"d":"15583.67"},{"v":15408.333333333332,"d":"15408.33"},{"v":15197.666666666666,"d":"15197.67"},{"v":15022.333333333332,"d":"15022.33"},{"v":15794.333333333332,"d":"15794.33"},{"v":15969.666666666664,"d":"15969.67"},{"v":16180.333333333332,"d":"16180.33"},15759,15373,18300,{"v":-0.21794871794871795,"d":"-21.79%"}]
[4,"Cement","ACC",{"v":1539.6,"d":"1539.60"},{"v":1546.7,"d":"1546.70"},{"v":1526.5500000000002,"d":"1526.55"},{"v":1513.5000000000002,"d":"1513.50"},{"v":1493.3500000000004,"d":"1493.35"},1559.75,{"v":1579.9,"d":"1579.90"},{"v":1592.9499999999998,"d":"1592.95"},1566.85,1533.65,2684400,{"v":0.05635133008027703,"d":"5.64%"}]
[5,"Others","ADANIENT",{"v":142.2,"d":"142.20"},{"v":143.96666666666667,"d":"143.97"},{"v":138.13333333333333,"d":"138.13"},{"v":134.06666666666666,"d":"134.07"},{"v":128.23333333333332,"d":"128.23"},{"v":148.03333333333333,"d":"148.03"},{"v":153.86666666666665,"d":"153.87"},{"v":157.93333333333334,"d":"157.93"},149.8,139.9,43836000,{"v":-0.021343096981603856,"d":"-2.13%"}]
[6,"Others","ADANIPORTS",367.95,{"v":366.6166666666666,"d":"366.62"},{"v":363.6833333333332,"d":"363.68"},{"v":359.41666666666663,"d":"359.42"},{"v":356.48333333333323,"d":"356.48"},{"v":370.8833333333332,"d":"370.88"},{"v":373.8166666666666,"d":"373.82"},{"v":378.0833333333332,"d":"378.08"},369.55,362.35,24072500,{"v":-0.025799271549979765,"d":"-2.58%"}]
[7,"Power","ADANIPOWER",51.05,{"v":50.949999999999996,"d":"50.95"},{"v":50.49999999999999,"d":"50.50"},{"v":49.949999999999996,"d":"49.95"},{"v":49.49999999999999,"d":"49.50"},{"v":51.49999999999999,"d":"51.50"},{"v":51.949999999999996,"d":"51.95"},{"v":52.49999999999999,"d":"52.50"},51.4,50.4,164620000,{"v":5.0061050061050065E-3,"d":"0.50%"}]
[8,"Pharma","AJANTPHARM",1012.75,{"v":1021.0333333333333,"d":"1021.03"},{"v":998.7166666666667,"d":"998.72"},{"v":984.6833333333334,"d":"984.68"},{"v":962.3666666666668,"d":"962.37"},{"v":1035.0666666666666,"d":"1035.07"},{"v":1057.3833333333332,"d":"1057.38"},{"v":1071.4166666666665,"d":"1071.42"},1043.35,1007,873000,{"v":6.920415224913495E-3,"d":"0.69%"}]
[9,"Banking","ALBK",{"v":53.2,"d":"53.20"},{"v":53.800000000000004,"d":"53.80"},{"v":52.25000000000001,"d":"52.25"},{"v":51.300000000000004,"d":"51.30"},{"v":49.75000000000001,"d":"49.75"},{"v":54.75000000000001,"d":"54.75"},{"v":56.300000000000004,"d":"56.30"},{"v":57.25000000000001,"d":"57.25"},55.35,52.85,27053000,{"v":-0.02666043030869972,"d":"-2.67%"}]
[10,"Automobile","AMARAJABAT",{"v":749.8,"d":"749.80"},{"v":750.6333333333333,"d":"750.63"},{"v":745.4166666666666,"d":"745.42"},{"v":741.0333333333333,"d":"741.03"},{"v":735.8166666666666,"d":"735.82"},{"v":755.0166666666667,"d":"755.02"},{"v":760.2333333333333,"d":"760.23"},{"v":764.6166666666667,"d":"764.62"},755.85,746.25,1005900,{"v":0.01842664776754075,"d":"1.84%"}]
{"$rows_left_out":208}
{"sheet":"Cash Intra","index":2,"n_rows":247,"n_cols":13,"rows_kept":247,"merged":[[7,0,8,0],[7,1,8,1],[7,2,8,2],[7,3,8,3],[7,4,7,6],[7,7,7,9]]}
[]
[]
[]
[]
[{"$nulls":12},"Back to Main Page"]
["FOR INTRA DAY TRADING",{"$nulls":9},{"$f":"Main!B10","v":"2019-03-18"}]
[]
["Sr.no","Scrip","CLOSE RATE","Pivot Point","Supports",null,null,"Resistances"]
[null,null,"Point",null,"S1","S2","S3","R1","R2","R3","HIGH","LOW","Total Trade Quanity in Lakhs"]
[1,"Nifty 50",11426.85,{"v":11428.216666666665,"d":"11428.22"},{"v":11369.43333333333,"d":"11369.43"},{"v":11312.016666666665,"d":"11312.02"},{"v":11253.23333333333,"d":"11253.23"},{"v":11485.633333333331,"d":"11485.63"},{"v":11544.416666666668,"d":"11544.42"},{"v":11601.833333333332,"d":"11601.83"},11487,11370.8]
[2,"Nifty Bank",29381.45,{"v":29297.666666666668,"d":"29297.67"},{"v":29074.633333333335,"d":"29074.63"},{"v":28767.816666666666,"d":"28767.82"},{"v":28544.783333333333,"d":"28544.78"},{"v":29604.483333333337,"d":"29604.48"},{"v":29827.51666666667,"d":"29827.52"},{"v":30134.33333333334,"d":"30134.33"},29520.7,28990.85]
[3,"Nifty CPSE",2223.8,{"v":2208.1,"d":"2208.10"},{"v":2178.7,"d":"2178.70"},{"v":2133.6,"d":"2133.60"},{"v":2104.2,"d":"2104.20"},{"v":2253.2,"d":"2253.20"},{"v":2282.6000000000004,"d":"2282.60"},{"v":2327.7,"d":"2327.70"},2237.5,2163]
[4,"Nifty Infra",3173.25,{"v":3165.7333333333336,"d":"3165.73"},{"v":3151.316666666667,"d":"3151.32"},{"v":3129.3833333333337,"d":"3129.38"},{"v":3114.966666666667,"d":"3114.97"},{"v":3187.666666666667,"d":"3187.67"},{"v":3202.083333333333,"d":"3202.08"},{"v":3224.016666666667,"d":"3224.02"},3180.15,3143.8]
[5,"Nifty IT",15546.6,{"v":15506.9,"d":"15506.90"},15364.55,{"v":15182.5,"d":"15182.50"},15040.15,{"v":15688.949999999999,"d":"15688.95"},{"v":15831.300000000001,"d":"15831.30"},{"v":16013.349999999999,"d":"16013.35"},15649.25,15324.85]
[6,"Nifty PSE",3537.95,3515.85,3480.45,3422.95,{"v":3387.5499999999997,"d":"3387.55"},3573.35,{"v":3608.7500000000005,"d":"3608.75"},3666.25,3551.25,3458.35]
[7,"Nifty Midcap 50",4932.8,{"v":4928.566666666667,"d":"4928.57"},{"v":4908.983333333334,"d":"4908.98"},{"v":4885.166666666667,"d":"4885.17"},{"v":4865.583333333334,"d":"4865.58"},{"v":4952.383333333333,"d":"4952.38"},{"v":4971.966666666667,"d":"4971.97"},{"v":4995.783333333333,"d":"4995.78"},4948.15,4904.75]
[8,"ABB",1303.8,{"v":1305.7666666666667,"d":"1305.77"},{"v":1294.1333333333332,"d":"1294.13"},{"v":1284.4666666666665,"d":"1284.47"},{"v":1272.833333333333,"d":"1272.83"},{"v":1315.4333333333334,"d":"1315.43"},{"v":1327.066666666667,"d":"1327.07"},{"v":1336.7333333333336,"d":"1336.73"},1317.4,1296.1,2.18031]
[9,"ACC",1531.85,{"v":1539.1999999999998,"d":"1539.20"},{"v":1519.0999999999997,"d":"1519.10"},1506.35,{"v":1486.2499999999998,"d":"1486.25"},{"v":1551.9499999999996,"d":"1551.95"},1572.05,{"v":1584.7999999999995,"d":"1584.80"},1559.3,1526.45,8.34141]
[10,"AIAENG",1759.25,1759.75,{"v":1739.5,"d":"1739.50"},1719.75,{"v":1699.5,"d":"1699.50"},{"v":1779.5,"d":"1779.50"},1799.75,{"v":1819.5,"d":"1819.50"},1780,1740,0.0758]
[11,"AUBANK",610.9,{"v":607.2833333333333,"d":"607.28"},{"v":598.6166666666666,"d":"598.62"},{"v":586.3333333333333,"d":"586.33"},{"v":577.6666666666665,"d":"577.67"},{"v":619.5666666666666,"d":"619.57"},{"v":628.2333333333333,"d":"628.23"},{"v":640.5166666666667,"d":"640.52"},615.95,595,2.59528]
{"$rows_left_out":228}
{"sheet":"MidCap Intra","index":3,"n_rows":510,"n_cols":13,"rows_kept":510,"merged":[[0,0,0,1],[8,0,9,0],[8,1,9,1],[8,2,9,2],[8,3,9,3],[8,4,8,6],[8,7,8,9]]}
[]
[]
[]
[]
[{"$nulls":11},"Back To Main Page"]
["FOR INTRA DAY TRADING",{"$nulls":9},{"$f":"Main!B10","v":"2019-03-18"}]
[null,null," "]
[]
["Sr.no","Scrip","CLOSE RATE","Pivot Point","Supports",null,null,"Resistances"]
[null,null,"Point",null,"S1","S2","S3","R1","R2","R3","HIGH","LOW","Total Trade Quanity in Lakhs"]
[1,"3MINDIA",23742.05,{"v":23830.066666666666,"d":"23830.07"},{"v":23212.98333333333,"d":"23212.98"},{"v":22683.916666666664,"d":"22683.92"},{"v":22066.83333333333,"d":"22066.83"},{"v":24359.13333333333,"d":"24359.13"},{"v":24976.216666666667,"d":"24976.22"},{"v":25505.283333333333,"d":"25505.28"},24447.15,23301,0.68736]
[2,"8KMILES",103.35,{"v":104.61666666666667,"d":"104.62"},{"v":101.23333333333335,"d":"101.23"},{"v":99.11666666666667,"d":"99.12"},{"v":95.73333333333335,"d":"95.73"},{"v":106.73333333333335,"d":"106.73"},{"v":110.11666666666667,"d":"110.12"},{"v":112.23333333333335,"d":"112.23"},108,102.5,2.0463]
[3,"AARTIIND",1424.55,{"v":1424.5,"d":"1424.50"},1400.05,1375.55,{"v":1351.1,"d":"1351.10"},{"v":1449,"d":"1449.00"},{"v":1473.4499999999998,"d":"1473.45"},1497.95,1448.95,1400,5.82194]
[4,"ABAN",66.15,66.15,66.15,66.15,66.15,66.15,66.15,66.15,66.15,66.15,0.46449]
[5,"ABB",1303.8,{"v":1305.7666666666667,"d":"1305.77"},{"v":1294.1333333333332,"d":"1294.13"},{"v":1284.4666666666665,"d":"1284.47"},{"v":1272.833333333333,"d":"1272.83"},{"v":1315.4333333333334,"d":"1315.43"},{"v":1327.066666666667,"d":"1327.07"},{"v":1336.7333333333336,"d":"1336.73"},1317.4,1296.1,2.18031]
[6,"ABCAPITAL",99.5,{"v":98.66666666666667,"d":"98.67"},{"v":96.88333333333334,"d":"96.88"},{"v":94.26666666666667,"d":"94.27"},{"v":92.48333333333333,"d":"92.48"},{"v":101.28333333333335,"d":"101.28"},{"v":103.06666666666668,"d":"103.07"},{"v":105.68333333333335,"d":"105.68"},100.45,96.05,169.33643]
[7,"ABFRL",227.1,{"v":228.70000000000002,"d":"228.70"},{"v":224.40000000000003,"d":"224.40"},{"v":221.70000000000002,"d":"221.70"},{"v":217.40000000000003,"d":"217.40"},{"v":231.40000000000003,"d":"231.40"},{"v":235.70000000000005,"d":"235.70"},{"v":238.40000000000003,"d":"238.40"},233,226,15.94351]
[8,"ACC",1531.85,{"v":1539.1999999999998,"d":"1539.20"},{"v":1519.0999999999997,"d":"1519.10"},1506.35,{"v":1486.2499999999998,"d":"1486.25"},{"v":1551.9499999999996,"d":"1551.95"},1572.05,{"v":1584.7999999999995,"d":"1584.80"},1559.3,1526.45,8.34141]
[9,"ADANIPORTS",367.1,{"v":365.84999999999997,"d":"365.85"},{"v":362.74999999999994,"d":"362.75"},{"v":358.4,"d":"358.40"},{"v":355.29999999999995,"d":"355.30"},{"v":370.19999999999993,"d":"370.20"},{"v":373.29999999999995,"d":"373.30"},{"v":377.6499999999999,"d":"377.65"},368.95,361.5,30.57825]
[10,"ADANIPOWER",50.85,{"v":50.76666666666667,"d":"50.77"},{"v":50.283333333333346,"d":"50.28"},{"v":49.716666666666676,"d":"49.72"},{"v":49.23333333333335,"d":"49.23"},{"v":51.33333333333334,"d":"51.33"},{"v":51.81666666666668,"d":"51.82"},{"v":52.38333333333334,"d":"52.38"},51.25,50.2,108.27468]
{"$rows_left_out":491}
{"sheet":"Bulk Deals","index":4,"n_rows":116,"n_cols":8,"rows_kept":116,"merged":[[4,0,4,1],[4,2,4,3],[6,1,6,2]]}
[" "]
[]
[]
[]
[]
[{"$nulls":4},"Back To Main Page"]
["Subject :","BULK DEAL",null,{"$f":"Main!B10","v":"2019-03-18"}]
[]
["Date","Scrip code","Scrip Name","Client Name","Buy / Sell","Quantity Traded","Trade Price / Wt.Avg.trade price","Exchange  "]
["2019-03-15",542012,"AAL","ANSU INVESTMENT","BUY",{"v":100000,"d":"100,000"},54.98,"BSE"]
["2019-03-15",500463,"AGCNET","EBONY ADVISORS LLP","BUY",{"v":300215,"d":"300,215"},110.04,"BSE"]
["2019-03-15",500463,"AGCNET","NARESH KOTHARI","SELL",288184,110,"BSE"]
["2019-03-15",542437,"ANMOL","AJAY SONS (HUF)","BUY",100000,33.35,"BSE"]
["2019-03-15",542437,"ANMOL","RADHU DEVELOPERS PVT LTD.","SELL",100000,33.35,"BSE"]
["2019-03-15",540024,"ASHARI","MAYUR MAHESHKUMAR PANCHAL","SELL",193000,7.1,"BSE"]
["2019-03-15",540024,"ASHARI","AJAYSINH PRAVINSINH DEVDA","BUY",229100,7.1,"BSE"]
["2019-03-15",540024,"ASHARI","RAMU JOMDAR JSONEYA","SELL",66000,7.1,"BSE"]
["2019-03-15",540024,"ASHARI","JAYESHBHAI DINESHBHAI VAGHELA","SELL",87000,7.1,"BSE"]
["2019-03-15",540024,"ASHARI","KRUSHNA NANDLAL CHANDAK","BUY",50000,7,"BSE"]
["2019-03-15",540024,"ASHARI","MANOJKUMAR GUNVANTRAI SOMANI","BUY",47796,7,"BSE"]
{"$rows_left_out":97}
{"sheet":"Call Tracker (Equity & F&O)","index":5,"n_rows":426,"n_cols":18,"rows_kept":426,"merged":[[36,0,37,0],[36,1,37,1],[36,2,37,2],[36,9,37,9],[36,11,37,11],[36,12,37,12],[36,13,37,13],[36,14,37,14],[39,0,40,0],[39,1,40,1],[39,2,40,2],[39,9,40,9],[39,11,40,11],[39,12,40,12],[39,13,40,13],[39,14,40,14],[41,0,42,0],[41,1,42,1],[41,2,42,2],[41,9,42,9],[41,11,42,11],[41,12,42,12],[41,13,42,13],[41,14,42,14],[52,0,53,0],[52,1,53,1],[52,2,53,2],[52,9,53,9],[52,11,53,11],[52,12,53,12],[52,13,53,13],[52,14,53,14]]}
[]
[]
[]
[]
[{"$nulls":12},"Back To Main Page"]
["Retail Research Technical Calls & Fundamental Performance Report for the month of March -2019 "]
[{"$nulls":12},{"$f":"Main!B10","v":"2019-03-18"}]
[null,"Positional  Call"]
["Sr.no","Date",null,"Company","Rec","Rec Price","Stop Loss***","Call Closed At","Target","Remark","Profit / Loss per Share","Gain / Loss  %","Status","Closed Date","NSE Closed Price"]
[1,"2019-01-24",null,"ITC","Buy",280,268,292,305,"Profit of Rs.12/-",{"$f":"H10-F10","v":12},{"$f":"K10/F10","v":{"v":0.04285714285714286,"d":"4.29%"}},"Successful","2019-03-08",{"$nulls":3},"R"]
[2,"2019-03-01",null,"UPL","Sell",881.5,922.2,922.2,800,"Loss of Rs.40.7/-",{"$f":"F11-H11","v":-40.700000000000045},{"v":-0.0461712989222916,"d":"-4.62%"},"UnSuccessful","2019-03-15",{"$nulls":3},"R"]
[3,"2019-03-01",null,"BEL","Buy",83,78.5,86.25,92,"Profit of Rs.3.25/-",3.25,{"$f":"K12/F12","v":{"v":0.0391566265060241,"d":"3.92%"}},"Successful","2019-03-05",{"$nulls":3},"H"]
[4,"2019-03-01",null,"ZEEL","Sell",478.5,507.3,458.5,"435-425","Profit of Rs.20/-",{"$f":"F13-H13","v":20},{"$f":"K13/F13","v":{"v":0.04179728317659352,"d":"4.18%"}},"Successful","2019-03-07",{"$nulls":3},"R"]
[5,"2019-03-06",null,"MARUTI","Buy",7025,6700,7230,"7500-7600","Part Profit of Rs.205/-",205,{"v":0.029181494661921707,"d":"2.92%"},"Successful","2019-03-12",{"$nulls":3},"H"]
[6,"2019-03-07",null,"BPCL","Sell",376.5,395.6,365,"345-335","Part Profit of Rs.11.5/-",{"$f":"F15-H15","v":11.5},{"$f":"K15/F15","v":{"v":0.03054448871181939,"d":"3.05%"}},"Successful","2019-03-08",{"$nulls":3},"R"]
[7,"2019-03-07",null,"RAYMOND","Sell","825-830",888.8,null,"720-730","Open",{"$nulls":4},{"$f":"VLOOKUP(D16,Sheet2!A16:M1811,6,0)","v":816.15},null,null,"R"]
[8,"2019-03-08",null,"BHEL","Sell",67.5,70.5,70.5,"63-61","Loss of Rs.3/-",{"$f":"F17-H17","v":-3},{"$f":"K17/F17","v":{"v":-0.044444444444444446,"d":"-4.44%"}},"UnSuccessful","2019-03-12",{"$nulls":3},"H"]
[9,"2019-03-13",null,"DLF","Sell","192-194",206.6,null,"164-168 ","Open",{"$nulls":4},{"$f":"VLOOKUP(D18,Sheet2!A18:M1813,6,0)","v":197.45},null,null,"R"]
[10,"2019-03-15",null,"OFSS","Buy","3380-3410",3250,null,"3650-3700","Open",{"$nulls":4},{"$f":"VLOOKUP(D19,Sheet2!A19:M1814,6,0)","v":3356.15},null,null,"H"]
{"$rows_empty":12}
{"$rows_left_out":268}
{"sheet":"Sheet2","index":6,"n_rows":1640,"n_cols":14,"rows_kept":1640,"hidden":true}
["SYMBOL","SERIES","OPEN","HIGH","LOW","CLOSE","LAST","PREVCLOSE","TOTTRDQTY","TOTTRDVAL","TIMESTAMP","TOTALTRADES","ISIN","ISIN"]
["20MICRONS","EQ",39.5,39.5,38.25,38.75,38.85,38.95,50883,1972433.45,"2019-03-15",297,"INE144J01027"]
["21STCENMGM","EQ",19,19.15,18.8,19.15,19.15,18.8,1134,21502.25,"2019-03-15",12,"INE253B01015"]
["3IINFOTECH","EQ",3.55,3.85,3.55,3.85,3.85,3.5,8380159,32029786.9,"2019-03-15",1823,"INE748C01020"]
["3MINDIA","EQ",23915,24447.15,23301,23742.05,23301,23932.25,68736,1634963262.4,"2019-03-15",8570,"INE470A01017"]
["3PLAND","EQ",12.5,12.5,11.55,11.6,11.6,11.95,517,6106.05,"2019-03-15",9,"INE105C01023"]
["5PAISA","EQ",224.4,230,221.95,224.15,223,224.35,7689,1734201.55,"2019-03-15",258,"INE618L01018"]
["63MOONS","EQ",84,87.3,84,84.55,84.5,83.7,358077,30689368.5,"2019-03-15",5360,"INE111B01023"]
["8KMILES","EQ",107.3,108,102.5,103.35,104,106.3,204630,21384150.35,"2019-03-15",3043,"INE650K01021"]
["A2ZINFRA","BE",16.8,17.95,16.8,17.95,17.95,17.1,189898,3387359.3,"2019-03-15",375,"INE619I01012"]
["AARTIDRUGS","EQ",672.5,694.7,651.25,656.55,653.1,669.8,325221,219206503.55,"2019-03-15",9786,"INE767A01016"]
["AARTIIND","EQ",1426.95,1448.95,1400,1424.55,1408,1418.7,582194,829695444.15,"2019-03-15",21785,"INE769A01020"]
["AARVEEDEN","EQ",22.7,23.45,22.65,23.05,23,22.95,10317,236845.9,"2019-03-15",93,"INE273D01019"]
["AAVAS","EQ",1192,1196.3,1131.5,1162.4,1131.5,1197.8,12364,14540470.75,"2019-03-15",1313,"INE216P01012"]
["ABAN","BE",66.15,66.15,66.15,66.15,66.15,69.6,46449,3072601.35,"2019-03-15",419,"INE421A01028"]
["ABB","EQ",1317.4,1317.4,1296.1,1303.8,1315,1309.6,218031,284179333.95,"2019-03-15",7190,"INE117A01022"]
["ABBOTINDIA","EQ",7330,7374.9,7275,7291.5,7280,7331,2273,16631754.5,"2019-03-15",662,"INE358A01014"]
["ABCAPITAL","EQ",96.75,100.45,96.05,99.5,98.25,95.9,16933643,1680433413.85,"2019-03-15",50265,"INE674K01013"]
["ABFRL","EQ",231.8,233,226,227.1,226.5,230.7,1594351,364800160.3,"2019-03-15",37740,"INE647O01011"]
["ACC","EQ",1540.5,1559.3,1526.45,1531.85,1528.3,1539.3,834141,1284390681.2,"2019-03-15",24248,"INE012A01025"]
{"$rows_left_out":1621}
{"sheet":"Sheet1","index":7,"n_rows":0,"n_cols":0,"rows_kept":0,"hidden":true}

{"sheet":"Sheet3","index":8,"n_rows":0,"n_cols":0,"rows_kept":0,"hidden":true}

{"sheet":"Sheet4","index":9,"n_rows":0,"n_cols":0,"rows_kept":0,"hidden":true}