{"text_format":"3","workbook":"xlsx","n_sheets":8,"sheets":["Main","Future Intra","Cash Intra","MidCap Intra","Bulk Deals","Call Tracker (Equity & F&O)","Call Tracker (Currency)","Sheet2"],"not_rendered":{"images":4,"defined_names":4},"read":"whole","date_system":"1900"}

{"sheet":"Main","index":0,"n_rows":17,"n_cols":4,"rows_kept":17}
[null,"                                                                                                 "]
{"$rows_empty":8}
[null,"2018-03-14"]
[]
[null,"Sheet No.","Template Name","Summary"]
[null,1,"Future Intra","For Intraday trading in F&O segment"]
[null,2,"Cash Intra","For Intraday trading in cash market segment"]
[null,3,"Mid-cap Intra","For Intraday trading in Mid-cap stocks"]
[null,4,"Bulk Deals","Reveals Bulk Deals carried on NSE & BSE"]
[null,5,"Call Tracker"]

{"sheet":"Future Intra","index":1,"n_rows":252,"n_cols":15,"rows_kept":252,"merged":[[8,0,9,0],[8,1,9,1],[8,2,9,2],[8,5,8,7],[8,8,8,10]]}
[]
[]
[]
[]
[{"$nulls":12},"Back to Main Page"]
["FOR INTRA DAY TRADING",{"$nulls":10},{"$f":"Main!B10","v":"2018-03-14"}]
[]
[]
["Sr.no","Sector","Scrip","CLOSE RATE","Pivot Point","Supports",null,null,"Resistances"]
[null,"Sector",null,"Point","Point","S1","S2","S3","R1","R2","R3","HIGH","LOW","OI","% Change in OI"]
[1,"Index","BANKNIFTY",{"v":24816.1,"d":"24816.10"},{"v":24847.36666666667,"d":"24847.37"},{"v":24604.733333333337,"d":"24604.73"},{"v":24393.36666666667,"d":"24393.37"},{"v":24150.733333333337,"d":"24150.73"},{"v":25058.733333333337,"d":"25058.73"},{"v":25301.36666666667,"d":"25301.37"},{"v":25512.733333333337,"d":"25512.73"},25090,24636,2057360,{"v":-0.03721313316611134,"d":"-3.72%"}]
[2,"Index","NIFTY",{"v":10426.4,"d":"10426.40"},{"v":10430.300000000001,"d":"10430.30"},{"v":10370.600000000002,"d":"10370.60"},{"v":10314.800000000001,"d":"10314.80"},{"v":10255.100000000002,"d":"10255.10"},{"v":10486.100000000002,"d":"10486.10"},{"v":10545.800000000003,"d":"10545.80"},{"v":10601.600000000002,"d":"10601.60"},10490,10374.5,25617900,{"v":-8.86178059693697E-3,"d":"-0.89%"}]
[3,"Index","NIFTYCPSE",{"v":2729.2,"d":"2729.20"},{"v":909.7333333333332,"d":"909.73"},{"v":1819.4666666666665,"d":"1819.47"},{"v":909.7333333333332,"d":"909.73"},{"v":1819.4666666666665,"d":"1819.47"},{"v":1819.4666666666665,"d":"1819.47"},{"v":909.7333333333332,"d":"909.73"},{"v":1819.4666666666665,"d":"1819.47"},0,0,0,{"v":0,"d":"0.00%"}]
[4,"Index","NIFTYINFRA",{"v":3662.6,"d":"3662.60"},{"v":1220.8666666666666,"d":"1220.87"},{"v":2441.733333333333,"d":"2441.73"},{"v":1220.8666666666666,"d":"1220.87"},{"v":2441.733333333333,"d":"2441.73"},{"v":2441.733333333333,"d":"2441.73"},{"v":1220.8666666666666,"d":"1220.87"},{"v":2441.733333333333,"d":"2441.73"},0,0,0,{"v":0,"d":"0.00%"}]
[5,"Index","NIFTYIT",{"v":12758,"d":"12758.00"},{"v":12783.666666666666,"d":"12783.67"},{"v":12667.333333333332,"d":"12667.33"},{"v":12576.666666666666,"d":"12576.67"},{"v":12460.333333333332,"d":"12460.33"},{"v":12874.333333333332,"d":"12874.33"},{"v":12990.666666666664,"d":"12990.67"},{"v":13081.333333333332,"d":"13081.33"},12900,12693,51600,{"v":0.132821075740944,"d":"13.28%"}]
{"$rows_left_out":231}
{"sheet":"Cash Intra","index":2,"n_rows":251,"n_cols":13,"rows_kept":251,"merged":[[7,0,8,0],[7,1,8,1],[7,2,8,2],[7,3,8,3],[7,4,7,6],[7,7,7,9]]}
[]
[]
[]
[]
[{"$nulls":12},"Back to Main Page"]
["FOR INTRA DAY TRADING",{"$nulls":9},{"$f":"Main!B10","v":"2018-03-14"}]
[]
["Sr.no","Scrip","CLOSE RATE","Pivot Point","Supports",null,null,"Resistances"]
[null,null,"Point",null,"S1","S2","S3","R1","R2","R3","HIGH","LOW","Total Trade Quanity in Lakhs"]
[1,"Nifty 50",10426.85,{"v":10427.766666666668,"d":"10427.77"},{"v":10376.933333333336,"d":"10376.93"},{"v":10327.016666666668,"d":"10327.02"},{"v":10276.183333333336,"d":"10276.18"},{"v":10477.683333333336,"d":"10477.68"},{"v":10528.516666666668,"d":"10528.52"},{"v":10578.433333333336,"d":"10578.43"},10478.6,10377.85]
[2,"Nifty Bank",24738.65,24781.95,24554.25,24369.85,{"v":24142.149999999998,"d":"24142.15"},{"v":24966.350000000002,"d":"24966.35"},{"v":25194.050000000007,"d":"25194.05"},{"v":25378.450000000004,"d":"25378.45"},25009.65,24597.55]
[3,"Nifty CPSE",2558.55,{"v":2550.9500000000003,"d":"2550.95"},{"v":2538.7000000000007,"d":"2538.70"},{"v":2518.8500000000004,"d":"2518.85"},{"v":2506.600000000001,"d":"2506.60"},{"v":2570.8000000000006,"d":"2570.80"},{"v":2583.0499999999997,"d":"2583.05"},{"v":2602.9000000000005,"d":"2602.90"},2563.2,2531.1]
[4,"Nifty Infra",3403.95,{"v":3401.616666666667,"d":"3401.62"},{"v":3385.3333333333335,"d":"3385.33"},{"v":3366.7166666666667,"d":"3366.72"},{"v":3350.4333333333334,"d":"3350.43"},{"v":3420.2333333333336,"d":"3420.23"},{"v":3436.5166666666664,"d":"3436.52"},{"v":3455.1333333333337,"d":"3455.13"},3417.9,3383]
[5,"Nifty IT",12734.2,{"v":12746.566666666666,"d":"12746.57"},{"v":12650.93333333333,"d":"12650.93"},{"v":12567.666666666664,"d":"12567.67"},{"v":12472.03333333333,"d":"12472.03"},{"v":12829.833333333332,"d":"12829.83"},{"v":12925.466666666667,"d":"12925.47"},{"v":13008.733333333334,"d":"13008.73"},12842.2,12663.3]
[6,"Nifty PSE",4030.1,{"v":4015.4833333333336,"d":"4015.48"},{"v":3989.566666666667,"d":"3989.57"},{"v":3949.0333333333333,"d":"3949.03"},{"v":3923.116666666667,"d":"3923.12"},{"v":4056.0166666666673,"d":"4056.02"},{"v":4081.9333333333334,"d":"4081.93"},{"v":4122.466666666667,"d":"4122.47"},4041.4,3974.95]
{"$rows_left_out":230}
{"sheet":"MidCap Intra","index":3,"n_rows":512,"n_cols":13,"rows_kept":512,"merged":[[0,0,0,1],[8,0,9,0],[8,1,9,1],[8,2,9,2],[8,3,9,3],[8,4,8,6],[8,7,8,9]]}
[]
[]
[]
[]
[{"$nulls":11},"Back To Main Page"]
["FOR INTRA DAY TRADING",{"$nulls":9},{"$f":"Main!B10","v":"2018-03-14"}]
[null,null," "]
[]
["Sr.no","Scrip","CLOSE RATE","Pivot Point","Supports",null,null,"Resistances"]
[null,null,"Point",null,"S1","S2","S3","R1","R2","R3","HIGH","LOW","Total Trade Quanity in Lakhs"]
[1,"3MINDIA",20171.7,{"v":20217.766666666666,"d":"20217.77"},{"v":19954.983333333334,"d":"19954.98"},{"v":19738.266666666666,"d":"19738.27"},{"v":19475.483333333334,"d":"19475.48"},{"v":20434.483333333334,"d":"20434.48"},{"v":20697.266666666666,"d":"20697.27"},{"v":20913.983333333334,"d":"20913.98"},20480.55,20001.05,0.00719]
[2,"8KMILES",706.3,{"v":709.8833333333333,"d":"709.88"},{"v":698.1666666666666,"d":"698.17"},{"v":690.0333333333333,"d":"690.03"},{"v":678.3166666666666,"d":"678.32"},{"v":718.0166666666667,"d":"718.02"},{"v":729.7333333333333,"d":"729.73"},{"v":737.8666666666667,"d":"737.87"},721.6,701.75,1.46943]
[3,"ABB",1410.8,1417.55,1395.25,{"v":1379.7,"d":"1379.70"},{"v":1357.4,"d":"1357.40"},{"v":1433.1,"d":"1433.10"},{"v":1455.3999999999996,"d":"1455.40"},{"v":1470.9499999999998,"d":"1470.95"},1439.85,1402,0.38286]
[4,"ACC",1575.35,{"v":1571.5833333333333,"d":"1571.58"},{"v":1561.1666666666665,"d":"1561.17"},{"v":1546.9833333333333,"d":"1546.98"},{"v":1536.5666666666666,"d":"1536.57"},{"v":1585.7666666666664,"d":"1585.77"},{"v":1596.183333333333,"d":"1596.18"},{"v":1610.3666666666663,"d":"1610.37"},1582,1557.4,4.41704]
[5,"AIAENG",1447.9,{"v":1443.1166666666668,"d":"1443.12"},{"v":1432.3333333333335,"d":"1432.33"},{"v":1416.7666666666667,"d":"1416.77"},{"v":1405.9833333333333,"d":"1405.98"},{"v":1458.6833333333336,"d":"1458.68"},{"v":1469.466666666667,"d":"1469.47"},{"v":1485.0333333333338,"d":"1485.03"},1453.9,1427.55,0.08448]
{"$rows_left_out":498}
{"sheet":"Bulk Deals","index":4,"n_rows":110,"n_cols":8,"rows_kept":110,"merged":[[4,0,4,1],[4,2,4,3],[6,1,6,2]]}
[" "]
[]
[]
[]
[]
[{"$nulls":4},"Back To Main Page"]
["Subject :","BULK DEAL",null,{"$f":"Main!B10","v":"2018-03-14"}]
[]
["Date","Scrip code","Scrip Name","Client Name","Buy / Sell","Quantity Traded","Trade Price / Wt.Avg.trade price","Exchange  "]
["2018-03-13",540697,"AMFL","MITHALAL KACHARALAL PRAJAPATI","BUY",{"v":160000,"d":"160,000"},11.25,"BSE"]
["2018-03-13",541006,"ANGEL","GUINESS SECURITIES LIMITED","BUY",{"v":136000,"d":"136,000"},27.63,"BSE"]
["2018-03-13",530723,"ASITCFIN","LUO SHIXIN","SELL",{"v":30000,"d":"30,000"},71.5,"BSE"]
["2018-03-13",534535,"BGPL","SUNIL SOHANLALJI AJMERA","SELL",{"v":61832,"d":"61,832"},2.49,"BSE"]
["2018-03-13",534535,"BGPL","BP FINTRADE PRIVATE LIMITED","BUY",{"v":50000,"d":"50,000"},2.49,"BSE"]
["2018-03-13",540903,"CRPRISK","SHREE MALLIKARJUN TRAD INVEST PRIVATE LIMITED","SELL",{"v":44000,"d":"44,000"},59.9,"BSE"]
{"$rows_left_out":96}
{"sheet":"Call Tracker (Equity & F&O)","index":5,"n_rows":246,"n_cols":19,"rows_kept":246,"merged":[[8,9,8,10],[9,9,9,10],[10,9,10,10],[11,9,11,10],[12,9,12,10],[13,9,13,10],[14,9,14,10],[15,9,15,10],[16,9,16,10],[17,9,17,10],[18,9,18,10],[19,9,19,10],[20,9,20,10],[21,9,21,10],[22,9,22,10],[23,9,23,10],[24,9,24,10],[25,9,25,10],[26,9,26,10],[27,9,27,10],[28,9,28,10],[29,9,29,10],[30,9,30,10],[31,9,31,10],[36,9,36,10],[41,9,41,10],[42,9,42,10],[43,9,43,10],[44,9,44,10],[45,9,45,10],[48,9,48,10],[49,9,49,10],[50,9,50,10],[55,9,55,10],[56,9,56,10],[57,9,57,10],[58,9,58,10],[59,9,59,10],[60,9,60,10],[61,9,61,10],[62,9,62,10],[63,9,63,10],[64,9,64,10],[65,9,65,10],[66,9,66,10],[67,9,67,10],[68,9,68,10],[69,9,69,10],[70,9,70,10],[71,9,71,10],[72,9,72,10],[78,9,78,10],[84,9,84,10],[85,9,85,10],[92,9,92,10],[93,9,93,10],[94,9,94,10],[95,9,95,10],[96,9,96,10],[97,9,97,10],[98,9,98,10],[106,9,106,10],[107,9,107,10],[108,9,108,10],[109,9,109,10],[110,9,110,10],[111,9,111,10],[112,9,112,10],[113,9,113,10],[115,9,115,10],[116,9,116,10],[117,9,117,10],[118,9,118,10],[119,9,119,10],[120,9,120,10],[121,9,121,10],[122,9,122,10],[123,9,123,10],[124,9,124,10],[125,9,125,10],[126,9,126,10],[127,9,127,10],[128,9,128,10],[129,9,129,10],[130,9,130,10],[131,9,131,10],[132,9,132,10],[133,9,133,10],[134,9,134,10],[135,9,135,10],[136,9,136,10],[137,9,137,10],[138,9,138,10],[139,9,139,10],[140,9,140,10],[141,9,141,10],[142,9,142,10],[143,9,143,10],[144,9,144,10],[145,9,145,10],[146,9,146,10],[147,9,147,10],[148,9,148,10],[149,9,149,10],[150,9,150,10],[151,9,151,10],[152,9,152,10],[153,9,153,10],[154,9,154,10],[155,9,155,10],[156,9,156,10],[157,9,157,10],[158,9,158,10],[159,9,159,10],[160,9,160,10],[161,9,161,10],[162,9,162,10],[163,9,163,10],[164,9,164,10],[165,9,165,10],[166,9,166,10],[167,9,167,10],[168,9,168,10],[169,9,169,10],[170,9,170,10],[171,9,171,10],[172,9,172,10],[173,9,173,10],[174,9,174,10],[175,9,175,10],[176,9,176,10],[177,9,177,10],[178,9,178,10],[179,9,179,10],[180,9,180,10],[181,9,181,10],[183,9,183,10],[184,9,184,10],[185,9,185,10],[186,9,186,10],[187,9,187,10],[188,9,188,10],[189,9,189,10],[190,9,190,10],[191,9,191,10],[192,9,192,10],[193,9,193,10],[194,9,194,10],[195,9,195,10],[196,9,196,10],[197,9,197,10],[198,9,198,10],[199,9,199,10],[200,9,200,10],[201,9,201,10],[202,9,202,10],[203,9,203,10],[204,9,204,10],[205,9,205,10],[206,9,206,10],[207,9,207,10],[208,9,208,10],[209,9,209,10],[210,9,210,10],[211,9,211,10],[212,9,212,10],[213,9,213,10],[214,9,214,10],[215,9,215,10],[216,9,216,10],[217,9,217,10],[218,9,218,10],[219,9,219,10],[220,9,220,10],[221,9,221,10],[222,9,222,10],[223,9,223,10],[224,9,224,10],[225,9,225,10],[226,9,226,10],[227,9,227,10],[228,9,228,10],[229,9,229,10],[230,9,230,10],[231,9,231,10],[233,10,233,11]]}
[]
[]
[]
[]
[{"$nulls":13},"Back To Main Page"]
["Retail Research Technical Calls & Fundamental Performance Report for the month of March -2018 "]
[{"$nulls":13},{"$f":"Main!B10","v":"2018-03-14"}]
[null,"Positional  Call"]
["Sr.no","Date",null,"Company","Rec","Rec Price","Stop Loss***","Call Closed At","Target","Remark",null,"Profit / Loss per Share","Gain / Loss  %","Status","Closed Date","NSE Closed Price"]
[1,"2018-02-05",null,"UPL","Buy","710-718",684,null,"770-800","Open",{"$nulls":5},{"$f":"VLOOKUP(D10,Sheet2!$A$1:M2107,6,0)","v":722.8},null,null,"H"]
[2,"2018-02-09",null,"HINDUNILVR","Buy","1330-1334",1275,null,1450,"Open",{"$nulls":5},{"$f":"VLOOKUP(D11,Sheet2!$A$1:M2108,6,0)","v":1320.55},null,null,"A"]
[3,"2018-02-12",null,"ITC","Buy","271-272",250,null,310,"Open",{"$nulls":5},{"$f":"VLOOKUP(D12,Sheet2!$A$1:M2109,6,0)","v":269.45},null,null,"P"]
[4,"2018-02-12",null,"WIPRO","Buy",287,272,297.5,"310-315","Profit of Rs.10.5/-",null,{"$f":"H13-F13-K13","v":10.5},{"$f":"L13/F13","v":{"v":0.036585365853658534,"d":"3.66%"}},"Successful","2018-03-13",{"$nulls":3},"R"]
[5,"2018-02-14",null,"COLPAL","Buy",1097.5,1050,1041,1200,"Loss of Rs.56.5/-",null,-56.5,{"v":-0.05148063781321185,"d":"-5.15%"},"Unsuccessful","2018-03-06",{"$nulls":3},"R"]
[6,"2018-02-14",null,"GLENMARK","Buy",533.5,510,550,580,"Profit of Rs.16.5/-",null,{"$f":"H15-F15-K15","v":16.5},{"$f":"L15/F15","v":{"v":0.030927835051546393,"d":"3.09%"}},"Successful","2018-03-01",{"$nulls":3},"R"]
{"$rows_left_out":226}
{"sheet":"Call Tracker (Currency)","index":6,"n_rows":58,"n_cols":18,"rows_kept":58,"hidden":true,"merged":[[1,8,1,9],[2,8,2,9],[3,8,3,9],[4,8,4,9],[5,8,5,9],[6,8,6,9],[7,8,7,9],[8,8,8,9],[9,8,9,9],[10,8,10,9],[11,8,11,9],[12,8,12,9],[13,8,13,9],[14,8,14,9],[15,8,15,9],[16,8,16,9],[17,8,17,9],[18,8,18,9],[19,8,19,9],[20,8,20,9],[21,8,21,9],[22,8,22,9],[23,8,23,9],[24,8,24,9],[25,8,25,9],[26,8,26,9],[27,8,27,9],[28,8,28,9],[29,8,29,9],[30,8,30,9],[31,8,31,9],[32,8,32,9],[33,8,33,9],[34,8,34,9],[35,8,35,9],[36,8,36,9],[37,8,37,9],[38,8,38,9],[39,8,39,9],[40,8,40,9],[41,8,41,9],[42,8,42,9],[43,8,43,9],[44,8,44,9],[45,8,45,9],[46,8,46,9],[47,8,47,9],[48,8,48,9],[49,8,49,9],[50,8,50,9],[51,8,51,9],[52,8,52,9],[53,8,53,9],[54,8,54,9],[55,8,55,9],[56,8,56,9],[57,8,57,9],[58,8,58,9],[59,8,59,9],[60,8,60,9],[61,8,61,9],[62,8,62,9],[63,8,63,9],[64,8,64,9],[65,8,65,9],[66,8,66,9],[67,8,67,9],[68,8,68,9],[69,8,69,9],[70,8,70,9],[71,8,71,9],[72,8,72,9],[73,8,73,9],[74,8,74,9],[75,8,75,9],[76,8,76,9],[77,8,77,9],[78,8,78,9],[79,8,79,9],[80,8,80,9],[81,8,81,9],[82,8,82,9],[83,8,83,9],[84,8,84,9],[85,8,85,9],[86,8,86,9],[87,8,87,9],[88,8,88,9],[89,8,89,9],[90,8,90,9],[91,8,91,9],[92,8,92,9],[93,8,93,9],[94,8,94,9],[95,8,95,9],[96,8,96,9],[97,8,97,9],[98,8,98,9],[99,8,99,9],[100,8,100,9],[101,8,101,9],[102,8,102,9],[103,8,103,9],[104,8,104,9],[105,8,105,9],[106,8,106,9],[107,8,107,9],[108,8,108,9],[109,8,109,9],[110,8,110,9],[111,8,111,9],[112,8,112,9],[113,8,113,9],[114,8,114,9],[115,8,115,9],[116,8,116,9],[117,8,117,9],[118,8,118,9],[119,8,119,9],[120,8,120,9],[121,8,121,9],[122,8,122,9],[123,8,123,9],[124,8,124,9]]}
["Master Trade High Risk"]
["Sr.no","Date","Company","Rec","Rec Price","Stop Loss","Call Closed At","Target","Remark",null,"Profit / Loss per share","Gain / Loss  per Lot","Lot","Status","Closed Date"]
[1,"2017-05-08","USDINR MAY FUT","Buy",64.3935,64.29,64.66,64.59,"Profit of Rs.0.27/-",null,{"v":0.2664999999999935,"d":"0.27"},266.4999999999935,1000,"Successful","2017-05-09",null,null,"P"]
[2,"2017-05-08","USDINR JUN FUT","Buy",64.6535,64.45,64.965,65.05,"Profit of Rs 0.31/-",null,{"v":0.31150000000000944,"d":"0.31"},311.50000000000944,1000,"Successful","2017-05-09",null,null,"P"]
[3,"2017-05-09","EUROINR MAY FUT","Sell",70.65,70.8,70.07,70.4,"Profit of Rs 0.58/-",null,{"v":0.580000000000013,"d":"0.58"},580.00000000001,1000,"Successful","2017-05-12",null,null,"P"]
[4,"2017-05-09","GBPINR MAY FUT","Buy",83.774,83.37,83.37,84.77,"Loss of Rs 0.40/-",null,{"v":-0.40399999999999636,"d":"-0.40"},-403.99999999999636,1000,"Unsuccessful","2017-05-11",null,null,"P"]
[5,"2017-05-11","USDINR MAY FUT","Buy",64.6555,64.55,64.55,64.86,"Loss of Rs.0.1055/-",null,-0.10550000000000637,{"$f":"K7*M7","v":{"v":-105.50000000000637,"d":"-105.50"}},1000,"Unsuccessful","2017-05-11",null,null,"P"]
[6,"2017-05-15","USDINR MAY FUT","Buy",64.2275,64.08,64.46,64.48,"Profit of Rs 0.23/-",null,{"v":0.2324999999999875,"d":"0.23"},232.4999999999875,1000,"Successful","2017-05-18",null,null,"P"]
[7,"2017-05-19","USDINR MAY FUT","Sell",64.83,65,65,64.5,"Loss of Rs.0.17/-",null,{"v":-0.1700000000000017,"d":"-0.17"},-170.0000000000017,1000,"Unsuccessful","2017-05-19",null,null,"P"]
[8,"2017-05-23","USDINR MAY FUT","Buy",64.83,64.62,64.95,65.2,"Profit of Rs 0.12/-",null,{"v":0.12000000000000455,"d":"0.12"},120.00000000000455,1000,"Successful","2017-05-24",null,null,"P"]
[9,"2017-05-25","USDINR MAY FUT","Buy",64.57,64.25,64.56,65,"Loss of Rs.0.01/-",null,-0.009999999999990905,-9.999999999990905,1000,"Neutral","2017-05-29",null,null,"P"]
[10,"2017-05-30","USDINR JUN FUT","Buy",64.9125,64.71,64.71,65.31,"Loss of Rs.0.20/-",null,{"v":-0.20250000000000057,"d":"-0.20"},-202.50000000000057,1000,"Unsuccessful","2017-05-31",null,null,"P"]
[11,"2017-06-01","USDINR JUN FUT","Buy",64.655,64.45,64.45,65.05,"Loss of Rs.0.20/-",null,{"$f":"G13-E13","v":{"v":-0.2049999999999983,"d":"-0.20"}},{"$f":"K13*M13","v":-204.9999999999983},{"v":1000,"d":"1000.00"},"Unsuccessful","2017-06-08",null,null,"P"]
[12,"2017-06-12","USDINR JUN FUT","Buy",64.45,64,64.7625,65.2,"Profit of Rs 0.31/-",null,{"v":0.3125,"d":"0.31"},312.5,1000,"Successful","2017-06-16"]
[13,"2017-06-16","USDINR JUN FUT","Buy",64.51,64.2,64.7,65.11,"Profit of Rs 0.19/-",null,{"v":0.18999999999999773,"d":"0.19"},189.99999999999773,1000,"Successful","2017-06-21"]
{"$rows_left_out":44}
{"sheet":"Sheet2","index":7,"n_rows":1526,"n_cols":13,"rows_kept":1526,"hidden":true}
["SYMBOL","SERIES","OPEN","HIGH","LOW","CLOSE","LAST","PREVCLOSE","TOTTRDQTY","TOTTRDVAL","TIMESTAMP","TOTALTRADES","ISIN"]
["20MICRONS","EQ",47.4,53.75,47.05,51.5,51.05,46.85,908151,46576907,"2018-03-13",6924,"INE144J01027"]
["3IINFOTECH","EQ",5.25,5.4,5.15,5.35,5.35,5.15,2243805,11842830.65,"2018-03-13",1131,"INE748C01020"]
["3MINDIA","EQ",20199,20480.55,20001.05,20171.7,20101,20108.5,719,14542711.45,"2018-03-13",336,"INE470A01017"]
["63MOONS","EQ",79.15,82.5,77.8,81.3,81.45,79.75,245040,19826068.4,"2018-03-13",2730,"INE111B01023"]
["8KMILES","EQ",710,721.6,701.75,706.3,707,705.8,146943,104706460.95,"2018-03-13",6387,"INE650K01021"]
["A2ZINFRA","EQ",29.95,30.75,29.65,29.95,29.95,30.05,1566035,47472827.25,"2018-03-13",2432,"INE619I01012"]
["AARTIDRUGS","EQ",529.05,544,525.35,542.1,544,533,25343,13517100.25,"2018-03-13",1815,"INE767A01016"]
["AARTIIND","EQ",1160.05,1199.6,1148.15,1193.9,1196,1156.55,112367,132691281.1,"2018-03-13",8360,"INE769A01020"]
["AARVEEDEN","EQ",44.2,46.1,44.2,45.9,46,44.25,14914,676587.1,"2018-03-13",100,"INE273D01019"]
["ABAN","EQ",156,168.35,156,163.3,162.7,157.55,1695575,277150855.5,"2018-03-13",17200,"INE421A01028"]
["ABB","EQ",1438.6,1439.85,1402,1410.8,1409.5,1433.6,38286,54372528,"2018-03-13",4278,"INE117A01022"]
["ABBOTINDIA","EQ",5630.1,5699.65,5552.3,5611.3,5619.5,5651.45,2163,12129963.2,"2018-03-13",694,"INE358A01014"]
["ABCAPITAL","EQ",153,154.45,152.5,153.15,153,152.9,2045253,313831849.55,"2018-03-13",15153,"INE674K01013"]
["ABFRL","EQ",145,151.5,144.4,150.25,151.5,145.05,284390,42169520.15,"2018-03-13",18409,"INE647O01011"]
{"$rows_left_out":1511}