{"text_format":"3","workbook":"xlsx","n_sheets":7,"sheets":["Main","Future Intra","Cash Intra","MidCap Intra","Bulk Deals","Call Tracker (Equity & F&O)","Sheet2"],"not_rendered":{"images":4,"defined_names":4},"read":"whole","date_system":"1900"}

{"sheet":"Main","index":0,"n_rows":17,"n_cols":4,"rows_kept":17}
[null,"                                                                                                 "]
{"$rows_empty":8}
[null,"2018-11-14"]
[]
[null,"Sheet No.","Template Name","Summary"]
[null,1,"Future Intra","For Intraday trading in F&O segment"]
[null,2,"Cash Intra","For Intraday trading in cash market segment"]
[null,3,"Mid-cap Intra","For Intraday trading in Mid-cap stocks"]
[null,4,"Bulk Deals","Reveals Bulk Deals carried on NSE & BSE"]
[null,5,"Call Tracker"]

{"sheet":"Future Intra","index":1,"n_rows":245,"n_cols":15,"rows_kept":245,"merged":[[8,0,9,0],[8,1,9,1],[8,2,9,2],[8,5,8,7],[8,8,8,10]]}
[]
[]
[]
[]
[{"$nulls":12},"Back to Main Page"]
["FOR INTRA DAY TRADING",{"$nulls":10},{"$f":"Main!B10","v":"2018-11-14"}]
[]
[]
["Sr.no","Sector","Scrip","CLOSE RATE","Pivot Point","Supports",null,null,"Resistances"]
[null,"Sector",null,"Point","Point","S1","S2","S3","R1","R2","R3","HIGH","LOW","OI","% Change in OI"]
[1,"Index","BANKNIFTY",25830.75,{"v":25705,"d":"25705.00"},{"v":25554.9,"d":"25554.90"},{"v":25279.050000000003,"d":"25279.05"},{"v":25128.950000000004,"d":"25128.95"},25980.85,{"v":26130.949999999997,"d":"26130.95"},{"v":26406.799999999996,"d":"26406.80"},25855.1,25429.15,1417320,{"v":0.03655272280486199,"d":"3.66%"}]
[2,"Index","NIFTY",10615.95,{"v":10569.316666666668,"d":"10569.32"},{"v":10506.633333333335,"d":"10506.63"},{"v":10397.316666666668,"d":"10397.32"},{"v":10334.633333333335,"d":"10334.63"},{"v":10678.633333333335,"d":"10678.63"},{"v":10741.316666666666,"d":"10741.32"},{"v":10850.633333333335,"d":"10850.63"},10632,10460,25260975,{"v":-0.00443670672806919,"d":"-0.44%"}]
[5,"Index","NIFTYIT",{"v":14749,"d":"14749.00"},{"v":14716,"d":"14716.00"},{"v":14633,"d":"14633.00"},{"v":14517,"d":"14517.00"},{"v":14434,"d":"14434.00"},{"v":14832,"d":"14832.00"},{"v":14915,"d":"14915.00"},{"v":15031,"d":"15031.00"},14799,14600,11550,{"v":-0.06477732793522267,"d":"-6.48%"}]
[6,"Index","NIFTYMID50",{"v":4632,"d":"4632.00"},{"v":4687.366666666667,"d":"4687.37"},{"v":4576.633333333333,"d":"4576.63"},{"v":4521.266666666666,"d":"4521.27"},{"v":4410.533333333333,"d":"4410.53"},{"v":4742.733333333334,"d":"4742.73"},{"v":4853.466666666667,"d":"4853.47"},{"v":4908.833333333334,"d":"4908.83"},4798.1,4632,694870,{"v":0,"d":"0.00%"}]
[8,"Cement","ACC",1461.65,{"v":1452.5333333333335,"d":"1452.53"},{"v":1438.2166666666672,"d":"1438.22"},{"v":1414.7833333333335,"d":"1414.78"},{"v":1400.4666666666672,"d":"1400.47"},{"v":1475.9666666666672,"d":"1475.97"},{"v":1490.2833333333333,"d":"1490.28"},{"v":1513.7166666666672,"d":"1513.72"},1466.85,1429.1,874800,{"v":0.00505514705882353,"d":"0.51%"}]
[9,"Others","ADANIENT",162.95,{"v":162,"d":"162.00"},{"v":160.2,"d":"160.20"},157.45,{"v":155.64999999999998,"d":"155.65"},164.75,166.55,{"v":169.3,"d":"169.30"},163.8,159.25,38840000,{"v":3.8250801199214307E-3,"d":"0.38%"}]
[10,"Others","ADANIPORTS",{"v":335.7,"d":"335.70"},{"v":332.8,"d":"332.80"},{"v":329.1,"d":"329.10"},{"v":322.5,"d":"322.50"},{"v":318.8,"d":"318.80"},{"v":339.40000000000003,"d":"339.40"},{"v":343.09999999999997,"d":"343.10"},{"v":349.70000000000005,"d":"349.70"},336.5,326.2,16745000,{"v":-0.011948664994836997,"d":"-1.19%"}]
[11,"Power","ADANIPOWER",48.95,{"v":48.76666666666667,"d":"48.77"},{"v":48.033333333333346,"d":"48.03"},{"v":47.116666666666674,"d":"47.12"},{"v":46.38333333333335,"d":"46.38"},{"v":49.683333333333344,"d":"49.68"},{"v":50.41666666666668,"d":"50.42"},{"v":51.33333333333334,"d":"51.33"},49.5,47.85,160700000,{"v":-0.004953560371517028,"d":"-0.50%"}]
[12,"Pharma","AJANTPHARM",{"v":1080.3,"d":"1080.30"},{"v":1074.5166666666667,"d":"1074.52"},{"v":1064.1833333333334,"d":"1064.18"},{"v":1048.0666666666668,"d":"1048.07"},{"v":1037.7333333333336,"d":"1037.73"},{"v":1090.6333333333332,"d":"1090.63"},{"v":1100.9666666666667,"d":"1100.97"},{"v":1117.083333333333,"d":"1117.08"},1084.85,1058.4,590000,{"v":8.4817642069550466E-4,"d":"0.08%"}]
[13,"Banking","ALBK",{"v":36.2,"d":"36.20"},{"v":37.833333333333336,"d":"37.83"},{"v":33.16666666666667,"d":"33.17"},{"v":30.133333333333333,"d":"30.13"},{"v":25.46666666666667,"d":"25.47"},{"v":40.866666666666674,"d":"40.87"},{"v":45.533333333333346,"d":"45.53"},{"v":48.56666666666668,"d":"48.57"},42.5,34.8,21229000,{"v":0.40953455945820333,"d":"40.95%"}]
{"$rows_left_out":219}
{"sheet":"Cash Intra","index":2,"n_rows":248,"n_cols":13,"rows_kept":248,"merged":[[7,0,8,0],[7,1,8,1],[7,2,8,2],[7,3,8,3],[7,4,7,6],[7,7,7,9]]}
[]
[]
[]
[]
[{"$nulls":12},"Back to Main Page"]
["FOR INTRA DAY TRADING",{"$nulls":9},{"$f":"Main!B10","v":"2018-11-14"}]
[]
["Sr.no","Scrip","CLOSE RATE","Pivot Point","Supports",null,null,"Resistances"]
[null,null,"Point",null,"S1","S2","S3","R1","R2","R3","HIGH","LOW","Total Trade Quanity in Lakhs"]
[1,"Nifty 50",10582.5,{"v":10539.766666666666,"d":"10539.77"},{"v":10483.283333333333,"d":"10483.28"},{"v":10384.066666666666,"d":"10384.07"},{"v":10327.583333333332,"d":"10327.58"},{"v":10638.983333333334,"d":"10638.98"},{"v":10695.466666666667,"d":"10695.47"},{"v":10794.683333333334,"d":"10794.68"},10596.25,10440.55]
[2,"Nifty Bank",25768.6,{"v":25649.88333333333,"d":"25649.88"},{"v":25503.266666666663,"d":"25503.27"},{"v":25237.93333333333,"d":"25237.93"},{"v":25091.316666666662,"d":"25091.32"},{"v":25915.216666666664,"d":"25915.22"},{"v":26061.833333333332,"d":"26061.83"},{"v":26327.166666666664,"d":"26327.17"},25796.5,25384.55]
[3,"Nifty CPSE",2180.8,{"v":2171.866666666667,"d":"2171.87"},{"v":2160.7333333333336,"d":"2160.73"},{"v":2140.666666666667,"d":"2140.67"},{"v":2129.5333333333338,"d":"2129.53"},{"v":2191.9333333333334,"d":"2191.93"},{"v":2203.0666666666666,"d":"2203.07"},{"v":2223.133333333333,"d":"2223.13"},2183,2151.8]
[4,"Nifty Infra",3068.65,{"v":3053.516666666667,"d":"3053.52"},{"v":3034.2333333333336,"d":"3034.23"},{"v":2999.8166666666666,"d":"2999.82"},{"v":2980.5333333333333,"d":"2980.53"},{"v":3087.933333333334,"d":"3087.93"},{"v":3107.2166666666676,"d":"3107.22"},{"v":3141.633333333334,"d":"3141.63"},3072.8,3019.1]
[5,"Nifty IT",14698.2,{"v":14679.916666666666,"d":"14679.92"},{"v":14579.833333333332,"d":"14579.83"},{"v":14461.466666666665,"d":"14461.47"},{"v":14361.383333333331,"d":"14361.38"},{"v":14798.283333333333,"d":"14798.28"},{"v":14898.366666666665,"d":"14898.37"},{"v":15016.733333333334,"d":"15016.73"},14780,14561.55]
[6,"Nifty PSE",3431,{"v":3422.366666666667,"d":"3422.37"},{"v":3409.9333333333334,"d":"3409.93"},{"v":3388.866666666667,"d":"3388.87"},{"v":3376.4333333333334,"d":"3376.43"},{"v":3443.4333333333334,"d":"3443.43"},{"v":3455.866666666667,"d":"3455.87"},{"v":3476.9333333333334,"d":"3476.93"},3434.8,3401.3]
[7,"Nifty Midcap 50",4808.1,{"v":4778.483333333334,"d":"4778.48"},{"v":4743.716666666667,"d":"4743.72"},{"v":4679.333333333334,"d":"4679.33"},{"v":4644.5666666666675,"d":"4644.57"},{"v":4842.866666666667,"d":"4842.87"},{"v":4877.633333333333,"d":"4877.63"},{"v":4942.016666666666,"d":"4942.02"},4813.25,4714.1]
[8,"ABB",1297.7,{"v":1303.8166666666666,"d":"1303.82"},{"v":1287.4333333333332,"d":"1287.43"},{"v":1277.1666666666665,"d":"1277.17"},{"v":1260.783333333333,"d":"1260.78"},{"v":1314.0833333333333,"d":"1314.08"},{"v":1330.4666666666665,"d":"1330.47"},{"v":1340.7333333333333,"d":"1340.73"},1320.2,1293.55,0.3735]
[9,"ACC",1457.2,{"v":1448.8500000000001,"d":"1448.85"},{"v":1432.3500000000004,"d":"1432.35"},{"v":1407.5000000000002,"d":"1407.50"},{"v":1391.0000000000005,"d":"1391.00"},{"v":1473.7000000000003,"d":"1473.70"},{"v":1490.1999999999998,"d":"1490.20"},{"v":1515.0500000000002,"d":"1515.05"},1465.35,1424,4.58083]
[10,"AIAENG",1700.2,{"v":1694.2666666666664,"d":"1694.27"},{"v":1676.0333333333328,"d":"1676.03"},{"v":1651.8666666666663,"d":"1651.87"},{"v":1633.6333333333328,"d":"1633.63"},{"v":1718.433333333333,"d":"1718.43"},{"v":1736.6666666666665,"d":"1736.67"},{"v":1760.833333333333,"d":"1760.83"},1712.5,1670.1,0.07584]
[11,"AUBANK",536.8,{"v":534.9333333333333,"d":"534.93"},{"v":521.8666666666666,"d":"521.87"},{"v":506.9333333333333,"d":"506.93"},{"v":493.86666666666656,"d":"493.87"},{"v":549.8666666666666,"d":"549.87"},{"v":562.9333333333334,"d":"562.93"},{"v":577.8666666666666,"d":"577.87"},548,520,2.87241]
{"$rows_left_out":229}
{"sheet":"MidCap Intra","index":3,"n_rows":510,"n_cols":13,"rows_kept":510,"merged":[[0,0,0,1],[8,0,9,0],[8,1,9,1],[8,2,9,2],[8,3,9,3],[8,4,8,6],[8,7,8,9]]}
[]
[]
[]
[]
[{"$nulls":11},"Back To Main Page"]
["FOR INTRA DAY TRADING",{"$nulls":9},{"$f":"Main!B10","v":"2018-11-14"}]
[null,null," "]
[]
["Sr.no","Scrip","CLOSE RATE","Pivot Point","Supports",null,null,"Resistances"]
[null,null,"Point",null,"S1","S2","S3","R1","R2","R3","HIGH","LOW","Total Trade Quanity in Lakhs"]
[1,"3MINDIA",20439.3,{"v":20420.683333333334,"d":"20420.68"},{"v":20318.61666666667,"d":"20318.62"},{"v":20197.933333333334,"d":"20197.93"},{"v":20095.86666666667,"d":"20095.87"},{"v":20541.36666666667,"d":"20541.37"},{"v":20643.433333333334,"d":"20643.43"},{"v":20764.11666666667,"d":"20764.12"},20522.75,20300,0.01585]
[2,"8KMILES",102.6,{"v":101.64999999999999,"d":"101.65"},{"v":100.69999999999999,"d":"100.70"},{"v":98.8,"d":"98.80"},97.85,{"v":103.54999999999998,"d":"103.55"},{"v":104.5,"d":"104.50"},{"v":106.39999999999998,"d":"106.40"},102.6,99.75,7.73324]
[3,"AARTIIND",1375.3,1374.45,{"v":1365.8500000000001,"d":"1365.85"},{"v":1356.4,"d":"1356.40"},{"v":1347.8000000000002,"d":"1347.80"},{"v":1383.9,"d":"1383.90"},{"v":1392.5,"d":"1392.50"},1401.95,1383.05,1365,0.18918]
[4,"ABAN",86.2,{"v":84.60000000000001,"d":"84.60"},{"v":81.90000000000002,"d":"81.90"},{"v":77.60000000000001,"d":"77.60"},{"v":74.90000000000002,"d":"74.90"},{"v":88.90000000000002,"d":"88.90"},{"v":91.60000000000001,"d":"91.60"},{"v":95.90000000000002,"d":"95.90"},87.3,80.3,16.0164]
[5,"ABB",1297.7,{"v":1303.8166666666666,"d":"1303.82"},{"v":1287.4333333333332,"d":"1287.43"},{"v":1277.1666666666665,"d":"1277.17"},{"v":1260.783333333333,"d":"1260.78"},{"v":1314.0833333333333,"d":"1314.08"},{"v":1330.4666666666665,"d":"1330.47"},{"v":1340.7333333333333,"d":"1340.73"},1320.2,1293.55,0.3735]
[6,"ABCAPITAL",103.75,{"v":103.08333333333333,"d":"103.08"},{"v":102.16666666666666,"d":"102.17"},{"v":100.58333333333333,"d":"100.58"},{"v":99.66666666666666,"d":"99.67"},{"v":104.66666666666666,"d":"104.67"},{"v":105.58333333333331,"d":"105.58"},{"v":107.16666666666666,"d":"107.17"},104,101.5,12.33774]
[7,"ABFRL",192.85,{"v":193.8166666666667,"d":"193.82"},{"v":190.0333333333334,"d":"190.03"},{"v":187.2166666666667,"d":"187.22"},{"v":183.4333333333334,"d":"183.43"},{"v":196.63333333333338,"d":"196.63"},{"v":200.41666666666669,"d":"200.42"},{"v":203.23333333333338,"d":"203.23"},197.6,191,9.90045]
[8,"ACC",1457.2,{"v":1448.8500000000001,"d":"1448.85"},{"v":1432.3500000000004,"d":"1432.35"},{"v":1407.5000000000002,"d":"1407.50"},{"v":1391.0000000000005,"d":"1391.00"},{"v":1473.7000000000003,"d":"1473.70"},{"v":1490.1999999999998,"d":"1490.20"},{"v":1515.0500000000002,"d":"1515.05"},1465.35,1424,4.58083]
[9,"ADANIPORTS",334.1,{"v":331.26666666666665,"d":"331.27"},{"v":327.5333333333333,"d":"327.53"},{"v":320.96666666666664,"d":"320.97"},{"v":317.2333333333333,"d":"317.23"},{"v":337.8333333333333,"d":"337.83"},{"v":341.56666666666666,"d":"341.57"},{"v":348.1333333333333,"d":"348.13"},335,324.7,17.38296]
[10,"ADANIPOWER",48.55,{"v":48.38333333333333,"d":"48.38"},{"v":47.56666666666666,"d":"47.57"},{"v":46.58333333333333,"d":"46.58"},{"v":45.76666666666666,"d":"45.77"},{"v":49.36666666666667,"d":"49.37"},{"v":50.183333333333344,"d":"50.18"},{"v":51.16666666666667,"d":"51.17"},49.2,47.4,205.60525]
{"$rows_left_out":491}
{"sheet":"Bulk Deals","index":4,"n_rows":44,"n_cols":8,"rows_kept":44,"merged":[[4,0,4,1],[4,2,4,3],[6,1,6,2]]}
[" "]
[]
[]
[]
[]
[{"$nulls":4},"Back To Main Page"]
["Subject :","BULK DEAL",null,{"$f":"Main!B10","v":"2018-11-14"}]
[]
["Date","Scrip code","Scrip Name","Client Name","Buy / Sell","Quantity Traded","Trade Price / Wt.Avg.trade price","Exchange  "]
["2018-11-13",538566,"APOLLOTRI","SHRI LAKSHMI METAL UDYOG LIMITED","BUY",{"v":153489,"d":"153,489"},134.94,"BSE"]
["2018-11-13",542057,"BCPL","AMBE SECURITIES PRIVATE LIMITED","BUY",{"v":100000,"d":"100,000"},36.25,"BSE"]
["2018-11-13",530393,"DBSTOCKBRO","PAWAN AGARWAL","BUY",{"v":685000,"d":"685,000"},8.7,"BSE"]
["2018-11-13",530393,"DBSTOCKBRO","SHARMA GANDHI HIRE PURCHASE LIMITED","SELL",{"v":1364545,"d":"1,364,545"},8.7,"BSE"]
["2018-11-13",530393,"DBSTOCKBRO","RECTOR INVESTMENT PRIVATE LIMITED","SELL",{"v":415000,"d":"415,000"},8.7,"BSE"]
["2018-11-13",530393,"DBSTOCKBRO","KSB FININVEST PRIVATE LIMITED","BUY",{"v":680000,"d":"680,000"},8.7,"BSE"]
["2018-11-13",530393,"DBSTOCKBRO","AGRAWALA FINSERVE PRIVATE LIMITED","BUY",{"v":419188,"d":"419,188"},8.7,"BSE"]
["2018-11-13",531502,"ESARIND","MEHUL HASMUKH SHAH","BUY",{"v":150000,"d":"150,000"},0.69,"BSE"]
["2018-11-13",531502,"ESARIND","VISHAL VIJAY SHAH","SELL",{"v":140000,"d":"140,000"},0.69,"BSE"]
["2018-11-13",541983,"INNOVATIVE","AMARKUMAR ODHAVJI DHAMECHA","SELL",{"v":6000,"d":"6,000"},151.02,"BSE"]
["2018-11-13",541983,"INNOVATIVE","AMARKUMAR ODHAVJI DHAMECHA","BUY",{"v":63000,"d":"63,000"},156.94,"BSE"]
{"$rows_left_out":25}
{"sheet":"Call Tracker (Equity & F&O)","index":5,"n_rows":265,"n_cols":18,"rows_kept":265,"merged":[[28,0,29,0],[28,1,29,1],[28,9,29,9],[28,11,29,11],[28,12,29,12],[28,13,29,13],[28,14,29,14],[28,17,29,17],[30,0,31,0],[30,1,31,1],[30,9,31,9],[30,11,31,11],[30,12,31,12],[30,13,31,13],[30,14,31,14],[30,17,31,17],[32,0,33,0],[32,1,33,1],[32,9,33,9],[32,11,33,11],[32,12,33,12],[32,13,33,13],[32,14,33,14],[32,17,33,17],[34,0,35,0],[34,1,35,1],[34,9,35,9],[34,11,35,11],[34,12,35,12],[34,13,35,13],[34,14,35,14]]}
[]
[]
[]
[]
[{"$nulls":12},"Back To Main Page"]
["Retail Research Technical Calls & Fundamental Performance Report for the month of November -2018 "]
[{"$nulls":12},{"$f":"Main!B10","v":"2018-11-14"}]
[null,"Positional  Call"]
["Sr.no","Date",null,"Company","Rec","Rec Price","Stop Loss***","Call Closed At","Target","Remark","Profit / Loss per Share","Gain / Loss  %","Status","Closed Date","NSE Closed Price"]
[1,"2018-10-25",null,"SUNPHARMA","Buy{}",569,528,587.5,"620-630","Profit of Rs.18.5/-",{"$f":"H10-F10","v":18.5},{"$f":"K10/F10","v":{"v":0.03251318101933216,"d":"3.25%"}},"Successful","2018-11-09",{"$nulls":3},"H"]
[2,"2018-11-02",null,"MARUTI","Buy{}",6860,6580,7140,"7300-7500","Profit of Rs.280/-",{"$f":"H11-F11","v":280},{"$f":"K11/F11","v":{"v":0.04081632653061224,"d":"4.08%"}},"Successful","2018-11-05",{"$nulls":3},"H"]
[3,"2018-11-09",null,"RECLTD","Buy",122.5,116.3,127,"133-137","Part profit of Rs.4.5/-",{"$f":"H12-F12","v":4.5},{"$f":"K12/F12","v":{"v":0.036734693877551024,"d":"3.67%"}},"Successful","2018-11-12",{"$nulls":3},"R"]
[4,"2018-11-12",null,"SRF","Buy","2030-2050",1940,null,"2200-2250","Open",{"$nulls":4},{"$f":"VLOOKUP(D13,Sheet2!A2:M1638,6,0)","v":2071.55},null,null,"H"]
[5,"2018-11-12",null,"GAIL","Buy","362-365",348,null,"385-395","Open",{"$nulls":4},{"$f":"VLOOKUP(D14,Sheet2!A3:M1639,6,0)","v":365.35},null,null,"H"]
[6,"2018-11-13",null,"IOC","Buy",137.5,134,142.25,"146-150","Profit of Rs.4.75/-",{"$f":"H15-F15","v":4.75},{"$f":"K15/F15","v":{"v":0.034545454545454546,"d":"3.45%"}},"Successful","2018-11-13",{"$nulls":3},"H"]
[7,"2018-11-13",null,"NIITTECH","Buy","1190-1200 ",1144.4,null,"1300-1310","Open",{"$nulls":4},{"$f":"VLOOKUP(D16,Sheet2!A5:M1641,6,0)","v":1174.9},null,null,"R"]
{"$rows_empty":7}
["CLBS = Closing Basis ***",{"$nulls":4},"Reinitiated $"]
["Dividend adjusted <>",{"$nulls":4},"Revised stoploss #"]
["Part book {}"]
{"$rows_left_out":222}
{"sheet":"Sheet2","index":6,"n_rows":1638,"n_cols":14,"rows_kept":1638,"hidden":true}
["SYMBOL","SERIES","OPEN","HIGH","LOW","CLOSE","LAST","PREVCLOSE","TOTTRDQTY","TOTTRDVAL","TIMESTAMP","TOTALTRADES","ISIN","ISIN"]
["20MICRONS","EQ",44.15,45.75,43.05,45.4,45.45,44.3,55560,2500843.4,"2018-11-13",550,"INE144J01027"]
["21STCENMGM","EQ",23.65,23.65,23.65,23.65,23.65,23.2,1602,37887.3,"2018-11-13",4,"INE253B01015"]
["3IINFOTECH","EQ",3.35,3.4,3.35,3.4,3.4,3.35,391032,1316658.1,"2018-11-13",375,"INE748C01020"]
["3MINDIA","EQ",20469.95,20522.75,20300,20439.3,20453.75,20464.3,1585,32385118.55,"2018-11-13",457,"INE470A01017"]
["3PLAND","BE",12.6,13.2,12.6,13.2,13.2,13,560,7092,"2018-11-13",4,"INE105C01023"]
["5PAISA","EQ",183.05,194.5,180.1,193.85,194.5,185.25,6099,1150051.35,"2018-11-13",274,"INE618L01018"]
["63MOONS","EQ",79.95,91.45,79,89.2,88,80.2,967765,84817010.95,"2018-11-13",8887,"INE111B01023"]
["8KMILES","EQ",102.6,102.6,99.75,102.6,102.6,97.75,773324,79081859.25,"2018-11-13",2131,"INE650K01021"]
["A2ZINFRA","EQ",13.3,13.75,13.2,13.5,13.7,13.55,317067,4252970.05,"2018-11-13",736,"INE619I01012"]
["AARTIDRUGS","EQ",580.95,582,575.6,576.1,576,576.9,6033,3482185.6,"2018-11-13",329,"INE767A01016"]
["AARTIIND","EQ",1383.05,1383.05,1365,1375.3,1375,1383.05,18918,26050637.2,"2018-11-13",1377,"INE769A01020"]
["AARVEEDEN","EQ",25.35,26.5,24,25.35,25.3,24.8,20158,508038.6,"2018-11-13",182,"INE273D01019"]
["AAVAS","EQ",659.8,673,652.75,665.15,665,660,56424,37519243.4,"2018-11-13",1911,"INE216P01012"]
["ABAN","EQ",80.95,87.3,80.3,86.2,85,81.25,1601640,135706402.85,"2018-11-13",12121,"INE421A01028"]
["ABB","EQ",1305,1320.2,1293.55,1297.7,1297,1307.4,37350,48670060.65,"2018-11-13",2713,"INE117A01022"]
["ABBOTINDIA","EQ",7469,7560,7469,7517.8,7512.05,7469.15,1722,12937847.6,"2018-11-13",460,"INE358A01014"]
["ABCAPITAL","EQ",101.5,104,101.5,103.75,104,101.8,1233774,126997290.25,"2018-11-13",12019,"INE674K01013"]
["ABFRL","EQ",191,197.6,191,192.85,192.2,192.85,990045,191693588.95,"2018-11-13",9392,"INE647O01011"]
["ACC","EQ",1435,1465.35,1424,1457.2,1454.05,1438.7,458083,660549912.9,"2018-11-13",35076,"INE012A01025"]
{"$rows_left_out":1618}