{"text_format":"3","workbook":"xlsx","n_sheets":9,"sheets":["Main","Future Intra","Cash Intra","MidCap Intra","Bulk Deals","Call Tracker (Equity & F&O)","Call Tracker (Currency)","Sheet2","Sheet1"],"not_rendered":{"images":4,"defined_names":4},"read":"whole","date_system":"1900"}

{"sheet":"Main","index":0,"n_rows":17,"n_cols":4,"rows_kept":17}
[null,"                                                                                                 "]
{"$rows_empty":8}
[null,"2017-05-14"]
[]
[null,"Sheet No.","Template Name","Summary"]
[null,1,"Future Intra","For Intraday trading in F&O segment"]
[null,2,"Cash Intra","For Intraday trading in cash market segment"]
[null,3,"Mid-cap Intra","For Intraday trading in Mid-cap stocks"]
[null,4,"Bulk Deals","Reveals Bulk Deals carried on NSE & BSE"]
[null,5,"Call Tracker"]

{"sheet":"Future Intra","index":1,"n_rows":250,"n_cols":15,"rows_kept":250,"merged":[[8,0,9,0],[8,1,9,1],[8,2,9,2],[8,5,8,7],[8,8,8,10]]}
[]
[]
[]
[]
[{"$nulls":12},"Back to Main Page"]
["FOR INTRA DAY TRADING",{"$nulls":10},{"$f":"Main!B10","v":"2017-05-14"}]
[]
[]
["Sr.no","Sector","Scrip","CLOSE RATE","Pivot Point","Supports",null,null,"Resistances"]
[null,"Sector",null,"Point","Point","S1","S2","S3","R1","R2","R3","HIGH","LOW","OI","% Change in OI"]
[1,"Index","BANKNIFTY",26400.35,{"v":26296.86666666667,"d":"26296.87"},{"v":26163.833333333336,"d":"26163.83"},{"v":25927.316666666666,"d":"25927.32"},{"v":25794.283333333333,"d":"25794.28"},{"v":26533.38333333334,"d":"26533.38"},{"v":26666.41666666667,"d":"26666.42"},{"v":26902.93333333334,"d":"26902.93"},26429.9,26060.35,3330040,{"v":0.06123879816946473,"d":"6.12%"}]
[2,"Index","NIFTY",{"v":10820.1,"d":"10820.10"},{"v":10794.683333333334,"d":"10794.68"},{"v":10762.166666666668,"d":"10762.17"},{"v":10704.233333333334,"d":"10704.23"},{"v":10671.716666666667,"d":"10671.72"},{"v":10852.616666666669,"d":"10852.62"},{"v":10885.133333333335,"d":"10885.13"},{"v":10943.06666666667,"d":"10943.07"},10827.2,10736.75,26127450,{"v":0.041998055784042476,"d":"4.20%"}]
[3,"Index","NIFTYCPSE",{"v":2627.4,"d":"2627.40"},{"v":875.8000000000001,"d":"875.80"},{"v":1751.6000000000001,"d":"1751.60"},{"v":875.8000000000001,"d":"875.80"},{"v":1751.6000000000001,"d":"1751.60"},{"v":1751.6000000000001,"d":"1751.60"},{"v":875.8000000000001,"d":"875.80"},{"v":1751.6000000000001,"d":"1751.60"},0,0,0,{"v":0,"d":"0.00%"}]
[4,"Index","NIFTYINFRA",{"v":3441.1,"d":"3441.10"},{"v":1147.0333333333333,"d":"1147.03"},{"v":2294.0666666666666,"d":"2294.07"},{"v":1147.0333333333333,"d":"1147.03"},{"v":2294.0666666666666,"d":"2294.07"},{"v":2294.0666666666666,"d":"2294.07"},{"v":1147.0333333333333,"d":"1147.03"},{"v":2294.0666666666666,"d":"2294.07"},0,0,0,{"v":0,"d":"0.00%"}]
[5,"Index","NIFTYIT",{"v":13521,"d":"13521.00"},{"v":13501.333333333334,"d":"13501.33"},{"v":13454.666666666668,"d":"13454.67"},{"v":13388.333333333334,"d":"13388.33"},{"v":13341.666666666668,"d":"13341.67"},{"v":13567.666666666668,"d":"13567.67"},{"v":13614.333333333336,"d":"13614.33"},{"v":13680.666666666668,"d":"13680.67"},13548,13435,63950,{"v":-6.216006216006216E-3,"d":"-0.62%"}]
[6,"Index","NIFTYMID50",{"v":5288,"d":"5288.00"},{"v":5234.666666666667,"d":"5234.67"},{"v":5181.333333333334,"d":"5181.33"},{"v":5074.666666666667,"d":"5074.67"},{"v":5021.333333333334,"d":"5021.33"},{"v":5341.333333333334,"d":"5341.33"},{"v":5394.666666666668,"d":"5394.67"},{"v":5501.333333333334,"d":"5501.33"},5288,5128,601600,{"v":0,"d":"0.00%"}]
[7,"Index","NIFTYPSE",4077.45,{"v":1359.1499999999999,"d":"1359.15"},{"v":2718.2999999999997,"d":"2718.30"},{"v":1359.1499999999999,"d":"1359.15"},{"v":2718.2999999999997,"d":"2718.30"},{"v":2718.2999999999997,"d":"2718.30"},{"v":1359.1499999999999,"d":"1359.15"},{"v":2718.2999999999997,"d":"2718.30"},0,0,0,{"v":0,"d":"0.00%"}]
[8,"Cement","ACC",1459.75,{"v":1467.2,"d":"1467.20"},1446.95,1434.15,{"v":1413.9,"d":"1413.90"},{"v":1480,"d":"1480.00"},1500.25,1513.05,1487.45,1454.4,2088800,{"v":0.08723714345200916,"d":"8.72%"}]
[9,"Others","ADANIENT",{"v":128.7,"d":"128.70"},{"v":127.46666666666665,"d":"127.47"},{"v":124.93333333333331,"d":"124.93"},{"v":121.16666666666666,"d":"121.17"},{"v":118.63333333333331,"d":"118.63"},{"v":131.2333333333333,"d":"131.23"},{"v":133.76666666666665,"d":"133.77"},{"v":137.5333333333333,"d":"137.53"},130,123.7,14492000,{"v":-0.03412423353772327,"d":"-3.41%"}]
[10,"Others","ADANIPORTS",{"v":413,"d":"413.00"},{"v":412.81666666666666,"d":"412.82"},{"v":411.1333333333333,"d":"411.13"},{"v":409.26666666666665,"d":"409.27"},{"v":407.5833333333333,"d":"407.58"},{"v":414.68333333333334,"d":"414.68"},{"v":416.3666666666666,"d":"416.37"},{"v":418.23333333333335,"d":"418.23"},414.5,410.95,14732500,{"v":0.02629745733194009,"d":"2.63%"}]
{"$rows_left_out":224}
{"sheet":"Cash Intra","index":2,"n_rows":248,"n_cols":13,"rows_kept":248,"merged":[[7,0,8,0],[7,1,8,1],[7,2,8,2],[7,3,8,3],[7,4,7,6],[7,7,7,9]]}
[]
[]
[]
[]
[{"$nulls":12},"Back to Main Page"]
["FOR INTRA DAY TRADING",{"$nulls":9},{"$f":"Main!B10","v":"2017-05-14"}]
[]
["Sr.no","Scrip","CLOSE RATE","Pivot Point","Supports",null,null,"Resistances"]
[null,null,"Point",null,"S1","S2","S3","R1","R2","R3","HIGH","LOW","Total Trade Quanity in Lakhs"]
[1,"Nifty 50",10806.5,{"v":10781,"d":"10781.00"},10749.95,{"v":10693.400000000001,"d":"10693.40"},{"v":10662.350000000002,"d":"10662.35"},10837.55,{"v":10868.599999999999,"d":"10868.60"},{"v":10925.149999999998,"d":"10925.15"},10812.05,10724.45]
[2,"Nifty Bank",26413.15,26316.75,26196.25,25979.35,25858.85,26533.65,26654.15,{"v":26871.050000000003,"d":"26871.05"},26437.25,26099.85]
[3,"Nifty CPSE",2432.35,2433.25,{"v":2422.1,"d":"2422.10"},2411.85,{"v":2400.7,"d":"2400.70"},{"v":2443.5,"d":"2443.50"},{"v":2454.6499999999996,"d":"2454.65"},{"v":2464.9,"d":"2464.90"},2444.4,2423]
[4,"Nifty Infra",3395.4,{"v":3392.933333333334,"d":"3392.93"},{"v":3380.8166666666675,"d":"3380.82"},{"v":3366.2333333333336,"d":"3366.23"},{"v":3354.1166666666672,"d":"3354.12"},{"v":3407.516666666668,"d":"3407.52"},{"v":3419.6333333333337,"d":"3419.63"},{"v":3434.216666666668,"d":"3434.22"},3405.05,3378.35]
[5,"Nifty IT",13478.6,{"v":13463.683333333334,"d":"13463.68"},{"v":13408.216666666669,"d":"13408.22"},{"v":13337.833333333334,"d":"13337.83"},{"v":13282.366666666669,"d":"13282.37"},{"v":13534.06666666667,"d":"13534.07"},{"v":13589.533333333336,"d":"13589.53"},{"v":13659.91666666667,"d":"13659.92"},13519.15,13393.3]
[6,"Nifty PSE",3844,3850.25,{"v":3829.6,"d":"3829.60"},{"v":3815.2,"d":"3815.20"},{"v":3794.5499999999997,"d":"3794.55"},3864.65,{"v":3885.2999999999997,"d":"3885.30"},{"v":3899.7000000000003,"d":"3899.70"},3870.9,3835.85]
[7,"Nifty Midcap 50",5231.05,{"v":5215.8,"d":"5215.80"},{"v":5194.150000000001,"d":"5194.15"},5157.25,{"v":5135.6,"d":"5135.60"},{"v":5252.700000000001,"d":"5252.70"},5274.35,{"v":5311.250000000001,"d":"5311.25"},5237.45,5178.9]
[8,"ABB",1245.15,{"v":1252.1499999999999,"d":"1252.15"},{"v":1228.2999999999997,"d":"1228.30"},{"v":1211.4499999999998,"d":"1211.45"},{"v":1187.5999999999997,"d":"1187.60"},{"v":1268.9999999999998,"d":"1269.00"},{"v":1292.8499999999997,"d":"1292.85"},{"v":1309.6999999999998,"d":"1309.70"},1276,1235.3,1.38565]
[9,"ACC",1466.55,{"v":1475.6333333333332,"d":"1475.63"},{"v":1452.2666666666664,"d":"1452.27"},{"v":1437.9833333333331,"d":"1437.98"},{"v":1414.6166666666663,"d":"1414.62"},{"v":1489.9166666666665,"d":"1489.92"},{"v":1513.2833333333333,"d":"1513.28"},{"v":1527.5666666666666,"d":"1527.57"},1499,1461.35,3.6186]
[10,"AIAENG",1462.35,{"v":1452.3666666666668,"d":"1452.37"},{"v":1434.7333333333336,"d":"1434.73"},{"v":1407.1166666666668,"d":"1407.12"},{"v":1389.4833333333336,"d":"1389.48"},{"v":1479.9833333333336,"d":"1479.98"},{"v":1497.6166666666668,"d":"1497.62"},{"v":1525.2333333333336,"d":"1525.23"},1470,1424.75,0.22568]
[11,"AUBANK",711.1,{"v":710.1666666666666,"d":"710.17"},{"v":703.9333333333333,"d":"703.93"},{"v":696.7666666666667,"d":"696.77"},{"v":690.5333333333333,"d":"690.53"},{"v":717.3333333333333,"d":"717.33"},{"v":723.5666666666666,"d":"723.57"},{"v":730.7333333333332,"d":"730.73"},716.4,703,1.21654]
{"$rows_left_out":229}
{"sheet":"MidCap Intra","index":3,"n_rows":511,"n_cols":13,"rows_kept":511,"merged":[[0,0,0,1],[8,0,9,0],[8,1,9,1],[8,2,9,2],[8,3,9,3],[8,4,8,6],[8,7,8,9]]}
[]
[]
[]
[]
[{"$nulls":11},"Back To Main Page"]
["FOR INTRA DAY TRADING",{"$nulls":9},{"$f":"Main!B10","v":"2017-05-14"}]
[null,null," "]
[]
["Sr.no","Scrip","CLOSE RATE","Pivot Point","Supports",null,null,"Resistances"]
[null,null,"Point",null,"S1","S2","S3","R1","R2","R3","HIGH","LOW","Total Trade Quanity in Lakhs"]
[1,"3MINDIA",20400.65,{"v":20400.216666666667,"d":"20400.22"},{"v":20300.433333333334,"d":"20300.43"},{"v":20200.216666666667,"d":"20200.22"},{"v":20100.433333333334,"d":"20100.43"},{"v":20500.433333333334,"d":"20500.43"},{"v":20600.216666666667,"d":"20600.22"},{"v":20700.433333333334,"d":"20700.43"},20500,20300,0.01104]
[2,"8KMILES",679.3,{"v":681.4333333333333,"d":"681.43"},{"v":668.8666666666666,"d":"668.87"},{"v":658.4333333333333,"d":"658.43"},{"v":645.8666666666666,"d":"645.87"},{"v":691.8666666666666,"d":"691.87"},{"v":704.4333333333334,"d":"704.43"},{"v":714.8666666666666,"d":"714.87"},694,671,0.92391]
[3,"AARTIIND",1326.9,{"v":1319.1499999999999,"d":"1319.15"},{"v":1302.7499999999998,"d":"1302.75"},{"v":1278.6,"d":"1278.60"},{"v":1262.1999999999998,"d":"1262.20"},{"v":1343.2999999999997,"d":"1343.30"},{"v":1359.6999999999998,"d":"1359.70"},{"v":1383.8499999999997,"d":"1383.85"},1335.55,1295,0.12943]
[4,"ABAN",166.75,167.75,{"v":165.1,"d":"165.10"},163.45,{"v":160.79999999999998,"d":"160.80"},{"v":169.4,"d":"169.40"},{"v":172.04999999999998,"d":"172.05"},{"v":173.70000000000002,"d":"173.70"},170.4,166.1,4.54879]
[5,"ABB",1245.15,{"v":1252.1499999999999,"d":"1252.15"},{"v":1228.2999999999997,"d":"1228.30"},{"v":1211.4499999999998,"d":"1211.45"},{"v":1187.5999999999997,"d":"1187.60"},{"v":1268.9999999999998,"d":"1269.00"},{"v":1292.8499999999997,"d":"1292.85"},{"v":1309.6999999999998,"d":"1309.70"},1276,1235.3,1.38565]
[6,"ABCAPITAL",151.4,{"v":152.53333333333333,"d":"152.53"},{"v":149.56666666666666,"d":"149.57"},{"v":147.73333333333332,"d":"147.73"},{"v":144.76666666666665,"d":"144.77"},{"v":154.36666666666667,"d":"154.37"},{"v":157.33333333333331,"d":"157.33"},{"v":159.16666666666669,"d":"159.17"},155.5,150.7,13.84798]
[7,"ABFRL",150.6,{"v":151.38333333333333,"d":"151.38"},{"v":143.36666666666665,"d":"143.37"},{"v":136.13333333333333,"d":"136.13"},{"v":128.11666666666665,"d":"128.12"},{"v":158.61666666666665,"d":"158.62"},{"v":166.6333333333333,"d":"166.63"},{"v":173.86666666666665,"d":"173.87"},159.4,144.15,40.97756]
[8,"ACC",1466.55,{"v":1475.6333333333332,"d":"1475.63"},{"v":1452.2666666666664,"d":"1452.27"},{"v":1437.9833333333331,"d":"1437.98"},{"v":1414.6166666666663,"d":"1414.62"},{"v":1489.9166666666665,"d":"1489.92"},{"v":1513.2833333333333,"d":"1513.28"},{"v":1527.5666666666666,"d":"1527.57"},1499,1461.35,3.6186]
[9,"ADANIPORTS",412.7,{"v":412.6833333333334,"d":"412.68"},{"v":410.8666666666668,"d":"410.87"},{"v":409.0333333333334,"d":"409.03"},{"v":407.2166666666668,"d":"407.22"},{"v":414.51666666666677,"d":"414.52"},{"v":416.33333333333337,"d":"416.33"},{"v":418.16666666666674,"d":"418.17"},414.5,410.85,14.42596]
[10,"ADANIPOWER",23.85,23.95,{"v":23.4,"d":"23.40"},22.95,{"v":22.4,"d":"22.40"},{"v":24.4,"d":"24.40"},{"v":24.950000000000003,"d":"24.95"},{"v":25.4,"d":"25.40"},24.5,23.5,72.72649]
{"$rows_left_out":492}
{"sheet":"Bulk Deals","index":4,"n_rows":107,"n_cols":8,"rows_kept":107,"merged":[[4,0,4,1],[4,2,4,3],[6,1,6,2]]}
[" "]
[]
[]
[]
[]
[{"$nulls":4},"Back To Main Page"]
["Subject :","BULK DEAL",null,{"$f":"Main!B10","v":"2017-05-14"}]
[]
["Date","Scrip code","Scrip Name","Client Name","Buy / Sell","Quantity Traded","Trade Price / Wt.Avg.trade price","Exchange  "]
["2018-05-11",521070,"ALOKTEXT","CATALYST TRUSTEESHIP LIMITED","SELL",{"v":36206120,"d":"36,206,120"},1.58,"BSE"]
["2018-05-11",521070,"ALOKTEXT","INDIA OPPORTUNITIES GROWTH FUND LTD - PINEWOOD STRATEGY","BUY",{"v":36000000,"d":"36,000,000"},1.58,"BSE"]
["2018-05-11",540697,"AMFL","RAJESHWARI STOCK BROKING PVT. LTD.","BUY",{"v":80000,"d":"80,000"},11.8,"BSE"]
["2018-05-11",540697,"AMFL","SAGAR RAJESHBHAI JHAVERI","SELL",{"v":80000,"d":"80,000"},11.8,"BSE"]
["2018-05-11",537766,"BCP","ASHISH BHUPENDRA THAKAR","SELL",{"v":77611,"d":"77,611"},160.56,"BSE"]
["2018-05-11",537766,"BCP","ASHISH BHUPENDRA THAKAR","BUY",{"v":77611,"d":"77,611"},163.55,"BSE"]
["2018-05-11",538476,"CTL","DEEPAK MITTAL","SELL",{"v":300000,"d":"300,000"},4.24,"BSE"]
["2018-05-11",541302,"DHRUV","JUROX ENTERPRISES PVT LTD","BUY",{"v":146000,"d":"146,000"},57.88,"BSE"]
["2018-05-11",541302,"DHRUV","AMKOR ENTERPRISES PVT LTD","BUY",{"v":150000,"d":"150,000"},57.91,"BSE"]
["2018-05-11",541302,"DHRUV","KETAN VALLABHDAS THAKKAR","SELL",{"v":272000,"d":"272,000"},58.03,"BSE"]
["2018-05-11",541299,"DLCL","NNM SECURITIES PVT LTD","SELL",{"v":20000,"d":"20,000"},25.75,"BSE"]
{"$rows_left_out":88}
{"sheet":"Call Tracker (Equity & F&O)","index":5,"n_rows":250,"n_cols":18,"rows_kept":250,"merged":[[35,0,36,0],[35,1,36,1]]}
[]
[]
[]
[]
[{"$nulls":12},"Back To Main Page"]
["Retail Research Technical Calls & Fundamental Performance Report for the month of May -2018 "]
[{"$nulls":12},{"$f":"Main!B10","v":"2017-05-14"}]
[null,"Positional  Call"]
["Sr.no","Date",null,"Company","Rec","Rec Price","Stop Loss***","Call Closed At","Target","Remark","Profit / Loss per Share","Gain / Loss  %","Status","Closed Date","NSE Closed Price"]
[1,"2018-02-12",null,"ITC","Buy",271.5,250,285,310,"Profit of Rs.13.5/-",{"$f":"H10-F10","v":13.5},{"$f":"K10/F10","v":{"v":0.049723756906077346,"d":"4.97%"}},"Successful","2018-05-02",{"$nulls":3},"P"]
[1,"2018-04-05",null,"RECLTD","Buy",129,122,121,140,"Loss of Rs.8/-",{"$f":"H11-F11","v":-8},{"$f":"K11/F11","v":{"v":-0.06201550387596899,"d":"-6.20%"}},"Unsuccessful","2018-05-10",{"$nulls":3},"R"]
[2,"2018-04-11",null,"FEDERALBNK","Buy",98.75,94,103.45,"106-109","Profit of Rs.4.7/-",{"$f":"H12-F12","v":4.700000000000003},{"$f":"K12/F12","v":{"v":0.04759493670886079,"d":"4.76%"}},"Successful","2019-05-09",{"$nulls":3},"R"]
[4,"2018-04-18",null,"BHEL","Buy$",{"$f":"(81+88.5)/2","v":84.75},79,null,100,"Open",{"$nulls":4},{"$f":"VLOOKUP(D13,Sheet2!$A$1:M2152,6,0)","v":80.65},null,null,"A"]
[5,"2018-04-20",null,"HINDZINC","Sell",325.5,340,314.5,"310-305","Profit of Rs.11/-",{"$f":"F14-H14","v":11},{"$f":"K14/F14","v":{"v":0.03379416282642089,"d":"3.38%"}},"Successful","2018-05-02",{"$nulls":3},"H"]
[6,"2018-04-26",null,"HCLTECH","Buy",1060,1018,1015,"1130-1150","Loss of Rs.45/-",{"$f":"H15-F15","v":-45},{"v":-0.04245283018867924,"d":"-4.25%"},"Unsuccessful","2018-05-02",{"$nulls":3},"H"]
[7,"2018-04-27",null,"PFC","Buy",85.8,82.5,89.45,"91-93","Profit of Rs.3.65/-",{"$f":"H16-F16","v":3.6500000000000057},{"v":0.042540792540792606,"d":"4.25%"},"Successful","2018-05-02",{"$nulls":3},"H"]
[8,"2018-04-30",null,"HEXAWARE","Sell",447,464,428.5,"410-400","Profit of Rs.18.5/-",{"$f":"F17-H17","v":18.5},{"v":0.04138702460850112,"d":"4.14%"},"Successful","2018-05-05",{"$nulls":3},"H"]
[9,"2018-05-04",null,"GLENMARK","Buy",544,520,513,"580-585","Loss of Rs.31/-",{"$f":"H18-F18","v":-31},{"v":-0.05698529411764706,"d":"-5.70%"},"Unsuccessful","2018-05-11",{"$nulls":3},"R"]
[10,"2018-05-04",null,"L&TFH","Buy",177.5,169,183.25,"190-195","Part Profit of Rs.5.75/-",{"$f":"H19-F19","v":5.75},{"v":0.0323943661971831,"d":"3.24%"},"Successful","2018-05-08",{"$nulls":3},"H"]
[11,"2018-05-04",null,"HCLTECH","Buy","920-930",890,null,"980-990","Open",{"$nulls":4},{"$f":"VLOOKUP(D20,Sheet2!$A$1:M2159,6,0)","v":932.85},null,null,"H"]
{"$rows_left_out":231}
{"sheet":"Call Tracker (Currency)","index":6,"n_rows":58,"n_cols":18,"rows_kept":58,"hidden":true,"merged":[[1,8,1,9],[2,8,2,9],[3,8,3,9],[4,8,4,9],[5,8,5,9],[6,8,6,9],[7,8,7,9],[8,8,8,9],[9,8,9,9],[10,8,10,9],[11,8,11,9],[12,8,12,9],[13,8,13,9],[14,8,14,9],[15,8,15,9],[16,8,16,9],[17,8,17,9],[18,8,18,9],[19,8,19,9],[20,8,20,9],[21,8,21,9],[22,8,22,9],[23,8,23,9],[24,8,24,9],[25,8,25,9],[26,8,26,9],[27,8,27,9],[28,8,28,9],[29,8,29,9],[30,8,30,9],[31,8,31,9],[32,8,32,9],[33,8,33,9],[34,8,34,9],[35,8,35,9],[36,8,36,9],[37,8,37,9],[38,8,38,9],[39,8,39,9],[40,8,40,9],[41,8,41,9],[42,8,42,9],[43,8,43,9],[44,8,44,9],[45,8,45,9],[46,8,46,9],[47,8,47,9],[48,8,48,9],[49,8,49,9],[50,8,50,9],[51,8,51,9],[52,8,52,9],[53,8,53,9],[54,8,54,9],[55,8,55,9],[56,8,56,9],[57,8,57,9],[58,8,58,9],[59,8,59,9],[60,8,60,9],[61,8,61,9],[62,8,62,9],[63,8,63,9],[64,8,64,9],[65,8,65,9],[66,8,66,9],[67,8,67,9],[68,8,68,9],[69,8,69,9],[70,8,70,9],[71,8,71,9],[72,8,72,9],[73,8,73,9],[74,8,74,9],[75,8,75,9],[76,8,76,9],[77,8,77,9],[78,8,78,9],[79,8,79,9],[80,8,80,9],[81,8,81,9],[82,8,82,9],[83,8,83,9],[84,8,84,9],[85,8,85,9],[86,8,86,9],[87,8,87,9],[88,8,88,9],[89,8,89,9],[90,8,90,9],[91,8,91,9],[92,8,92,9],[93,8,93,9],[94,8,94,9],[95,8,95,9],[96,8,96,9],[97,8,97,9],[98,8,98,9],[99,8,99,9],[100,8,100,9],[101,8,101,9],[102,8,102,9],[103,8,103,9],[104,8,104,9],[105,8,105,9],[106,8,106,9],[107,8,107,9],[108,8,108,9],[109,8,109,9],[110,8,110,9],[111,8,111,9],[112,8,112,9],[113,8,113,9],[114,8,114,9],[115,8,115,9],[116,8,116,9],[117,8,117,9],[118,8,118,9],[119,8,119,9],[120,8,120,9],[121,8,121,9],[122,8,122,9],[123,8,123,9],[124,8,124,9]]}
["Master Trade High Risk"]
["Sr.no","Date","Company","Rec","Rec Price","Stop Loss","Call Closed At","Target","Remark",null,"Profit / Loss per share","Gain / Loss  per Lot","Lot","Status","Closed Date"]
[1,"2017-05-08","USDINR MAY FUT","Buy",64.3935,64.29,64.66,64.59,"Profit of Rs.0.27/-",null,{"v":0.2664999999999935,"d":"0.27"},266.4999999999935,1000,"Successful","2017-05-09",null,null,"P"]
[2,"2017-05-08","USDINR JUN FUT","Buy",64.6535,64.45,64.965,65.05,"Profit of Rs 0.31/-",null,{"v":0.31150000000000944,"d":"0.31"},311.50000000000944,1000,"Successful","2017-05-09",null,null,"P"]
[3,"2017-05-09","EUROINR MAY FUT","Sell",70.65,70.8,70.07,70.4,"Profit of Rs 0.58/-",null,{"v":0.580000000000013,"d":"0.58"},580.00000000001,1000,"Successful","2017-05-12",null,null,"P"]
[4,"2017-05-09","GBPINR MAY FUT","Buy",83.774,83.37,83.37,84.77,"Loss of Rs 0.40/-",null,{"v":-0.40399999999999636,"d":"-0.40"},-403.99999999999636,1000,"Unsuccessful","2017-05-11",null,null,"P"]
[5,"2017-05-11","USDINR MAY FUT","Buy",64.6555,64.55,64.55,64.86,"Loss of Rs.0.1055/-",null,-0.10550000000000637,{"$f":"K7*M7","v":{"v":-105.50000000000637,"d":"-105.50"}},1000,"Unsuccessful","2017-05-11",null,null,"P"]
[6,"2017-05-15","USDINR MAY FUT","Buy",64.2275,64.08,64.46,64.48,"Profit of Rs 0.23/-",null,{"v":0.2324999999999875,"d":"0.23"},232.4999999999875,1000,"Successful","2017-05-18",null,null,"P"]
[7,"2017-05-19","USDINR MAY FUT","Sell",64.83,65,65,64.5,"Loss of Rs.0.17/-",null,{"v":-0.1700000000000017,"d":"-0.17"},-170.0000000000017,1000,"Unsuccessful","2017-05-19",null,null,"P"]
[8,"2017-05-23","USDINR MAY FUT","Buy",64.83,64.62,64.95,65.2,"Profit of Rs 0.12/-",null,{"v":0.12000000000000455,"d":"0.12"},120.00000000000455,1000,"Successful","2017-05-24",null,null,"P"]
[9,"2017-05-25","USDINR MAY FUT","Buy",64.57,64.25,64.56,65,"Loss of Rs.0.01/-",null,-0.009999999999990905,-9.999999999990905,1000,"Neutral","2017-05-29",null,null,"P"]
[10,"2017-05-30","USDINR JUN FUT","Buy",64.9125,64.71,64.71,65.31,"Loss of Rs.0.20/-",null,{"v":-0.20250000000000057,"d":"-0.20"},-202.50000000000057,1000,"Unsuccessful","2017-05-31",null,null,"P"]
[11,"2017-06-01","USDINR JUN FUT","Buy",64.655,64.45,64.45,65.05,"Loss of Rs.0.20/-",null,{"$f":"G13-E13","v":{"v":-0.2049999999999983,"d":"-0.20"}},{"$f":"K13*M13","v":-204.9999999999983},{"v":1000,"d":"1000.00"},"Unsuccessful","2017-06-08",null,null,"P"]
[12,"2017-06-12","USDINR JUN FUT","Buy",64.45,64,64.7625,65.2,"Profit of Rs 0.31/-",null,{"v":0.3125,"d":"0.31"},312.5,1000,"Successful","2017-06-16"]
[13,"2017-06-16","USDINR JUN FUT","Buy",64.51,64.2,64.7,65.11,"Profit of Rs 0.19/-",null,{"v":0.18999999999999773,"d":"0.19"},189.99999999999773,1000,"Successful","2017-06-21"]
[14,"2017-06-22","USDINR JUN FUT","Buy",64.56,64.2,64.2,65.1,"Loss of Rs.0.36/-",null,{"v":-0.35999999999999943,"d":"-0.36"},-359.99999999999943,{"v":1000,"d":"1000.00"},"Unsuccessful","2017-06-30"]
[15,"2017-07-10","USDINR JUL FUT","Buy",64.67,64.4,64.4,65.15,"Loss of Rs.0.27/-",null,{"v":-0.269999999999996,"d":"-0.27"},-269.999999999996,{"v":1000,"d":"1000.00"},"Unsuccessful","2017-07-31"]
[16,"2017-08-02","USDINR AUG FUT","Buy",64.235,63.98,63.98,64.75,"Loss of Rs.0.26/-",null,{"v":-0.25500000000000256,"d":"-0.26"},-255.00000000000256,{"v":1000,"d":"1000.00"},"Unsuccessful","2017-08-02"]
[17,"2017-08-08","USDINR AUG FUT","Buy",63.9425,63.6,64.15,64.5,"Profit of Rs 0.21/-",null,{"v":0.20750000000000313,"d":"0.21"},207.50000000000313,1000,"Successful","2017-08-10"]
[18,"2017-08-22","USDINR AUG FUT","Buy",64.1175,63.9,64.01,64.5,"Loss of Rs.0.11/-",null,{"$f":"G20-E20","v":{"v":-0.1075000000000017,"d":"-0.11"}},{"$f":"K20*M20","v":-107.5000000000017},{"v":1000,"d":"1000.00"},"Unsuccessful","2017-08-29"]
{"$rows_left_out":39}
{"sheet":"Sheet2","index":7,"n_rows":1639,"n_cols":14,"rows_kept":1639,"hidden":true}
["SYMBOL","SERIES","OPEN","HIGH","LOW","CLOSE","LAST","PREVCLOSE","TOTTRDQTY","TOTTRDVAL","TIMESTAMP","TOTALTRADES","ISIN","ISIN"]
["20MICRONS","EQ",46.1,47.2,45.05,45.35,45.05,46,73097,3348468.95,"2018-05-11",546,"INE144J01027"]
["21STCENMGM","EQ",41.9,42.7,41.25,41.25,41.25,41.9,1945,82421.75,"2018-05-11",12,"INE253B01015"]
["3IINFOTECH","EQ",4.45,4.45,4.15,4.35,4.4,4.35,3244886,13903294.3,"2018-05-11",4029,"INE748C01020"]
["3MINDIA","EQ",20350,20500,20300,20400.65,20400,20345.2,1104,22550174.35,"2018-05-11",469,"INE470A01017"]
["3PLAND","EQ",14,14,13.8,14,14,14,741,10286,"2018-05-11",9,"INE105C01023"]
["5PAISA","EQ",470,484,467.5,473.1,478,470.85,7659,3668729.95,"2018-05-11",432,"INE618L01018"]
["63MOONS","EQ",85.9,87.5,83.5,83.75,83.5,85.65,142666,12035383.75,"2018-05-11",2690,"INE111B01023"]
["8KMILES","EQ",684,694,671,679.3,675.6,680.15,92391,63233017.4,"2018-05-11",3617,"INE650K01021"]
["A2ZINFRA","EQ",23.45,23.45,21.7,22.55,22.3,22.95,527639,11703850.25,"2018-05-11",1805,"INE619I01012"]
["AARTIDRUGS","EQ",571.15,571.15,538.6,555.45,555.9,573,7510,4156441.3,"2018-05-11",425,"INE767A01016"]
["AARTIIND","EQ",1323.15,1335.55,1295,1326.9,1335.55,1323.15,12943,17134048.8,"2018-05-11",1536,"INE769A01020"]
["AARVEEDEN","EQ",42.4,43.95,42.4,42.95,43,43.1,11034,474594.5,"2018-05-11",68,"INE273D01019"]
["ABAN","EQ",170.15,170.4,166.1,166.75,166.65,169.85,454879,76332789.65,"2018-05-11",6159,"INE421A01028"]
["ABB","EQ",1275,1276,1235.3,1245.15,1238.9,1268.15,138565,174347242.65,"2018-05-11",2731,"INE117A01022"]
["ABBOTINDIA","EQ",6175.1,6379,6175.1,6341.2,6320,6254.1,8898,56198295.65,"2018-05-11",3759,"INE358A01014"]
["ABCAPITAL","EQ",155.05,155.5,150.7,151.4,151.15,154.7,1384798,211246131.85,"2018-05-11",15199,"INE674K01013"]
["ABFRL","EQ",145.85,159.4,144.15,150.6,148,144.75,4097756,620911593.55,"2018-05-11",24811,"INE647O01011"]
["ABMINTLTD","BE",23.75,23.75,23.75,23.75,23.75,25,181,4298.75,"2018-05-11",6,"INE251C01017"]
["ACC","EQ",1499,1499,1461.35,1466.55,1466,1493.85,361860,533373180.85,"2018-05-11",15955,"INE012A01025"]
{"$rows_left_out":1620}
{"sheet":"Sheet1","index":8,"n_rows":0,"n_cols":0,"rows_kept":0,"hidden":true}