{"text_format":"3","workbook":"xlsx","n_sheets":10,"sheets":["Main","Future Intra","Cash Intra","MidCap Intra","Bulk Deals","Call Tracker (Equity & F&O)","Call Tracker (Currency)","Sheet2","Sheet1","Sheet3"],"not_rendered":{"images":4,"defined_names":4},"read":"whole","date_system":"1900"}

{"sheet":"Main","index":0,"n_rows":17,"n_cols":4,"rows_kept":17}
[null,"                                                                                                 "]
{"$rows_empty":8}
[null,"2018-06-12"]
[]
[null,"Sheet No.","Template Name","Summary"]
[null,1,"Future Intra","For Intraday trading in F&O segment"]
[null,2,"Cash Intra","For Intraday trading in cash market segment"]
[null,3,"Mid-cap Intra","For Intraday trading in Mid-cap stocks"]
[null,4,"Bulk Deals","Reveals Bulk Deals carried on NSE & BSE"]
[null,5,"Call Tracker"]

{"sheet":"Future Intra","index":1,"n_rows":250,"n_cols":15,"rows_kept":250,"merged":[[8,0,9,0],[8,1,9,1],[8,2,9,2],[8,5,8,7],[8,8,8,10]]}
[]
[]
[]
[]
[{"$nulls":12},"Back to Main Page"]
["FOR INTRA DAY TRADING",{"$nulls":10},{"$f":"Main!B10","v":"2018-06-12"}]
[]
[]
["Sr.no","Sector","Scrip","CLOSE RATE","Pivot Point","Supports",null,null,"Resistances"]
[null,"Sector",null,"Point","Point","S1","S2","S3","R1","R2","R3","HIGH","LOW","OI","% Change in OI"]
[1,"Index","BANKNIFTY",{"v":26477,"d":"26477.00"},26520.75,26382.45,{"v":26287.9,"d":"26287.90"},{"v":26149.600000000002,"d":"26149.60"},{"v":26615.3,"d":"26615.30"},{"v":26753.600000000002,"d":"26753.60"},{"v":26848.149999999998,"d":"26848.15"},26659.05,26426.2,2647400,{"v":0.01308740241849074,"d":"1.31%"}]
[2,"Index","NIFTY",{"v":10785.8,"d":"10785.80"},{"v":10794.016666666666,"d":"10794.02"},{"v":10753.033333333333,"d":"10753.03"},{"v":10720.266666666666,"d":"10720.27"},{"v":10679.283333333333,"d":"10679.28"},{"v":10826.783333333333,"d":"10826.78"},{"v":10867.766666666666,"d":"10867.77"},{"v":10900.533333333333,"d":"10900.53"},10835,10761.25,24167025,{"v":0.03952241463855266,"d":"3.95%"}]
[3,"Index","NIFTYCPSE",2463.55,{"v":821.1833333333334,"d":"821.18"},{"v":1642.3666666666668,"d":"1642.37"},{"v":821.1833333333334,"d":"821.18"},{"v":1642.3666666666668,"d":"1642.37"},{"v":1642.3666666666668,"d":"1642.37"},{"v":821.1833333333334,"d":"821.18"},{"v":1642.3666666666668,"d":"1642.37"},0,0,0,{"v":0,"d":"0.00%"}]
[4,"Index","NIFTYINFRA",{"v":3389.3,"d":"3389.30"},{"v":1129.7666666666667,"d":"1129.77"},{"v":2259.5333333333333,"d":"2259.53"},{"v":1129.7666666666667,"d":"1129.77"},{"v":2259.5333333333333,"d":"2259.53"},{"v":2259.5333333333333,"d":"2259.53"},{"v":1129.7666666666667,"d":"1129.77"},{"v":2259.5333333333333,"d":"2259.53"},0,0,0,{"v":0,"d":"0.00%"}]
[5,"Index","NIFTYIT",{"v":13723,"d":"13723.00"},{"v":13716,"d":"13716.00"},{"v":13647,"d":"13647.00"},{"v":13571,"d":"13571.00"},{"v":13502,"d":"13502.00"},{"v":13792,"d":"13792.00"},{"v":13861,"d":"13861.00"},{"v":13937,"d":"13937.00"},13785,13640,41550,{"v":-0.005980861244019139,"d":"-0.60%"}]
[6,"Index","NIFTYMID50",{"v":5044,"d":"5044.00"},{"v":5044,"d":"5044.00"},{"v":5044,"d":"5044.00"},{"v":5044,"d":"5044.00"},{"v":5044,"d":"5044.00"},{"v":5044,"d":"5044.00"},{"v":5044,"d":"5044.00"},{"v":5044,"d":"5044.00"},5044,5044,591800,{"v":-3.3783783783783786E-4,"d":"-0.03%"}]
[7,"Index","NIFTYPSE",{"v":3915.3,"d":"3915.30"},{"v":1305.1000000000001,"d":"1305.10"},{"v":2610.2000000000003,"d":"2610.20"},{"v":1305.1000000000001,"d":"1305.10"},{"v":2610.2000000000003,"d":"2610.20"},{"v":2610.2000000000003,"d":"2610.20"},{"v":1305.1000000000001,"d":"1305.10"},{"v":2610.2000000000003,"d":"2610.20"},0,0,0,{"v":0,"d":"0.00%"}]
[8,"Cement","ACC",{"v":1322.8,"d":"1322.80"},1325.95,{"v":1308.9,"d":"1308.90"},{"v":1295,"d":"1295.00"},1277.95,{"v":1339.8500000000001,"d":"1339.85"},{"v":1356.8999999999999,"d":"1356.90"},{"v":1370.8000000000002,"d":"1370.80"},1343,1312.05,3260000,{"v":-0.025352786414733316,"d":"-2.54%"}]
[9,"Others","ADANIENT",{"v":128,"d":"128.00"},{"v":129.21666666666667,"d":"129.22"},{"v":125.53333333333333,"d":"125.53"},{"v":123.06666666666666,"d":"123.07"},{"v":119.38333333333333,"d":"119.38"},{"v":131.68333333333334,"d":"131.68"},{"v":135.36666666666667,"d":"135.37"},{"v":137.83333333333334,"d":"137.83"},132.9,126.75,12400000,{"v":-0.0531459987782529,"d":"-5.31%"}]
[10,"Others","ADANIPORTS",382.55,{"v":383.5333333333333,"d":"383.53"},{"v":379.16666666666663,"d":"379.17"},{"v":375.7833333333333,"d":"375.78"},{"v":371.41666666666663,"d":"371.42"},{"v":386.91666666666663,"d":"386.92"},{"v":391.2833333333333,"d":"391.28"},{"v":394.66666666666663,"d":"394.67"},387.9,380.15,12115000,{"v":-0.001236603462489695,"d":"-0.12%"}]
{"$rows_left_out":224}
{"sheet":"Cash Intra","index":2,"n_rows":248,"n_cols":13,"rows_kept":248,"merged":[[7,0,8,0],[7,1,8,1],[7,2,8,2],[7,3,8,3],[7,4,7,6],[7,7,7,9]]}
[]
[]
[]
[]
[{"$nulls":12},"Back to Main Page"]
["FOR INTRA DAY TRADING",{"$nulls":9},{"$f":"Main!B10","v":"2018-06-12"}]
[]
["Sr.no","Scrip","CLOSE RATE","Pivot Point","Supports",null,null,"Resistances"]
[null,null,"Point",null,"S1","S2","S3","R1","R2","R3","HIGH","LOW","Total Trade Quanity in Lakhs"]
[1,"Nifty 50",10786.95,10804.85,{"v":10759.150000000001,"d":"10759.15"},10731.35,{"v":10685.650000000001,"d":"10685.65"},{"v":10832.650000000001,"d":"10832.65"},{"v":10878.350000000002,"d":"10878.35"},{"v":10906.150000000001,"d":"10906.15"},10850.55,10777.05]
[2,"Nifty Bank",26453.55,{"v":26509.5,"d":"26509.50"},{"v":26366,"d":"26366.00"},26278.45,26134.95,26597.05,26740.55,{"v":26828.1,"d":"26828.10"},26653,26421.95]
[3,"Nifty CPSE",2388.5,{"v":2394.3333333333335,"d":"2394.33"},{"v":2378.016666666667,"d":"2378.02"},{"v":2367.5333333333333,"d":"2367.53"},{"v":2351.2166666666667,"d":"2351.22"},{"v":2404.816666666667,"d":"2404.82"},{"v":2421.1333333333337,"d":"2421.13"},{"v":2431.6166666666672,"d":"2431.62"},2410.65,2383.85]
[4,"Nifty Infra",3267.45,3272.25,3256.85,3246.25,3230.85,3282.85,{"v":3298.2499999999995,"d":"3298.25"},3308.85,3287.65,3261.65]
[5,"Nifty IT",13775.1,{"v":13800.050000000001,"d":"13800.05"},{"v":13730.550000000003,"d":"13730.55"},{"v":13686.000000000002,"d":"13686.00"},{"v":13616.500000000004,"d":"13616.50"},{"v":13844.600000000002,"d":"13844.60"},{"v":13914.099999999999,"d":"13914.10"},{"v":13958.650000000001,"d":"13958.65"},13869.55,13755.5]
[6,"Nifty PSE",3785.85,{"v":3792.1666666666665,"d":"3792.17"},{"v":3775.433333333333,"d":"3775.43"},{"v":3765.0166666666664,"d":"3765.02"},{"v":3748.283333333333,"d":"3748.28"},{"v":3802.583333333333,"d":"3802.58"},{"v":3819.3166666666666,"d":"3819.32"},{"v":3829.733333333333,"d":"3829.73"},3808.9,3781.75]
[7,"Nifty Midcap 50",5006.9,{"v":5020.766666666666,"d":"5020.77"},{"v":4985.533333333333,"d":"4985.53"},{"v":4964.166666666666,"d":"4964.17"},{"v":4928.9333333333325,"d":"4928.93"},{"v":5042.133333333333,"d":"5042.13"},{"v":5077.366666666667,"d":"5077.37"},{"v":5098.733333333334,"d":"5098.73"},5056,4999.4]
[8,"ABB",1249.35,{"v":1253.1333333333332,"d":"1253.13"},{"v":1226.2666666666664,"d":"1226.27"},{"v":1203.1833333333332,"d":"1203.18"},{"v":1176.3166666666664,"d":"1176.32"},{"v":1276.2166666666665,"d":"1276.22"},{"v":1303.0833333333333,"d":"1303.08"},{"v":1326.1666666666665,"d":"1326.17"},1280,1230.05,0.3618]
[9,"ACC",1320.2,{"v":1323.4333333333334,"d":"1323.43"},{"v":1308.0666666666668,"d":"1308.07"},{"v":1295.9333333333334,"d":"1295.93"},{"v":1280.5666666666668,"d":"1280.57"},{"v":1335.5666666666668,"d":"1335.57"},{"v":1350.9333333333336,"d":"1350.93"},{"v":1363.0666666666668,"d":"1363.07"},1338.8,1311.3,3.56878]
[10,"AIAENG",1548.2,{"v":1545.5666666666666,"d":"1545.57"},{"v":1526.1333333333332,"d":"1526.13"},{"v":1504.0666666666666,"d":"1504.07"},{"v":1484.6333333333332,"d":"1484.63"},{"v":1567.6333333333332,"d":"1567.63"},{"v":1587.0666666666666,"d":"1587.07"},{"v":1609.1333333333332,"d":"1609.13"},1565,1523.5,0.2207]
[11,"AUBANK",695.75,{"v":698.9166666666666,"d":"698.92"},{"v":688.8333333333333,"d":"688.83"},{"v":681.9166666666666,"d":"681.92"},{"v":671.8333333333333,"d":"671.83"},{"v":705.8333333333333,"d":"705.83"},{"v":715.9166666666665,"d":"715.92"},{"v":722.8333333333333,"d":"722.83"},709,692,3.40149]
{"$rows_left_out":229}
{"sheet":"MidCap Intra","index":3,"n_rows":511,"n_cols":13,"rows_kept":511,"merged":[[0,0,0,1],[8,0,9,0],[8,1,9,1],[8,2,9,2],[8,3,9,3],[8,4,8,6],[8,7,8,9]]}
[]
[]
[]
[]
[{"$nulls":11},"Back To Main Page"]
["FOR INTRA DAY TRADING",{"$nulls":9},{"$f":"Main!B10","v":"2018-06-12"}]
[null,null," "]
[]
["Sr.no","Scrip","CLOSE RATE","Pivot Point","Supports",null,null,"Resistances"]
[null,null,"Point",null,"S1","S2","S3","R1","R2","R3","HIGH","LOW","Total Trade Quanity in Lakhs"]
[1,"3MINDIA",19018,19091.95,{"v":18747.050000000003,"d":"18747.05"},{"v":18476.100000000002,"d":"18476.10"},{"v":18131.200000000004,"d":"18131.20"},{"v":19362.9,"d":"19362.90"},{"v":19707.800000000003,"d":"19707.80"},19978.75,19436.85,18821,0.01832]
[2,"8KMILES",528.8,{"v":538.6,"d":"538.60"},{"v":510.20000000000005,"d":"510.20"},{"v":491.6,"d":"491.60"},{"v":463.20000000000005,"d":"463.20"},{"v":557.2,"d":"557.20"},{"v":585.5999999999999,"d":"585.60"},{"v":604.2,"d":"604.20"},567,520,2.67992]
[3,"AARTIIND",1218.75,{"v":1207.3,"d":"1207.30"},{"v":1188.6999999999998,"d":"1188.70"},{"v":1158.6499999999999,"d":"1158.65"},{"v":1140.0499999999997,"d":"1140.05"},1237.35,{"v":1255.9499999999998,"d":"1255.95"},{"v":1286,"d":"1286.00"},1225.9,1177.25,0.1469]
[4,"ABAN",123.25,{"v":123.56666666666666,"d":"123.57"},{"v":121.93333333333332,"d":"121.93"},{"v":120.61666666666666,"d":"120.62"},{"v":118.98333333333332,"d":"118.98"},{"v":124.88333333333333,"d":"124.88"},{"v":126.51666666666665,"d":"126.52"},{"v":127.83333333333333,"d":"127.83"},125.2,122.25,7.53294]
[5,"ABB",1249.35,{"v":1253.1333333333332,"d":"1253.13"},{"v":1226.2666666666664,"d":"1226.27"},{"v":1203.1833333333332,"d":"1203.18"},{"v":1176.3166666666664,"d":"1176.32"},{"v":1276.2166666666665,"d":"1276.22"},{"v":1303.0833333333333,"d":"1303.08"},{"v":1326.1666666666665,"d":"1326.17"},1280,1230.05,0.3618]
[6,"ABCAPITAL",139.35,140.65,{"v":137.8,"d":"137.80"},136.25,{"v":133.4,"d":"133.40"},{"v":142.20000000000002,"d":"142.20"},{"v":145.04999999999998,"d":"145.05"},{"v":146.60000000000002,"d":"146.60"},143.5,139.1,24.03142]
[7,"ABFRL",138.85,{"v":139.83333333333334,"d":"139.83"},{"v":137.26666666666668,"d":"137.27"},{"v":135.68333333333334,"d":"135.68"},{"v":133.11666666666667,"d":"133.12"},{"v":141.41666666666669,"d":"141.42"},{"v":143.98333333333335,"d":"143.98"},{"v":145.5666666666667,"d":"145.57"},142.4,138.25,3.24611]
[8,"ACC",1320.2,{"v":1323.4333333333334,"d":"1323.43"},{"v":1308.0666666666668,"d":"1308.07"},{"v":1295.9333333333334,"d":"1295.93"},{"v":1280.5666666666668,"d":"1280.57"},{"v":1335.5666666666668,"d":"1335.57"},{"v":1350.9333333333336,"d":"1350.93"},{"v":1363.0666666666668,"d":"1363.07"},1338.8,1311.3,3.56878]
[9,"ADANIPORTS",382.3,{"v":383.3666666666666,"d":"383.37"},{"v":379.03333333333325,"d":"379.03"},{"v":375.76666666666665,"d":"375.77"},{"v":371.4333333333333,"d":"371.43"},{"v":386.6333333333332,"d":"386.63"},{"v":390.9666666666666,"d":"390.97"},{"v":394.2333333333332,"d":"394.23"},387.7,380.1,20.30226]
[10,"ADANIPOWER",19.55,{"v":19.6,"d":"19.60"},{"v":19.1,"d":"19.10"},18.65,18.15,{"v":20.050000000000004,"d":"20.05"},{"v":20.550000000000004,"d":"20.55"},{"v":21.000000000000007,"d":"21.00"},20.1,19.15,109.58826]
{"$rows_left_out":492}
{"sheet":"Bulk Deals","index":4,"n_rows":36,"n_cols":8,"rows_kept":36,"merged":[[4,0,4,1],[4,2,4,3],[6,1,6,2]]}
[" "]
[]
[]
[]
[]
[{"$nulls":4},"Back To Main Page"]
["Subject :","BULK DEAL",null,{"$f":"Main!B10","v":"2018-06-12"}]
[]
["Date","Scrip code","Scrip Name","Client Name","Buy / Sell","Quantity Traded","Trade Price / Wt.Avg.trade price","Exchange  "]
["2018-06-11",539042,"AGIIL","HAVELI INDIA LTD","SELL",{"v":100579,"d":"100,579"},105.52,"BSE"]
["2018-06-11",539042,"AGIIL","HAVELI INDIA LTD","BUY",{"v":54082,"d":"54,082"},124.37,"BSE"]
["2018-06-11",531494,"NAVBLDR","AVANI PARESH SHAH","BUY",{"v":114000,"d":"114,000"},28,"BSE"]
["2018-06-11",539526,"SCTL","MEHULKUMAR AMRUTBHAI RATHOD","SELL",{"v":30000,"d":"30,000"},53.06,"BSE"]
["2018-06-11",539526,"SCTL","MEHULKUMAR AMRUTBHAI RATHOD","BUY",{"v":30000,"d":"30,000"},52.95,"BSE"]
["2018-06-11",539526,"SCTL","SANJAY KAILASHCHANDRA PATODIA","BUY",{"v":30000,"d":"30,000"},53.06,"BSE"]
["2018-06-11",539526,"SCTL","CHANDAN MITRA","SELL",{"v":30000,"d":"30,000"},52.95,"BSE"]
["2018-06-11",539026,"SSPNFIN","JAYANTA BOSE","BUY",{"v":30000,"d":"30,000"},23,"BSE"]
["2018-06-11",539026,"SSPNFIN","DARSHANN KAYAN","SELL",{"v":30000,"d":"30,000"},23,"BSE"]
["2018-06-11","63MOONS","63 moons tech limited","BP FINTRADE PRIVATE LIMITED","BUY",{"v":241556,"d":"241,556"},87.19,"NSE"]
["2018-06-11","GRETEX","Gretex Industries Ltd.","SHREE BHUVANAKARAM TRADINVEST PVT LTD","BUY",{"v":90000,"d":"90,000"},16,"NSE"]
{"$rows_left_out":17}
{"sheet":"Call Tracker (Equity & F&O)","index":5,"n_rows":258,"n_cols":18,"rows_kept":258}
[]
[]
[]
[]
[{"$nulls":12},"Back To Main Page"]
["Retail Research Technical Calls & Fundamental Performance Report for the month of June -2018 "]
[{"$nulls":12},{"$f":"Main!B10","v":"2018-06-12"}]
[null,"Positional  Call"]
["Sr.no","Date",null,"Company","Rec","Rec Price","Stop Loss***","Call Closed At","Target","Remark","Profit / Loss per Share","Gain / Loss  %","Status","Closed Date","NSE Closed Price"]
[1,"2018-05-04",null,"HCLTECH","Buy",925,890,890,"980-990","Loss of Rs.35/-",{"$f":"H10-F10","v":{"v":-35,"d":"-35.00"}},{"$f":"K10/F10","v":{"v":-0.03783783783783784,"d":"-3.78%"}},"Unsuccessful","2018-06-05",{"$nulls":3},"H"]
[2,"2018-05-25",null,"MARUTI","Buy",8440,8190,{"$f":"(8640+8805)/2","v":8722.5},"8850-8900"," Profit of Rs.282.5/-",{"$f":"H11-F11","v":282.5},{"$f":"K11/F11","v":{"v":0.03347156398104265,"d":"3.35%"}},"Successful","2018-06-01",{"$nulls":3},"R"]
[3,"2018-05-29",null,"CHOLAFIN","Buy",1530,1460,1582.5,"1620-1640"," Profit of Rs.52.5/-",{"$f":"H12-F12","v":52.5},{"v":0.03431372549019608,"d":"3.43%"},"Successful","2018-06-01",{"$nulls":3},"R"]
[4,"2018-05-30",null,"HEXAWARE","Sell",447,465,434.5,"415-405"," Profit of Rs.12.5/-",{"$f":"F13-H13","v":12.5},{"v":0.02796420581655481,"d":"2.80%"},"Successful","2018-06-01",{"$nulls":3},"H"]
[5,"2018-05-30",null,"VEDL","Buy",248,237,258,"268-272"," Profit of Rs.10/-",{"$f":"H14-F14","v":10},{"$f":"K14/F14","v":{"v":0.04032258064516129,"d":"4.03%"}},"Successful","2018-06-01",{"$nulls":3},"R"]
[6,"2018-06-01",null,"ZEEL","Buy",557.5,539,538,"590-600","Loss of Rs.19.50/-",{"$f":"H15-F15","v":{"v":-19.5,"d":"-19.50"}},{"v":-0.03497757847533632,"d":"-3.50%"},"Unsuccessful","2018-06-06",{"$nulls":3},"H"]
[7,"2018-06-01",null,"UPL","Buy","700-704",668,null,"750-760","Open",{"$nulls":4},{"$f":"VLOOKUP(D16,Sheet2!$A$1:M2165,6,0)","v":699.3},null,null,"H"]
[8,"2018-06-04",null,"CROMPTON","Buy",221,209,228.5,"235-240"," Profit of Rs.7.5/-",{"$f":"H17-F17","v":7.5},{"$f":"K17/F17","v":{"v":0.033936651583710405,"d":"3.39%"}},"Successful","2018-06-07",{"$nulls":3},"R"]
[9,"2018-06-05",null,"TECHM ","Sell",708,728,686.25,"680-670"," Profit of Rs.21.75/-",{"$f":"F18-H18","v":21.75},{"$f":"K18/F18","v":{"v":0.03072033898305085,"d":"3.07%"}},"Successful","2018-06-06",{"$nulls":3},"H"]
[10,"2018-06-07",null,"PEL","Buy","2395-2400",2310,null,"2550-2570","Open",{"$nulls":4},{"$f":"VLOOKUP(D19,Sheet2!$A$1:M2168,6,0)","v":2414.5},null,null,"R"]
[11,"2018-06-08",null,"DIVISLAB","Buy","1050-1060",1005,null,"1150-1170","Open",{"$nulls":4},{"$f":"VLOOKUP(D20,Sheet2!$A$1:M2169,6,0)","v":1024.6},null,null,"R"]
{"$rows_left_out":217}
{"sheet":"Call Tracker (Currency)","index":6,"n_rows":58,"n_cols":18,"rows_kept":58,"hidden":true,"merged":[[1,8,1,9],[2,8,2,9],[3,8,3,9],[4,8,4,9],[5,8,5,9],[6,8,6,9],[7,8,7,9],[8,8,8,9],[9,8,9,9],[10,8,10,9],[11,8,11,9],[12,8,12,9],[13,8,13,9],[14,8,14,9],[15,8,15,9],[16,8,16,9],[17,8,17,9],[18,8,18,9],[19,8,19,9],[20,8,20,9],[21,8,21,9],[22,8,22,9],[23,8,23,9],[24,8,24,9],[25,8,25,9],[26,8,26,9],[27,8,27,9],[28,8,28,9],[29,8,29,9],[30,8,30,9],[31,8,31,9],[32,8,32,9],[33,8,33,9],[34,8,34,9],[35,8,35,9],[36,8,36,9],[37,8,37,9],[38,8,38,9],[39,8,39,9],[40,8,40,9],[41,8,41,9],[42,8,42,9],[43,8,43,9],[44,8,44,9],[45,8,45,9],[46,8,46,9],[47,8,47,9],[48,8,48,9],[49,8,49,9],[50,8,50,9],[51,8,51,9],[52,8,52,9],[53,8,53,9],[54,8,54,9],[55,8,55,9],[56,8,56,9],[57,8,57,9],[58,8,58,9],[59,8,59,9],[60,8,60,9],[61,8,61,9],[62,8,62,9],[63,8,63,9],[64,8,64,9],[65,8,65,9],[66,8,66,9],[67,8,67,9],[68,8,68,9],[69,8,69,9],[70,8,70,9],[71,8,71,9],[72,8,72,9],[73,8,73,9],[74,8,74,9],[75,8,75,9],[76,8,76,9],[77,8,77,9],[78,8,78,9],[79,8,79,9],[80,8,80,9],[81,8,81,9],[82,8,82,9],[83,8,83,9],[84,8,84,9],[85,8,85,9],[86,8,86,9],[87,8,87,9],[88,8,88,9],[89,8,89,9],[90,8,90,9],[91,8,91,9],[92,8,92,9],[93,8,93,9],[94,8,94,9],[95,8,95,9],[96,8,96,9],[97,8,97,9],[98,8,98,9],[99,8,99,9],[100,8,100,9],[101,8,101,9],[102,8,102,9],[103,8,103,9],[104,8,104,9],[105,8,105,9],[106,8,106,9],[107,8,107,9],[108,8,108,9],[109,8,109,9],[110,8,110,9],[111,8,111,9],[112,8,112,9],[113,8,113,9],[114,8,114,9],[115,8,115,9],[116,8,116,9],[117,8,117,9],[118,8,118,9],[119,8,119,9],[120,8,120,9],[121,8,121,9],[122,8,122,9],[123,8,123,9],[124,8,124,9]]}
["Master Trade High Risk"]
["Sr.no","Date","Company","Rec","Rec Price","Stop Loss","Call Closed At","Target","Remark",null,"Profit / Loss per share","Gain / Loss  per Lot","Lot","Status","Closed Date"]
[1,"2017-05-08","USDINR MAY FUT","Buy",64.3935,64.29,64.66,64.59,"Profit of Rs.0.27/-",null,{"v":0.2664999999999935,"d":"0.27"},266.4999999999935,1000,"Successful","2017-05-09",null,null,"P"]
[2,"2017-05-08","USDINR JUN FUT","Buy",64.6535,64.45,64.965,65.05,"Profit of Rs 0.31/-",null,{"v":0.31150000000000944,"d":"0.31"},311.50000000000944,1000,"Successful","2017-05-09",null,null,"P"]
[3,"2017-05-09","EUROINR MAY FUT","Sell",70.65,70.8,70.07,70.4,"Profit of Rs 0.58/-",null,{"v":0.580000000000013,"d":"0.58"},580.00000000001,1000,"Successful","2017-05-12",null,null,"P"]
[4,"2017-05-09","GBPINR MAY FUT","Buy",83.774,83.37,83.37,84.77,"Loss of Rs 0.40/-",null,{"v":-0.40399999999999636,"d":"-0.40"},-403.99999999999636,1000,"Unsuccessful","2017-05-11",null,null,"P"]
[5,"2017-05-11","USDINR MAY FUT","Buy",64.6555,64.55,64.55,64.86,"Loss of Rs.0.1055/-",null,-0.10550000000000637,{"$f":"K7*M7","v":{"v":-105.50000000000637,"d":"-105.50"}},1000,"Unsuccessful","2017-05-11",null,null,"P"]
[6,"2017-05-15","USDINR MAY FUT","Buy",64.2275,64.08,64.46,64.48,"Profit of Rs 0.23/-",null,{"v":0.2324999999999875,"d":"0.23"},232.4999999999875,1000,"Successful","2017-05-18",null,null,"P"]
[7,"2017-05-19","USDINR MAY FUT","Sell",64.83,65,65,64.5,"Loss of Rs.0.17/-",null,{"v":-0.1700000000000017,"d":"-0.17"},-170.0000000000017,1000,"Unsuccessful","2017-05-19",null,null,"P"]
[8,"2017-05-23","USDINR MAY FUT","Buy",64.83,64.62,64.95,65.2,"Profit of Rs 0.12/-",null,{"v":0.12000000000000455,"d":"0.12"},120.00000000000455,1000,"Successful","2017-05-24",null,null,"P"]
[9,"2017-05-25","USDINR MAY FUT","Buy",64.57,64.25,64.56,65,"Loss of Rs.0.01/-",null,-0.009999999999990905,-9.999999999990905,1000,"Neutral","2017-05-29",null,null,"P"]
[10,"2017-05-30","USDINR JUN FUT","Buy",64.9125,64.71,64.71,65.31,"Loss of Rs.0.20/-",null,{"v":-0.20250000000000057,"d":"-0.20"},-202.50000000000057,1000,"Unsuccessful","2017-05-31",null,null,"P"]
[11,"2017-06-01","USDINR JUN FUT","Buy",64.655,64.45,64.45,65.05,"Loss of Rs.0.20/-",null,{"$f":"G13-E13","v":{"v":-0.2049999999999983,"d":"-0.20"}},{"$f":"K13*M13","v":-204.9999999999983},{"v":1000,"d":"1000.00"},"Unsuccessful","2017-06-08",null,null,"P"]
[12,"2017-06-12","USDINR JUN FUT","Buy",64.45,64,64.7625,65.2,"Profit of Rs 0.31/-",null,{"v":0.3125,"d":"0.31"},312.5,1000,"Successful","2017-06-16"]
[13,"2017-06-16","USDINR JUN FUT","Buy",64.51,64.2,64.7,65.11,"Profit of Rs 0.19/-",null,{"v":0.18999999999999773,"d":"0.19"},189.99999999999773,1000,"Successful","2017-06-21"]
[14,"2017-06-22","USDINR JUN FUT","Buy",64.56,64.2,64.2,65.1,"Loss of Rs.0.36/-",null,{"v":-0.35999999999999943,"d":"-0.36"},-359.99999999999943,{"v":1000,"d":"1000.00"},"Unsuccessful","2017-06-30"]
[15,"2017-07-10","USDINR JUL FUT","Buy",64.67,64.4,64.4,65.15,"Loss of Rs.0.27/-",null,{"v":-0.269999999999996,"d":"-0.27"},-269.999999999996,{"v":1000,"d":"1000.00"},"Unsuccessful","2017-07-31"]
[16,"2017-08-02","USDINR AUG FUT","Buy",64.235,63.98,63.98,64.75,"Loss of Rs.0.26/-",null,{"v":-0.25500000000000256,"d":"-0.26"},-255.00000000000256,{"v":1000,"d":"1000.00"},"Unsuccessful","2017-08-02"]
[17,"2017-08-08","USDINR AUG FUT","Buy",63.9425,63.6,64.15,64.5,"Profit of Rs 0.21/-",null,{"v":0.20750000000000313,"d":"0.21"},207.50000000000313,1000,"Successful","2017-08-10"]
[18,"2017-08-22","USDINR AUG FUT","Buy",64.1175,63.9,64.01,64.5,"Loss of Rs.0.11/-",null,{"$f":"G20-E20","v":{"v":-0.1075000000000017,"d":"-0.11"}},{"$f":"K20*M20","v":-107.5000000000017},{"v":1000,"d":"1000.00"},"Unsuccessful","2017-08-29"]
{"$rows_left_out":39}
{"sheet":"Sheet2","index":7,"n_rows":1646,"n_cols":14,"rows_kept":1646,"hidden":true}
["SYMBOL","SERIES","OPEN","HIGH","LOW","CLOSE","LAST","PREVCLOSE","TOTTRDQTY","TOTTRDVAL","TIMESTAMP","TOTALTRADES","ISIN","ISIN"]
["20MICRONS","EQ",40.5,41.7,39.55,40.1,39.65,40.15,82676,3374617.25,"2018-06-11",823,"INE144J01027"]
["21STCENMGM","EQ",36.7,36.7,36.7,36.7,36.7,36,1459,53545.3,"2018-06-11",13,"INE253B01015"]
["3IINFOTECH","EQ",4.85,4.9,4.65,4.7,4.7,4.85,1032606,4935959.35,"2018-06-11",761,"INE748C01020"]
["3MINDIA","EQ",18821,19436.85,18821,19018,19040,18944.5,1832,34915848.55,"2018-06-11",486,"INE470A01017"]
["3PLAND","EQ",13,14.1,13,14.1,14.1,13.4,4833,67019.35,"2018-06-11",23,"INE105C01023"]
["5PAISA","EQ",385.05,394.3,376,377.3,376,384.05,3924,1511048.1,"2018-06-11",271,"INE618L01018"]
["63MOONS","EQ",74.15,87.65,74.15,87.5,87.65,73.05,3471612,295465978.8,"2018-06-11",23199,"INE111B01023"]
["8KMILES","EQ",556.8,567,520,528.8,521.5,551.7,267992,147683778.55,"2018-06-11",10488,"INE650K01021"]
["A2ZINFRA","EQ",22.6,23.4,22,22.75,22.8,22.65,376235,8568448.55,"2018-06-11",1599,"INE619I01012"]
["AARTIDRUGS","EQ",519.95,532,517.55,521.05,518,520.05,5826,3053474.7,"2018-06-11",592,"INE767A01016"]
["AARTIIND","EQ",1187.9,1225.9,1177.25,1218.75,1220,1173.6,14690,17778605,"2018-06-11",1338,"INE769A01020"]
["AARVEEDEN","EQ",34,37.8,33.6,34.9,34.75,34.3,39148,1402267.95,"2018-06-11",258,"INE273D01019"]
["ABAN","EQ",122.95,125.2,122.25,123.25,123,122.35,753294,93079317.2,"2018-06-11",8596,"INE421A01028"]
["ABB","EQ",1250,1280,1230.05,1249.35,1248,1248.95,36180,45374894.25,"2018-06-11",4599,"INE117A01022"]
["ABBOTINDIA","EQ",6420,6420,6326.95,6351,6350,6365.4,10523,66916153.9,"2018-06-11",1469,"INE358A01014"]
["ABCAPITAL","EQ",141.65,143.5,139.1,139.35,139.3,140.8,2403142,338959074.65,"2018-06-11",23049,"INE674K01013"]
["ABFRL","EQ",140.05,142.4,138.25,138.85,138.55,139.2,324611,45549848.55,"2018-06-11",3528,"INE647O01011"]
["ABMINTLTD","BE",22.65,22.65,22.65,22.65,22.65,22.65,50,1132.5,"2018-06-11",1,"INE251C01017"]
["ACC","EQ",1315.9,1338.8,1311.3,1320.2,1319.7,1315.1,356878,474274314.6,"2018-06-11",22515,"INE012A01025"]
{"$rows_left_out":1627}
{"sheet":"Sheet1","index":8,"n_rows":0,"n_cols":0,"rows_kept":0,"hidden":true}

{"sheet":"Sheet3","index":9,"n_rows":0,"n_cols":0,"rows_kept":0,"hidden":true}