{"text_format":"3","workbook":"xlsx","n_sheets":9,"sheets":["Main","Future Intra","Cash Intra","MidCap Intra","Bulk Deals","Call Tracker (Equity & F&O)","Sheet2","Sheet1","Sheet3"],"not_rendered":{"images":4,"defined_names":4},"read":"whole","date_system":"1900"}

{"sheet":"Main","index":0,"n_rows":17,"n_cols":4,"rows_kept":17}
[null,"                                                                                                 "]
{"$rows_empty":8}
[null,"2019-02-12"]
[]
[null,"Sheet No.","Template Name","Summary"]
[null,1,"Future Intra","For Intraday trading in F&O segment"]
[null,2,"Cash Intra","For Intraday trading in cash market segment"]
[null,3,"Mid-cap Intra","For Intraday trading in Mid-cap stocks"]
[null,4,"Bulk Deals","Reveals Bulk Deals carried on NSE & BSE"]
[null,5,"Call Tracker"]

{"sheet":"Future Intra","index":1,"n_rows":239,"n_cols":15,"rows_kept":239,"merged":[[8,0,9,0],[8,1,9,1],[8,2,9,2],[8,5,8,7],[8,8,8,10]]}
[]
[]
[]
[]
[{"$nulls":12},"Back to Main Page"]
["FOR INTRA DAY TRADING",{"$nulls":10},{"$f":"Main!B10","v":"2019-02-12"}]
[]
[]
["Sr.no","Sector","Scrip","CLOSE RATE","Pivot Point","Supports",null,null,"Resistances"]
[null,"Sector",null,"Point","Point","S1","S2","S3","R1","R2","R3","HIGH","LOW","OI","% Change in OI"]
[1,"Index","BANKNIFTY",{"v":27295.9,"d":"27295.90"},{"v":27284.683333333334,"d":"27284.68"},{"v":27219.416666666668,"d":"27219.42"},{"v":27142.933333333334,"d":"27142.93"},{"v":27077.666666666668,"d":"27077.67"},{"v":27361.166666666668,"d":"27361.17"},{"v":27426.43333333333,"d":"27426.43"},{"v":27502.916666666668,"d":"27502.92"},27349.95,27208.2,1709840,{"v":-0.02681905108824333,"d":"-2.68%"}]
[2,"Index","NIFTY",{"v":10909.6,"d":"10909.60"},{"v":10908.533333333333,"d":"10908.53"},{"v":10871.166666666666,"d":"10871.17"},{"v":10832.733333333334,"d":"10832.73"},{"v":10795.366666666667,"d":"10795.37"},{"v":10946.966666666665,"d":"10946.97"},{"v":10984.333333333334,"d":"10984.33"},{"v":11022.766666666665,"d":"11022.77"},10945.9,10870.1,23585625,{"v":0.03561208057669572,"d":"3.56%"}]
[3,"Index","NIFTYIT",{"v":16153,"d":"16153.00"},{"v":16122.666666666666,"d":"16122.67"},{"v":16041.333333333332,"d":"16041.33"},{"v":15929.666666666666,"d":"15929.67"},{"v":15848.333333333332,"d":"15848.33"},{"v":16234.333333333332,"d":"16234.33"},{"v":16315.666666666664,"d":"16315.67"},{"v":16427.333333333332,"d":"16427.33"},16204,16011,36850,{"v":0.08702064896755163,"d":"8.70%"}]
[4,"Cement","ACC",{"v":1372.7,"d":"1372.70"},{"v":1381.5500000000002,"d":"1381.55"},{"v":1359.9500000000003,"d":"1359.95"},{"v":1347.2,"d":"1347.20"},{"v":1325.6000000000001,"d":"1325.60"},{"v":1394.3000000000004,"d":"1394.30"},{"v":1415.9000000000003,"d":"1415.90"},{"v":1428.6500000000005,"d":"1428.65"},1403.15,1368.8,2219200,{"v":-0.015788540003547985,"d":"-1.58%"}]
[5,"Others","ADANIENT",{"v":119.2,"d":"119.20"},{"v":119.51666666666665,"d":"119.52"},{"v":116.2833333333333,"d":"116.28"},{"v":113.36666666666665,"d":"113.37"},{"v":110.1333333333333,"d":"110.13"},{"v":122.43333333333331,"d":"122.43"},{"v":125.66666666666666,"d":"125.67"},{"v":128.58333333333331,"d":"128.58"},122.75,116.6,42768000,{"v":-0.00963319748054835,"d":"-0.96%"}]
[6,"Others","ADANIPORTS",{"v":329.6,"d":"329.60"},{"v":327.7166666666667,"d":"327.72"},{"v":321.08333333333337,"d":"321.08"},{"v":312.56666666666666,"d":"312.57"},{"v":305.93333333333334,"d":"305.93"},{"v":336.2333333333334,"d":"336.23"},{"v":342.86666666666673,"d":"342.87"},{"v":351.38333333333344,"d":"351.38"},334.35,319.2,26245000,{"v":0.01410355486862442,"d":"1.41%"}]
[7,"Power","ADANIPOWER",34.75,{"v":34.8,"d":"34.80"},{"v":33.24999999999999,"d":"33.25"},{"v":31.749999999999993,"d":"31.75"},{"v":30.19999999999999,"d":"30.20"},{"v":36.3,"d":"36.30"},{"v":37.85000000000001,"d":"37.85"},39.35,36.35,33.3,158540000,{"v":0.014201637666325486,"d":"1.42%"}]
[8,"Pharma","AJANTPHARM",{"v":984.4,"d":"984.40"},{"v":969.7666666666668,"d":"969.77"},{"v":948.6333333333336,"d":"948.63"},{"v":912.8666666666668,"d":"912.87"},{"v":891.7333333333336,"d":"891.73"},{"v":1005.5333333333335,"d":"1005.53"},{"v":1026.6666666666667,"d":"1026.67"},{"v":1062.4333333333334,"d":"1062.43"},990.9,934,932000,{"v":-0.07859614434008898,"d":"-7.86%"}]
[9,"Banking","ALBK",36.85,{"v":37.4,"d":"37.40"},{"v":35.8,"d":"35.80"},34.75,33.15,{"v":38.449999999999996,"d":"38.45"},{"v":40.050000000000004,"d":"40.05"},{"v":41.099999999999994,"d":"41.10"},39,36.35,23205000,{"v":0.0851063829787234,"d":"8.51%"}]
[10,"Automobile","AMARAJABAT",742.85,{"v":744.6166666666667,"d":"744.62"},{"v":735.2333333333333,"d":"735.23"},{"v":727.6166666666667,"d":"727.62"},{"v":718.2333333333333,"d":"718.23"},{"v":752.2333333333333,"d":"752.23"},{"v":761.6166666666668,"d":"761.62"},{"v":769.2333333333333,"d":"769.23"},754,737,1098300,{"v":0.02214983713355049,"d":"2.21%"}]
{"$rows_left_out":210}
{"sheet":"Cash Intra","index":2,"n_rows":247,"n_cols":13,"rows_kept":247,"merged":[[7,0,8,0],[7,1,8,1],[7,2,8,2],[7,3,8,3],[7,4,7,6],[7,7,7,9]]}
[]
[]
[]
[]
[{"$nulls":12},"Back to Main Page"]
["FOR INTRA DAY TRADING",{"$nulls":9},{"$f":"Main!B10","v":"2019-02-12"}]
[]
["Sr.no","Scrip","CLOSE RATE","Pivot Point","Supports",null,null,"Resistances"]
[null,null,"Point",null,"S1","S2","S3","R1","R2","R3","HIGH","LOW","Total Trade Quanity in Lakhs"]
[1,"Nifty 50",10888.8,{"v":10892.266666666665,"d":"10892.27"},{"v":10853.63333333333,"d":"10853.63"},{"v":10818.466666666665,"d":"10818.47"},{"v":10779.83333333333,"d":"10779.83"},{"v":10927.433333333329,"d":"10927.43"},{"v":10966.066666666664,"d":"10966.07"},{"v":11001.233333333328,"d":"11001.23"},10930.9,10857.1]
[2,"Nifty Bank",27227.8,{"v":27228.416666666668,"d":"27228.42"},{"v":27150.933333333334,"d":"27150.93"},{"v":27074.066666666666,"d":"27074.07"},{"v":26996.583333333332,"d":"26996.58"},{"v":27305.283333333336,"d":"27305.28"},{"v":27382.766666666666,"d":"27382.77"},{"v":27459.63333333334,"d":"27459.63"},27305.9,27151.55]
[3,"Nifty CPSE",1910.8,{"v":1911.4166666666667,"d":"1911.42"},{"v":1892.3833333333334,"d":"1892.38"},{"v":1873.9666666666667,"d":"1873.97"},{"v":1854.9333333333334,"d":"1854.93"},{"v":1929.8333333333335,"d":"1929.83"},{"v":1948.8666666666668,"d":"1948.87"},{"v":1967.2833333333335,"d":"1967.28"},1930.45,1893]
[4,"Nifty Infra",2861.2,{"v":2855.7166666666667,"d":"2855.72"},{"v":2828.7333333333336,"d":"2828.73"},{"v":2796.266666666667,"d":"2796.27"},{"v":2769.2833333333338,"d":"2769.28"},{"v":2888.1833333333334,"d":"2888.18"},{"v":2915.166666666666,"d":"2915.17"},{"v":2947.633333333333,"d":"2947.63"},2882.7,2823.25]
[5,"Nifty IT",16099.05,{"v":16086.866666666667,"d":"16086.87"},{"v":16014.683333333334,"d":"16014.68"},{"v":15930.316666666668,"d":"15930.32"},{"v":15858.133333333335,"d":"15858.13"},{"v":16171.233333333334,"d":"16171.23"},{"v":16243.416666666664,"d":"16243.42"},{"v":16327.783333333333,"d":"16327.78"},16159.05,16002.5]
[6,"Nifty PSE",3103.4,{"v":3099.433333333333,"d":"3099.43"},{"v":3076.116666666666,"d":"3076.12"},{"v":3048.833333333333,"d":"3048.83"},{"v":3025.516666666666,"d":"3025.52"},{"v":3126.716666666666,"d":"3126.72"},{"v":3150.0333333333324,"d":"3150.03"},{"v":3177.3166666666657,"d":"3177.32"},3122.75,3072.15]
[7,"Nifty Midcap 50",4492.1,{"v":4512.683333333333,"d":"4512.68"},{"v":4460.816666666667,"d":"4460.82"},{"v":4429.533333333333,"d":"4429.53"},{"v":4377.666666666666,"d":"4377.67"},{"v":4543.966666666667,"d":"4543.97"},{"v":4595.833333333334,"d":"4595.83"},{"v":4627.116666666668,"d":"4627.12"},4564.55,4481.4]
[8,"ABB",1233.8,{"v":1238.9333333333334,"d":"1238.93"},{"v":1215.8666666666668,"d":"1215.87"},{"v":1197.9333333333334,"d":"1197.93"},{"v":1174.8666666666668,"d":"1174.87"},{"v":1256.8666666666668,"d":"1256.87"},{"v":1279.9333333333334,"d":"1279.93"},{"v":1297.8666666666668,"d":"1297.87"},1262,1221,0.50593]
[9,"ACC",1368.3,{"v":1377.3833333333332,"d":"1377.38"},{"v":1355.3166666666664,"d":"1355.32"},{"v":1342.3333333333333,"d":"1342.33"},{"v":1320.2666666666664,"d":"1320.27"},{"v":1390.3666666666663,"d":"1390.37"},{"v":1412.433333333333,"d":"1412.43"},{"v":1425.4166666666663,"d":"1425.42"},1399.45,1364.4,11.33028]
[10,"AIAENG",1667.95,{"v":1663.8333333333333,"d":"1663.83"},{"v":1643.1166666666666,"d":"1643.12"},{"v":1618.2833333333333,"d":"1618.28"},{"v":1597.5666666666666,"d":"1597.57"},{"v":1688.6666666666665,"d":"1688.67"},{"v":1709.3833333333332,"d":"1709.38"},{"v":1734.2166666666665,"d":"1734.22"},1684.55,1639,0.63615]
[11,"AUBANK",588.95,{"v":586.4333333333333,"d":"586.43"},{"v":579.0666666666666,"d":"579.07"},{"v":569.1833333333333,"d":"569.18"},{"v":561.8166666666666,"d":"561.82"},{"v":596.3166666666666,"d":"596.32"},{"v":603.6833333333332,"d":"603.68"},{"v":613.5666666666666,"d":"613.57"},593.8,576.55,1.10178]
{"$rows_left_out":228}
{"sheet":"MidCap Intra","index":3,"n_rows":510,"n_cols":13,"rows_kept":510,"merged":[[0,0,0,1],[8,0,9,0],[8,1,9,1],[8,2,9,2],[8,3,9,3],[8,4,8,6],[8,7,8,9]]}
[]
[]
[]
[]
[{"$nulls":11},"Back To Main Page"]
["FOR INTRA DAY TRADING",{"$nulls":9},{"$f":"Main!B10","v":"2019-02-12"}]
[null,null," "]
[]
["Sr.no","Scrip","CLOSE RATE","Pivot Point","Supports",null,null,"Resistances"]
[null,null,"Point",null,"S1","S2","S3","R1","R2","R3","HIGH","LOW","Total Trade Quanity in Lakhs"]
[1,"3MINDIA",21619.2,{"v":21531.833333333332,"d":"21531.83"},{"v":21288.666666666664,"d":"21288.67"},{"v":20958.13333333333,"d":"20958.13"},{"v":20714.966666666664,"d":"20714.97"},{"v":21862.366666666665,"d":"21862.37"},{"v":22105.53333333333,"d":"22105.53"},{"v":22436.066666666666,"d":"22436.07"},21775,21201.3,0.01734]
[2,"8KMILES",111,{"v":112.46666666666665,"d":"112.47"},{"v":106.93333333333331,"d":"106.93"},{"v":102.86666666666666,"d":"102.87"},{"v":97.33333333333331,"d":"97.33"},{"v":116.5333333333333,"d":"116.53"},{"v":122.06666666666663,"d":"122.07"},{"v":126.1333333333333,"d":"126.13"},118,108.4,1.50448]
[3,"AARTIIND",1541.65,{"v":1548.5833333333333,"d":"1548.58"},{"v":1523.1666666666665,"d":"1523.17"},{"v":1504.6833333333332,"d":"1504.68"},{"v":1479.2666666666664,"d":"1479.27"},{"v":1567.0666666666666,"d":"1567.07"},{"v":1592.4833333333331,"d":"1592.48"},{"v":1610.9666666666667,"d":"1610.97"},1574,1530.1,0.60601]
[4,"ABAN",49.3,{"v":49.88333333333333,"d":"49.88"},{"v":47.916666666666664,"d":"47.92"},{"v":46.53333333333333,"d":"46.53"},{"v":44.56666666666666,"d":"44.57"},{"v":51.266666666666666,"d":"51.27"},{"v":53.233333333333334,"d":"53.23"},{"v":54.61666666666667,"d":"54.62"},51.85,48.5,4.52183]
[5,"ABB",1233.8,{"v":1238.9333333333334,"d":"1238.93"},{"v":1215.8666666666668,"d":"1215.87"},{"v":1197.9333333333334,"d":"1197.93"},{"v":1174.8666666666668,"d":"1174.87"},{"v":1256.8666666666668,"d":"1256.87"},{"v":1279.9333333333334,"d":"1279.93"},{"v":1297.8666666666668,"d":"1297.87"},1262,1221,0.50593]
[6,"ABCAPITAL",79.1,{"v":80.13333333333333,"d":"80.13"},{"v":77.96666666666665,"d":"77.97"},{"v":76.83333333333333,"d":"76.83"},{"v":74.66666666666666,"d":"74.67"},{"v":81.26666666666665,"d":"81.27"},{"v":83.43333333333334,"d":"83.43"},{"v":84.56666666666665,"d":"84.57"},82.3,79,15.39262]
[7,"ABFRL",211.1,210.85,{"v":209.7,"d":"209.70"},{"v":208.29999999999998,"d":"208.30"},{"v":207.14999999999998,"d":"207.15"},212.25,{"v":213.40000000000003,"d":"213.40"},{"v":214.8,"d":"214.80"},212,209.45,5.86752]
[8,"ACC",1368.3,{"v":1377.3833333333332,"d":"1377.38"},{"v":1355.3166666666664,"d":"1355.32"},{"v":1342.3333333333333,"d":"1342.33"},{"v":1320.2666666666664,"d":"1320.27"},{"v":1390.3666666666663,"d":"1390.37"},{"v":1412.433333333333,"d":"1412.43"},{"v":1425.4166666666663,"d":"1425.42"},1399.45,1364.4,11.33028]
[9,"ADANIPORTS",328.8,327.05,{"v":320.15000000000003,"d":"320.15"},{"v":311.5,"d":"311.50"},{"v":304.6,"d":"304.60"},{"v":335.70000000000005,"d":"335.70"},{"v":342.6,"d":"342.60"},{"v":351.25000000000006,"d":"351.25"},333.95,318.4,37.83848]
[10,"ADANIPOWER",34.7,{"v":34.73333333333333,"d":"34.73"},{"v":33.316666666666656,"d":"33.32"},{"v":31.93333333333333,"d":"31.93"},{"v":30.51666666666666,"d":"30.52"},{"v":36.11666666666665,"d":"36.12"},{"v":37.533333333333324,"d":"37.53"},{"v":38.91666666666665,"d":"38.92"},36.15,33.35,117.90819]
{"$rows_left_out":491}
{"sheet":"Bulk Deals","index":4,"n_rows":61,"n_cols":8,"rows_kept":61,"merged":[[4,0,4,1],[4,2,4,3],[6,1,6,2]]}
[" "]
[]
[]
[]
[]
[{"$nulls":4},"Back To Main Page"]
["Subject :","BULK DEAL",null,{"$f":"Main!B10","v":"2019-02-12"}]
[]
["Date","Scrip code","Scrip Name","Client Name","Buy / Sell","Quantity Traded","Trade Price / Wt.Avg.trade price","Exchange  "]
["2019-02-11",540024,"ASHARI","NIKHIL GULABCHAND SHAH","BUY",{"v":64402,"d":"64,402"},5.73,"BSE"]
["2019-02-11",530187,"ATHARVENT","TRUSHA PRANAY MEHTA","BUY",{"v":3814,"d":"3,814"},2.83,"BSE"]
["2019-02-11",530187,"ATHARVENT","TRUSHA PRANAY MEHTA","SELL",151046,2.81,"BSE"]
["2019-02-11",530187,"ATHARVENT","NISHA KIRTIKUMAR GANDHI","BUY",89000,2.81,"BSE"]
["2019-02-11",532674,"BASML","SHANKAR RESOURCES PVT LTD","SELL",355697,165,"BSE"]
["2019-02-11",532674,"BASML","JEWELS ADVISORY SERVICES LLP","BUY",235000,165,"BSE"]
["2019-02-11",537766,"BCP","ACHINTYA SECURITIES PVT. LTD.","BUY",421196,40.87,"BSE"]
["2019-02-11",537766,"BCP","ACHINTYA SECURITIES PVT. LTD.","SELL",413275,39.83,"BSE"]
["2019-02-11",530871,"CHEMBOND","ASHWIN RATILAL NAGARWADIA","SELL",83760,311.83,"BSE"]
["2019-02-11",505576,"GOLDCORP","ANUPA TANNA SHAH","BUY",454545,53.4,"BSE"]
["2019-02-11",505576,"GOLDCORP","NAMRATA TUSHAR TANNA","BUY",741568,53.4,"BSE"]
{"$rows_left_out":42}
{"sheet":"Call Tracker (Equity & F&O)","index":5,"n_rows":399,"n_cols":18,"rows_kept":399,"merged":[[41,0,42,0],[41,1,42,1],[41,2,42,2],[41,9,42,9],[41,11,42,11],[41,12,42,12],[41,13,42,13],[41,14,42,14],[44,0,45,0],[44,1,45,1],[44,2,45,2],[44,9,45,9],[44,11,45,11],[44,12,45,12],[44,13,45,13],[44,14,45,14]]}
[]
[]
[]
[]
[{"$nulls":12},"Back To Main Page"]
["Retail Research Technical Calls & Fundamental Performance Report for the month of February -2019 "]
[{"$nulls":12},{"$f":"Main!B10","v":"2019-02-12"}]
[null,"Positional  Call"]
["Sr.no","Date",null,"Company","Rec","Rec Price","Stop Loss***","Call Closed At","Target","Remark","Profit / Loss per Share","Gain / Loss  %","Status","Closed Date","NSE Closed Price"]
[1,"2019-01-24",null,"ITC","Buy","279-281",268,null,305,"Open",{"$nulls":4},{"$f":"VLOOKUP(D10,Sheet2!A10:M1505,6,0)","v":277.1},null,null,"R"]
[2,"2019-01-25",null,"UBL","Sell",1435,1510,1392.5,"1300-1280"," Profit of Rs.42.50/-",42.5,{"$f":"K11/F11","v":{"v":0.029616724738675958,"d":"2.96%"}},"Successful","2019-01-28",{"$nulls":3},"H"]
[3,"2019-01-29",null,"MARUTI","Buy",6575,6290,6910,"7000-7100","Profit of Rs.335/-",{"$f":"H12-F12","v":335},{"v":0.05095057034220532,"d":"5.10%"},"Successful","2019-02-01",{"$nulls":3},"R"]
[4,"2019-01-30",null,"ULTRACEMCO","Buy",3400,3230,3592.5,"3750-3800","Profit of Rs.192.5/-",192.5,{"$f":"K13/F13","v":{"v":0.05661764705882353,"d":"5.66%"}},"Successful","2019-02-07",{"$nulls":3},"H"]
[5,"2019-02-05",null,"MCDOWELL-N","Buy",552.5,526.7,571,"600-610","Profit of Rs.18.5/-",18.5,{"v":0.0334841628959276,"d":"3.35%"},"Successful","2019-02-07",{"$nulls":3},"R"]
[6,"2019-02-07",null,"APOLLOTYRE","Buy",200,189.5,207.5,"215-220","Profit of Rs.7.5/-",{"$f":"H15-F15","v":7.5},{"$f":"K15/F15","v":{"v":0.0375,"d":"3.75%"}},"Successful","2019-02-08",{"$nulls":3},"H"]
[7,"2019-02-07",null,"CENTURYTEX","Buy","766-772",728,null,"820-840","Open",{"$nulls":4},{"$f":"VLOOKUP(D16,Sheet2!A16:M1511,6,0)","v":736.35},null,null,"H"]
[8,"2019-02-11",null,"APOLLOTYRE","Buy","200-201",189.5,null,"215-220","Open",{"$nulls":4},{"$f":"VLOOKUP(D17,Sheet2!A17:M1512,6,0)","v":201.7},null,null,"H"]
[]
[]
[]
{"$rows_left_out":244}
{"sheet":"Sheet2","index":6,"n_rows":1640,"n_cols":14,"rows_kept":1640,"hidden":true}
["SYMBOL","SERIES","OPEN","HIGH","LOW","CLOSE","LAST","PREVCLOSE","TOTTRDQTY","TOTTRDVAL","TIMESTAMP","TOTALTRADES","ISIN","ISIN"]
["20MICRONS","EQ",35.9,35.9,32.3,33.4,32.7,35.9,24889,855245.35,"2019-02-11",344,"INE144J01027"]
["21STCENMGM","EQ",19.5,19.5,19.5,19.5,19.5,19.85,534,10413,"2019-02-11",18,"INE253B01015"]
["3IINFOTECH","EQ",2.9,3.2,2.9,3,3,2.9,2710561,8150213.75,"2019-02-11",1068,"INE748C01020"]
["3MINDIA","EQ",21490,21775,21201.3,21619.2,21599.85,21332.45,1734,37461338.75,"2019-02-11",813,"INE470A01017"]
["3PLAND","EQ",11,12,9.9,11.5,11.5,11,2597,28556.15,"2019-02-11",57,"INE105C01023"]
["5PAISA","EQ",235,247.95,214.8,232.1,232.15,232,2688,627749.75,"2019-02-11",129,"INE618L01018"]
["63MOONS","EQ",77.7,79.2,75.6,76.15,75.6,77.7,176131,13599023.5,"2019-02-11",5338,"INE111B01023"]
["8KMILES","EQ",118,118,108.4,111,111.5,112.6,150448,16745498.4,"2019-02-11",2677,"INE650K01021"]
["A2ZINFRA","EQ",9.7,10.65,9.7,10.65,10.65,10.15,136544,1444390.2,"2019-02-11",286,"INE619I01012"]
["AARTIDRUGS","EQ",585.7,590,577,588.95,590,589.25,27893,16333327.65,"2019-02-11",1872,"INE767A01016"]
["AARTIIND","EQ",1574,1574,1530.1,1541.65,1543,1579.15,60601,93847401.05,"2019-02-11",10496,"INE769A01020"]
["AARVEEDEN","EQ",22.5,22.5,21.5,22,22.1,22.1,4863,106455.65,"2019-02-11",46,"INE273D01019"]
["AAVAS","EQ",856,869.9,851.1,867.4,867.95,861.75,21235,18369738.6,"2019-02-11",2303,"INE216P01012"]
["ABAN","EQ",51.5,51.85,48.5,49.3,49.2,51.7,452183,22210318.9,"2019-02-11",3889,"INE421A01028"]
["ABB","EQ",1262,1262,1221,1233.8,1231,1255.15,50593,62796125.4,"2019-02-11",4717,"INE117A01022"]
["ABBOTINDIA","EQ",8050,8050,7600,7666.4,7750,8042,21425,165357906.75,"2019-02-11",4850,"INE358A01014"]
["ABCAPITAL","EQ",82,82.3,79,79.1,79.15,81.6,1539262,122827121.8,"2019-02-11",17669,"INE674K01013"]
["ABFRL","EQ",211.75,212,209.45,211.1,211.25,211.95,586752,123761244.75,"2019-02-11",6715,"INE647O01011"]
["ACC","EQ",1396,1399.45,1364.4,1368.3,1368,1395.45,1133028,1567411848.9,"2019-02-11",21668,"INE012A01025"]
{"$rows_left_out":1621}
{"sheet":"Sheet1","index":7,"n_rows":0,"n_cols":0,"rows_kept":0,"hidden":true}

{"sheet":"Sheet3","index":8,"n_rows":0,"n_cols":0,"rows_kept":0,"hidden":true}