{"text_format":"3","workbook":"xlsx","n_sheets":8,"sheets":["Main","Future Intra","Cash Intra","MidCap Intra","Bulk Deals","Call Tracker (Equity & F&O)","Sheet2","Sheet1"],"not_rendered":{"images":4,"defined_names":4},"read":"whole","date_system":"1900"}

{"sheet":"Main","index":0,"n_rows":17,"n_cols":4,"rows_kept":17}
[null,"                                                                                                 "]
{"$rows_empty":8}
[null,"2018-12-11"]
[]
[null,"Sheet No.","Template Name","Summary"]
[null,1,"Future Intra","For Intraday trading in F&O segment"]
[null,2,"Cash Intra","For Intraday trading in cash market segment"]
[null,3,"Mid-cap Intra","For Intraday trading in Mid-cap stocks"]
[null,4,"Bulk Deals","Reveals Bulk Deals carried on NSE & BSE"]
[null,5,"Call Tracker"]

{"sheet":"Future Intra","index":1,"n_rows":242,"n_cols":15,"rows_kept":242,"merged":[[8,0,9,0],[8,1,9,1],[8,2,9,2],[8,5,8,7],[8,8,8,10]]}
[]
[]
[]
[]
[{"$nulls":12},"Back to Main Page"]
["FOR INTRA DAY TRADING",{"$nulls":10},{"$f":"Main!B10","v":"2018-12-11"}]
[]
[]
["Sr.no","Sector","Scrip","CLOSE RATE","Pivot Point","Supports",null,null,"Resistances"]
[null,"Sector",null,"Point","Point","S1","S2","S3","R1","R2","R3","HIGH","LOW","OI","% Change in OI"]
[1,"Index","BANKNIFTY",{"v":26211,"d":"26211.00"},{"v":26281.533333333336,"d":"26281.53"},{"v":26109.566666666673,"d":"26109.57"},{"v":26008.133333333335,"d":"26008.13"},{"v":25836.16666666667,"d":"25836.17"},{"v":26382.966666666674,"d":"26382.97"},{"v":26554.93333333334,"d":"26554.93"},{"v":26656.366666666676,"d":"26656.37"},26453.5,26180.1,1402560,{"v":-0.1877975052986345,"d":"-18.78%"}]
[2,"Index","NIFTY",{"v":10514.7,"d":"10514.70"},{"v":10537.483333333334,"d":"10537.48"},{"v":10477.266666666666,"d":"10477.27"},{"v":10439.833333333332,"d":"10439.83"},{"v":10379.616666666665,"d":"10379.62"},{"v":10574.916666666668,"d":"10574.92"},{"v":10635.133333333335,"d":"10635.13"},{"v":10672.56666666667,"d":"10672.57"},10597.7,10500.05,22495575,{"v":-0.012500905385562557,"d":"-1.25%"}]
[3,"Index","NIFTYIT",{"v":14442,"d":"14442.00"},{"v":14534.333333333334,"d":"14534.33"},{"v":14316.666666666668,"d":"14316.67"},{"v":14191.333333333334,"d":"14191.33"},{"v":13973.666666666668,"d":"13973.67"},{"v":14659.666666666668,"d":"14659.67"},{"v":14877.333333333336,"d":"14877.33"},{"v":15002.666666666668,"d":"15002.67"},14752,14409,18650,{"v":0.01912568306010929,"d":"1.91%"}]
[4,"Index","NIFTYMID50",4609.95,{"v":4611.650000000001,"d":"4611.65"},{"v":4503.300000000001,"d":"4503.30"},{"v":4396.650000000001,"d":"4396.65"},{"v":4288.300000000001,"d":"4288.30"},{"v":4718.300000000001,"d":"4718.30"},{"v":4826.6500000000015,"d":"4826.65"},{"v":4933.300000000001,"d":"4933.30"},4720,4505,591690,{"v":0,"d":"0.00%"}]
[5,"Cement","ACC",1413.75,1417.25,{"v":1398.5,"d":"1398.50"},1383.25,{"v":1364.5,"d":"1364.50"},{"v":1432.5,"d":"1432.50"},1451.25,{"v":1466.5,"d":"1466.50"},1436,1402,1379200,{"v":-5.7670126874279125E-3,"d":"-0.58%"}]
[6,"Others","ADANIENT",143.65,{"v":144.11666666666667,"d":"144.12"},{"v":140.68333333333334,"d":"140.68"},{"v":137.71666666666667,"d":"137.72"},{"v":134.28333333333333,"d":"134.28"},{"v":147.08333333333334,"d":"147.08"},{"v":150.51666666666668,"d":"150.52"},{"v":153.48333333333335,"d":"153.48"},147.55,141.15,49352000,{"v":0.04630257801899593,"d":"4.63%"}]
[7,"Others","ADANIPORTS",360.15,{"v":361.59999999999997,"d":"361.60"},{"v":356.79999999999995,"d":"356.80"},353.45,348.65,{"v":364.94999999999993,"d":"364.95"},369.75,{"v":373.0999999999999,"d":"373.10"},366.4,358.25,18172500,{"v":-0.017702702702702702,"d":"-1.77%"}]
[8,"Power","ADANIPOWER",49.25,{"v":49.31666666666666,"d":"49.32"},{"v":48.633333333333326,"d":"48.63"},{"v":48.016666666666666,"d":"48.02"},{"v":47.33333333333333,"d":"47.33"},{"v":49.93333333333332,"d":"49.93"},{"v":50.61666666666666,"d":"50.62"},{"v":51.23333333333332,"d":"51.23"},50,48.7,178640000,{"v":0.049958857411543434,"d":"5.00%"}]
[9,"Pharma","AJANTPHARM",{"v":1020.5,"d":"1020.50"},{"v":1024.8999999999999,"d":"1024.90"},{"v":1005.5999999999997,"d":"1005.60"},{"v":990.6999999999998,"d":"990.70"},{"v":971.3999999999996,"d":"971.40"},{"v":1039.7999999999997,"d":"1039.80"},{"v":1059.1,"d":"1059.10"},{"v":1073.9999999999998,"d":"1074.00"},1044.2,1010,631500,{"v":0.04552980132450331,"d":"4.55%"}]
[10,"Banking","ALBK",{"v":44.3,"d":"44.30"},{"v":43.699999999999996,"d":"43.70"},{"v":42.69999999999999,"d":"42.70"},{"v":41.099999999999994,"d":"41.10"},{"v":40.09999999999999,"d":"40.10"},{"v":45.29999999999999,"d":"45.30"},{"v":46.300000000000004,"d":"46.30"},{"v":47.89999999999999,"d":"47.90"},44.7,42.1,16074000,{"v":-0.06611666279339995,"d":"-6.61%"}]
{"$rows_left_out":213}
{"sheet":"Cash Intra","index":2,"n_rows":246,"n_cols":13,"rows_kept":246,"merged":[[7,0,8,0],[7,1,8,1],[7,2,8,2],[7,3,8,3],[7,4,7,6],[7,7,7,9]]}
[]
[]
[]
[]
[{"$nulls":12},"Back to Main Page"]
["FOR INTRA DAY TRADING",{"$nulls":9},{"$f":"Main!B10","v":"2018-12-11"}]
[]
["Sr.no","Scrip","CLOSE RATE","Pivot Point","Supports",null,null,"Resistances"]
[null,null,"Point",null,"S1","S2","S3","R1","R2","R3","HIGH","LOW","Total Trade Quanity in Lakhs"]
[1,"Nifty 50",10488.45,{"v":10507.416666666668,"d":"10507.42"},{"v":10455.983333333335,"d":"10455.98"},{"v":10423.516666666668,"d":"10423.52"},{"v":10372.083333333336,"d":"10372.08"},{"v":10539.883333333335,"d":"10539.88"},{"v":10591.31666666667,"d":"10591.32"},{"v":10623.783333333335,"d":"10623.78"},10558.85,10474.95]
[2,"Nifty Bank",26102.65,{"v":26170.283333333336,"d":"26170.28"},{"v":26004.366666666672,"d":"26004.37"},{"v":25906.083333333336,"d":"25906.08"},{"v":25740.16666666667,"d":"25740.17"},{"v":26268.566666666673,"d":"26268.57"},{"v":26434.483333333337,"d":"26434.48"},{"v":26532.766666666674,"d":"26532.77"},26336.2,26072]
[3,"Nifty CPSE",1917.35,{"v":1908.5666666666666,"d":"1908.57"},{"v":1892.2333333333331,"d":"1892.23"},{"v":1867.1166666666666,"d":"1867.12"},{"v":1850.783333333333,"d":"1850.78"},{"v":1933.6833333333332,"d":"1933.68"},{"v":1950.0166666666667,"d":"1950.02"},{"v":1975.1333333333332,"d":"1975.13"},1924.9,1883.45]
[4,"Nifty Infra",2969.2,{"v":2973.6999999999994,"d":"2973.70"},{"v":2956.199999999999,"d":"2956.20"},{"v":2943.1999999999994,"d":"2943.20"},{"v":2925.699999999999,"d":"2925.70"},{"v":2986.699999999999,"d":"2986.70"},{"v":3004.2,"d":"3004.20"},{"v":3017.199999999999,"d":"3017.20"},2991.2,2960.7]
[5,"Nifty IT",14419.2,{"v":14504.133333333333,"d":"14504.13"},{"v":14284.566666666666,"d":"14284.57"},{"v":14149.933333333332,"d":"14149.93"},{"v":13930.366666666665,"d":"13930.37"},{"v":14638.766666666666,"d":"14638.77"},{"v":14858.333333333336,"d":"14858.33"},{"v":14992.966666666667,"d":"14992.97"},14723.7,14369.5]
[6,"Nifty PSE",3140.15,{"v":3126.2833333333333,"d":"3126.28"},{"v":3105.1666666666665,"d":"3105.17"},{"v":3070.1833333333334,"d":"3070.18"},{"v":3049.0666666666666,"d":"3049.07"},{"v":3161.2666666666664,"d":"3161.27"},{"v":3182.383333333333,"d":"3182.38"},{"v":3217.3666666666663,"d":"3217.37"},3147.4,3091.3]
[7,"Nifty Midcap 50",4552.65,{"v":4553.366666666667,"d":"4553.37"},{"v":4524.633333333333,"d":"4524.63"},{"v":4496.616666666667,"d":"4496.62"},{"v":4467.883333333333,"d":"4467.88"},{"v":4581.383333333333,"d":"4581.38"},{"v":4610.116666666667,"d":"4610.12"},{"v":4638.133333333333,"d":"4638.13"},4582.1,4525.35]
[8,"ABB",1396.75,{"v":1394.2166666666665,"d":"1394.22"},{"v":1371.583333333333,"d":"1371.58"},{"v":1346.4166666666665,"d":"1346.42"},{"v":1323.783333333333,"d":"1323.78"},{"v":1419.383333333333,"d":"1419.38"},{"v":1442.0166666666667,"d":"1442.02"},{"v":1467.183333333333,"d":"1467.18"},1416.85,1369.05,0.7995]
[9,"ACC",1411.8,{"v":1414.2833333333335,"d":"1414.28"},{"v":1395.766666666667,"d":"1395.77"},{"v":1379.7333333333336,"d":"1379.73"},{"v":1361.2166666666672,"d":"1361.22"},{"v":1430.316666666667,"d":"1430.32"},{"v":1448.8333333333335,"d":"1448.83"},{"v":1464.866666666667,"d":"1464.87"},1432.8,1398.25,2.69544]
[10,"AIAENG",1659.25,{"v":1655.3999999999999,"d":"1655.40"},{"v":1633.8999999999996,"d":"1633.90"},{"v":1608.5499999999997,"d":"1608.55"},{"v":1587.0499999999995,"d":"1587.05"},{"v":1680.7499999999998,"d":"1680.75"},{"v":1702.2500000000002,"d":"1702.25"},{"v":1727.6,"d":"1727.60"},1676.9,1630.05,0.03305]
[11,"AUBANK",589.1,{"v":592.5666666666666,"d":"592.57"},{"v":575.6333333333332,"d":"575.63"},{"v":562.1666666666666,"d":"562.17"},{"v":545.2333333333332,"d":"545.23"},{"v":606.0333333333332,"d":"606.03"},{"v":622.9666666666666,"d":"622.97"},{"v":636.4333333333332,"d":"636.43"},609.5,579.1,2.30988]
{"$rows_left_out":227}
{"sheet":"MidCap Intra","index":3,"n_rows":510,"n_cols":13,"rows_kept":510,"merged":[[0,0,0,1],[8,0,9,0],[8,1,9,1],[8,2,9,2],[8,3,9,3],[8,4,8,6],[8,7,8,9]]}
[]
[]
[]
[]
[{"$nulls":11},"Back To Main Page"]
["FOR INTRA DAY TRADING",{"$nulls":9},{"$f":"Main!B10","v":"2018-12-11"}]
[null,null," "]
[]
["Sr.no","Scrip","CLOSE RATE","Pivot Point","Supports",null,null,"Resistances"]
[null,null,"Point",null,"S1","S2","S3","R1","R2","R3","HIGH","LOW","Total Trade Quanity in Lakhs"]
[1,"3MINDIA",20941.35,{"v":21093.3,"d":"21093.30"},20649.05,20356.75,{"v":19912.5,"d":"19912.50"},{"v":21385.6,"d":"21385.60"},21829.85,{"v":22122.149999999998,"d":"22122.15"},21537.55,20801,0.01954]
[2,"8KMILES",165.2,{"v":165.2,"d":"165.20"},{"v":165.2,"d":"165.20"},{"v":165.2,"d":"165.20"},{"v":165.2,"d":"165.20"},{"v":165.2,"d":"165.20"},{"v":165.2,"d":"165.20"},{"v":165.2,"d":"165.20"},165.2,165.2,0.04486]
[3,"AARTIIND",1384.3,{"v":1394.9333333333334,"d":"1394.93"},{"v":1363.3166666666668,"d":"1363.32"},{"v":1342.3333333333335,"d":"1342.33"},{"v":1310.716666666667,"d":"1310.72"},{"v":1415.9166666666667,"d":"1415.92"},{"v":1447.5333333333335,"d":"1447.53"},{"v":1468.5166666666667,"d":"1468.52"},1426.55,1373.95,0.33052]
[4,"ABAN",68.75,{"v":69.28333333333335,"d":"69.28"},{"v":67.7666666666667,"d":"67.77"},{"v":66.78333333333335,"d":"66.78"},{"v":65.2666666666667,"d":"65.27"},{"v":70.2666666666667,"d":"70.27"},{"v":71.78333333333335,"d":"71.78"},{"v":72.7666666666667,"d":"72.77"},70.8,68.3,2.98528]
[5,"ABB",1396.75,{"v":1394.2166666666665,"d":"1394.22"},{"v":1371.583333333333,"d":"1371.58"},{"v":1346.4166666666665,"d":"1346.42"},{"v":1323.783333333333,"d":"1323.78"},{"v":1419.383333333333,"d":"1419.38"},{"v":1442.0166666666667,"d":"1442.02"},{"v":1467.183333333333,"d":"1467.18"},1416.85,1369.05,0.7995]
[6,"ABCAPITAL",94.9,{"v":95.10000000000001,"d":"95.10"},{"v":94.00000000000001,"d":"94.00"},{"v":93.10000000000001,"d":"93.10"},{"v":92.00000000000001,"d":"92.00"},{"v":96.00000000000001,"d":"96.00"},{"v":97.10000000000001,"d":"97.10"},{"v":98.00000000000001,"d":"98.00"},96.2,94.2,10.86549]
[7,"ABFRL",180.75,{"v":179.38333333333333,"d":"179.38"},{"v":176.36666666666665,"d":"176.37"},{"v":171.98333333333332,"d":"171.98"},{"v":168.96666666666664,"d":"168.97"},{"v":183.76666666666665,"d":"183.77"},{"v":186.7833333333333,"d":"186.78"},{"v":191.16666666666666,"d":"191.17"},182.4,175,3.93043]
[8,"ACC",1411.8,{"v":1414.2833333333335,"d":"1414.28"},{"v":1395.766666666667,"d":"1395.77"},{"v":1379.7333333333336,"d":"1379.73"},{"v":1361.2166666666672,"d":"1361.22"},{"v":1430.316666666667,"d":"1430.32"},{"v":1448.8333333333335,"d":"1448.83"},{"v":1464.866666666667,"d":"1464.87"},1432.8,1398.25,2.69544]
[9,"ADANIPORTS",359.15,360.75,{"v":356,"d":"356.00"},352.85,{"v":348.1,"d":"348.10"},{"v":363.9,"d":"363.90"},368.65,{"v":371.79999999999995,"d":"371.80"},365.5,357.6,29.17295]
[10,"ADANIPOWER",48.95,49.15,{"v":48.349999999999994,"d":"48.35"},{"v":47.74999999999999,"d":"47.75"},{"v":46.94999999999999,"d":"46.95"},49.75,50.55,{"v":51.150000000000006,"d":"51.15"},49.95,48.55,168.69159]
{"$rows_left_out":491}
{"sheet":"Bulk Deals","index":4,"n_rows":68,"n_cols":8,"rows_kept":68,"merged":[[4,0,4,1],[4,2,4,3],[6,1,6,2]]}
[" "]
[]
[]
[]
[]
[{"$nulls":4},"Back To Main Page"]
["Subject :","BULK DEAL",null,{"$f":"Main!B10","v":"2018-12-11"}]
[]
["Date","Scrip code","Scrip Name","Client Name","Buy / Sell","Quantity Traded","Trade Price / Wt.Avg.trade price","Exchange  "]
["2018-12-10",539177,"AIIL","SUNIL KUMAR AGARWAL","SELL",{"v":87500,"d":"87,500"},18.15,"BSE"]
["2018-12-10",539177,"AIIL","ALPANA SANJAY DANGI","BUY",{"v":2344033,"d":"2,344,033"},18.15,"BSE"]
["2018-12-10",539177,"AIIL","ACME PRIVATE LIMITED","SELL",{"v":128121,"d":"128,121"},18.15,"BSE"]
["2018-12-10",539177,"AIIL","ISHAN TIE UP PVT LTD","SELL",{"v":105000,"d":"105,000"},18.15,"BSE"]
["2018-12-10",539177,"AIIL","KEJRIWAL FINVEST (P) LTD","SELL",{"v":290000,"d":"290,000"},18.15,"BSE"]
["2018-12-10",539177,"AIIL","KNOWLEDGE PARTNERS","SELL",{"v":225000,"d":"225,000"},18.15,"BSE"]
["2018-12-10",539177,"AIIL","ANUJ BAIROLIYA","SELL",{"v":59500,"d":"59,500"},18.15,"BSE"]
["2018-12-10",539177,"AIIL","MULTIPLUS RESOURCES LTD.","SELL",{"v":105000,"d":"105,000"},18.15,"BSE"]
["2018-12-10",539177,"AIIL","PRAVIN AGARWAL","SELL",{"v":77000,"d":"77,000"},18.15,"BSE"]
["2018-12-10",539177,"AIIL","DHARAPATI DISTRIBUTORS LIMITED .","SELL",{"v":120000,"d":"120,000"},18.15,"BSE"]
["2018-12-10",539177,"AIIL","SHRESTH BUILDERS PRIVATE LIMITED","SELL",{"v":80000,"d":"80,000"},18.15,"BSE"]
{"$rows_left_out":49}
{"sheet":"Call Tracker (Equity & F&O)","index":5,"n_rows":303,"n_cols":18,"rows_kept":303,"merged":[[38,0,39,0],[38,1,39,1],[38,2,39,2],[38,9,39,9],[38,11,39,11],[38,12,39,12],[38,13,39,13],[38,14,39,14],[40,0,41,0],[40,1,41,1],[40,2,41,2],[40,9,41,9],[40,11,41,11],[40,12,41,12],[40,13,41,13],[40,14,41,14],[42,0,43,0],[42,1,43,1],[42,2,43,2],[42,9,43,9],[42,11,43,11],[42,12,43,12],[42,13,43,13],[42,14,43,14],[51,0,52,0],[51,1,52,1],[51,2,52,2],[51,9,52,9],[51,11,52,11],[51,12,52,12],[51,13,52,13],[51,14,52,14],[53,0,54,0],[53,1,54,1],[53,2,54,2],[53,9,54,9],[53,11,54,11],[53,12,54,12],[53,13,54,13],[53,14,54,14]]}
[]
[]
[]
[]
[{"$nulls":12},"Back To Main Page"]
["Retail Research Technical Calls & Fundamental Performance Report for the month of December -2018 "]
[{"$nulls":12},{"$f":"Main!B10","v":"2018-12-11"}]
[null,"Positional  Call"]
["Sr.no","Date",null,"Company","Rec","Rec Price","Stop Loss***","Call Closed At","Target","Remark","Profit / Loss per Share","Gain / Loss  %","Status","Closed Date","NSE Closed Price"]
[1,"2018-11-14",null,"ASHOKLEY","Buy",108,100.7,111.25,"122-125","Part Profit of Rs.3.25/-",{"$f":"H10-F10","v":3.25},{"$f":"K10/F10","v":{"v":0.03009259259259259,"d":"3.01%"}},"Successful","2018-11-30",{"$nulls":3},"R"]
[2,"2018-11-21",null,"ADANIPORTS","Sell","358-361",377.7,null,"322-326","Open",{"$nulls":4},{"$f":"VLOOKUP(D11,Sheet2!A11:M1637,6,0)","v":359.15},null,null,"R"]
[3,"2018-11-29",null,"JSWSTEEL","Buy{}",312,297.7,{"$f":"(322+296)/2","v":309},"344-350","Loss of Rs.3/-",{"$f":"H12-F12","v":-3},{"$f":"K12/F12","v":{"v":-0.009615384615384616,"d":"-0.96%"}},"Unsuccessful","2018-12-07",{"$nulls":3},"R"]
[4,"2018-11-30",null,"RAYMOND","Sell",820,861.6,789,"745-735","Profit of Rs.31/-",{"$f":"F13-H13","v":31},{"v":0.03780487804878049,"d":"3.78%"},"Successful","2018-12-07",{"$nulls":3},"R"]
[5,"2018-11-30",null,"INFY","Buy",665,628,685,725,"Profit of Rs.20/-",20,{"$f":"K14/F14","v":{"v":0.03007518796992481,"d":"3.01%"}},"Successful","2018-12-07",{"$nulls":3},"H"]
{"$rows_empty":19}
["CLBS = Closing Basis ***",{"$nulls":4},"Reinitiated $"]
["Dividend adjusted <>",{"$nulls":4},"Revised stoploss #"]
["Part book {}"]
["Master Trade High Risk"]
["Sr.no","Date",null,"Company","Rec","Rec Price","Stop Loss","Call Closed At","Target","Remark","Profit / Loss per share","Gain / Loss  per Lot","Lot","Status","Closed Date"]
{"$rows_left_out":221}
{"sheet":"Sheet2","index":6,"n_rows":1618,"n_cols":14,"rows_kept":1618,"hidden":true}
["SYMBOL","SERIES","OPEN","HIGH","LOW","CLOSE","LAST","PREVCLOSE","TOTTRDQTY","TOTTRDVAL","TIMESTAMP","TOTALTRADES","ISIN","ISIN"]
["20MICRONS","EQ",42.8,42.8,41.4,41.8,41.4,42.8,15730,659433.15,"2018-12-10",284,"INE144J01027"]
["21STCENMGM","EQ",24.25,24.25,24.25,24.25,24.25,24.25,141,3419.25,"2018-12-10",6,"INE253B01015"]
["3IINFOTECH","EQ",3.6,3.75,3.45,3.7,3.75,3.65,2313787,8267271.05,"2018-12-10",1074,"INE748C01020"]
["3MINDIA","EQ",21500,21537.55,20801,20941.35,20908,21816.6,1954,41137026.15,"2018-12-10",817,"INE470A01017"]
["3PLAND","BE",11.75,11.75,11.75,11.75,11.75,12.35,4,47,"2018-12-10",2,"INE105C01023"]
["5PAISA","EQ",190,194.95,185,186.65,185.75,190.1,5829,1106942.2,"2018-12-10",169,"INE618L01018"]
["63MOONS","EQ",87.95,87.95,83.15,83.65,83.3,88.6,223724,19055900.75,"2018-12-10",3135,"INE111B01023"]
["8KMILES","EQ",165.2,165.2,165.2,165.2,165.2,173.85,4486,741087.2,"2018-12-10",202,"INE650K01021"]
["A2ZINFRA","EQ",11.95,12.3,11.6,12.05,11.95,12.35,117030,1403975.15,"2018-12-10",353,"INE619I01012"]
["AARTIDRUGS","EQ",564.35,564.35,555,559.5,555,566.1,13180,7364744.5,"2018-12-10",658,"INE767A01016"]
["AARTIIND","EQ",1425,1426.55,1373.95,1384.3,1379,1448.35,33052,46345509.85,"2018-12-10",3166,"INE769A01020"]
["AARVEEDEN","EQ",24.65,25,24.35,24.9,24.95,24.65,7368,181595.35,"2018-12-10",48,"INE273D01019"]
["AAVAS","EQ",732.75,784,732.75,774.6,774.8,778.55,13727,10520307.4,"2018-12-10",1748,"INE216P01012"]
["ABAN","EQ",70.8,70.8,68.3,68.75,68.85,71.25,298528,20617230.3,"2018-12-10",3252,"INE421A01028"]
["ABB","EQ",1378.5,1416.85,1369.05,1396.75,1400,1395.9,79950,112000041.3,"2018-12-10",8697,"INE117A01022"]
["ABBOTINDIA","EQ",7420.25,7469.85,7271,7394.5,7450,7495.2,2720,20049682.05,"2018-12-10",1010,"INE358A01014"]
["ABCAPITAL","EQ",94.2,96.2,94.2,94.9,94.95,97.2,1086549,103417623.85,"2018-12-10",9262,"INE674K01013"]
["ABFRL","EQ",175,182.4,175,180.75,180.8,181.6,393043,70662716.55,"2018-12-10",9624,"INE647O01011"]
["ACC","EQ",1419.65,1432.8,1398.25,1411.8,1417,1443.05,269544,381315274.15,"2018-12-10",12729,"INE012A01025"]
{"$rows_left_out":1599}
{"sheet":"Sheet1","index":7,"n_rows":0,"n_cols":0,"rows_kept":0,"hidden":true}