{"text_format":"3","workbook":"xlsx","n_sheets":10,"sheets":["Main","Future Intra","Cash Intra","MidCap Intra","Bulk Deals","Call Tracker (Equity & F&O)","Sheet2","Sheet1","Sheet3","Sheet4"],"not_rendered":{"images":4,"defined_names":4},"read":"whole","date_system":"1900"}

{"sheet":"Main","index":0,"n_rows":17,"n_cols":4,"rows_kept":17}
[null,"                                                                                                 "]
{"$rows_empty":8}
[null,"2019-04-11"]
[]
[null,"Sheet No.","Template Name","Summary"]
[null,1,"Future Intra","For Intraday trading in F&O segment"]
[null,2,"Cash Intra","For Intraday trading in cash market segment"]
[null,3,"Mid-cap Intra","For Intraday trading in Mid-cap stocks"]
[null,4,"Bulk Deals","Reveals Bulk Deals carried on NSE & BSE"]
[null,5,"Call Tracker"]

{"sheet":"Future Intra","index":1,"n_rows":236,"n_cols":15,"rows_kept":236,"merged":[[8,0,9,0],[8,1,9,1],[8,2,9,2],[8,5,8,7],[8,8,8,10]]}
[]
[]
[]
[]
[{"$nulls":12},"Back to Main Page"]
["FOR INTRA DAY TRADING",{"$nulls":10},{"$f":"Main!B10","v":"2019-04-11"}]
[]
[]
["Sr.no","Sector","Scrip","CLOSE RATE","Pivot Point","Supports",null,null,"Resistances"]
[null,"Sector",null,"Point","Point","S1","S2","S3","R1","R2","R3","HIGH","LOW","OI","% Change in OI"]
[1,"Index","BANKNIFTY",29979.25,{"v":30077.833333333332,"d":"30077.83"},{"v":29820.666666666664,"d":"29820.67"},{"v":29662.083333333332,"d":"29662.08"},{"v":29404.916666666664,"d":"29404.92"},{"v":30236.416666666664,"d":"30236.42"},{"v":30493.58333333333,"d":"30493.58"},{"v":30652.166666666664,"d":"30652.17"},30335,29919.25,2073500,{"v":-0.008226909647486487,"d":"-0.82%"}]
[2,"Index","NIFTY",{"v":11652.9,"d":"11652.90"},{"v":11679.816666666666,"d":"11679.82"},{"v":11615.633333333331,"d":"11615.63"},{"v":11578.366666666665,"d":"11578.37"},{"v":11514.18333333333,"d":"11514.18"},{"v":11717.083333333332,"d":"11717.08"},{"v":11781.266666666666,"d":"11781.27"},{"v":11818.533333333333,"d":"11818.53"},11744,11642.55,17250675,{"v":-0.00381566979947161,"d":"-0.38%"}]
[3,"Index","NIFTYIT",{"v":16094,"d":"16094.00"},{"v":16139,"d":"16139.00"},{"v":16030,"d":"16030.00"},{"v":15966,"d":"15966.00"},{"v":15857,"d":"15857.00"},{"v":16203,"d":"16203.00"},{"v":16312,"d":"16312.00"},{"v":16376,"d":"16376.00"},16248,16075,27250,{"v":0.11909650924024641,"d":"11.91%"}]
[4,"Cement","ACC",1644.95,{"v":1650.9333333333334,"d":"1650.93"},{"v":1634.7666666666669,"d":"1634.77"},{"v":1624.5833333333335,"d":"1624.58"},{"v":1608.416666666667,"d":"1608.42"},{"v":1661.1166666666668,"d":"1661.12"},{"v":1677.2833333333333,"d":"1677.28"},{"v":1687.4666666666667,"d":"1687.47"},1667.1,1640.75,2477600,{"v":8.959113862192539E-3,"d":"0.90%"}]
[5,"Others","ADANIENT",{"v":143.8,"d":"143.80"},{"v":144.9,"d":"144.90"},141.65,{"v":139.5,"d":"139.50"},136.25,147.05,{"v":150.3,"d":"150.30"},{"v":152.45000000000002,"d":"152.45"},148.15,142.75,40716000,{"v":0.004440497335701598,"d":"0.44%"}]
[6,"Others","ADANIPORTS",{"v":384.9,"d":"384.90"},{"v":383.1499999999999,"d":"383.15"},{"v":379.39999999999986,"d":"379.40"},{"v":373.8999999999999,"d":"373.90"},{"v":370.14999999999986,"d":"370.15"},{"v":388.64999999999986,"d":"388.65"},{"v":392.4,"d":"392.40"},{"v":397.89999999999986,"d":"397.90"},386.9,377.65,20012500,{"v":-0.009772389905987135,"d":"-0.98%"}]
[7,"Power","ADANIPOWER",{"v":49.4,"d":"49.40"},49.75,48.75,{"v":48.1,"d":"48.10"},{"v":47.1,"d":"47.10"},{"v":50.4,"d":"50.40"},{"v":51.4,"d":"51.40"},52.05,50.75,49.1,153840000,{"v":-1.4280150590678957E-3,"d":"-0.14%"}]
[8,"Pharma","AJANTPHARM",1018.55,{"v":1019.9666666666667,"d":"1019.97"},{"v":1012.5333333333333,"d":"1012.53"},{"v":1006.5166666666667,"d":"1006.52"},{"v":999.0833333333333,"d":"999.08"},{"v":1025.9833333333333,"d":"1025.98"},{"v":1033.4166666666667,"d":"1033.42"},{"v":1039.4333333333334,"d":"1039.43"},1027.4,1013.95,803500,{"v":0.03811369509043928,"d":"3.81%"}]
[9,"Banking","ALBK",53.35,{"v":53.333333333333336,"d":"53.33"},{"v":52.66666666666667,"d":"52.67"},{"v":51.983333333333334,"d":"51.98"},{"v":51.31666666666667,"d":"51.32"},{"v":54.01666666666667,"d":"54.02"},{"v":54.683333333333344,"d":"54.68"},{"v":55.366666666666674,"d":"55.37"},54,52.65,23816000,{"v":-0.07240506329113924,"d":"-7.24%"}]
[10,"Automobile","AMARAJABAT",{"v":688.8,"d":"688.80"},{"v":683.2666666666668,"d":"683.27"},{"v":673.9833333333336,"d":"673.98"},{"v":659.1666666666669,"d":"659.17"},{"v":649.8833333333337,"d":"649.88"},{"v":698.0833333333335,"d":"698.08"},{"v":707.3666666666666,"d":"707.37"},{"v":722.1833333333334,"d":"722.18"},692.55,668.45,1992900,{"v":-0.03556910569105691,"d":"-3.56%"}]
{"$rows_left_out":207}
{"sheet":"Cash Intra","index":2,"n_rows":247,"n_cols":13,"rows_kept":247,"merged":[[7,0,8,0],[7,1,8,1],[7,2,8,2],[7,3,8,3],[7,4,7,6],[7,7,7,9]]}
[]
[]
[]
[]
[{"$nulls":12},"Back to Main Page"]
["FOR INTRA DAY TRADING",{"$nulls":9},{"$f":"Main!B10","v":"2019-04-11"}]
[]
["Sr.no","Scrip","CLOSE RATE","Pivot Point","Supports",null,null,"Resistances"]
[null,null,"Point",null,"S1","S2","S3","R1","R2","R3","HIGH","LOW","Total Trade Quanity in Lakhs"]
[1,"Nifty 50",11584.3,{"v":11612.033333333333,"d":"11612.03"},{"v":11544.016666666666,"d":"11544.02"},{"v":11503.733333333334,"d":"11503.73"},{"v":11435.716666666667,"d":"11435.72"},{"v":11652.316666666666,"d":"11652.32"},{"v":11720.333333333332,"d":"11720.33"},{"v":11760.616666666665,"d":"11760.62"},11680.05,11571.75]
[2,"Nifty Bank",29803.5,{"v":29909.11666666667,"d":"29909.12"},{"v":29662.483333333337,"d":"29662.48"},{"v":29521.466666666667,"d":"29521.47"},{"v":29274.833333333336,"d":"29274.83"},{"v":30050.13333333334,"d":"30050.13"},{"v":30296.76666666667,"d":"30296.77"},{"v":30437.78333333334,"d":"30437.78"},30155.75,29768.1]
[3,"Nifty CPSE",2244.45,{"v":2247.616666666667,"d":"2247.62"},{"v":2233.9833333333336,"d":"2233.98"},{"v":2223.516666666667,"d":"2223.52"},{"v":2209.8833333333337,"d":"2209.88"},{"v":2258.0833333333335,"d":"2258.08"},{"v":2271.7166666666667,"d":"2271.72"},{"v":2282.1833333333334,"d":"2282.18"},2261.25,2237.15]
[4,"Nifty Infra",3182.95,{"v":3194.1,"d":"3194.10"},{"v":3166.7999999999997,"d":"3166.80"},{"v":3150.6499999999996,"d":"3150.65"},{"v":3123.3499999999995,"d":"3123.35"},3210.25,3237.55,{"v":3253.7000000000003,"d":"3253.70"},3221.4,3177.95]
[5,"Nifty IT",15999.15,{"v":16050.049999999997,"d":"16050.05"},{"v":15927.299999999996,"d":"15927.30"},{"v":15855.449999999999,"d":"15855.45"},{"v":15732.699999999997,"d":"15732.70"},{"v":16121.899999999994,"d":"16121.90"},{"v":16244.649999999998,"d":"16244.65"},{"v":16316.499999999993,"d":"16316.50"},16172.8,15978.2]
[6,"Nifty PSE",3514.65,{"v":3523.2000000000003,"d":"3523.20"},{"v":3502.4500000000007,"d":"3502.45"},{"v":3490.2500000000005,"d":"3490.25"},{"v":3469.500000000001,"d":"3469.50"},{"v":3535.4000000000005,"d":"3535.40"},{"v":3556.1499999999996,"d":"3556.15"},{"v":3568.3500000000004,"d":"3568.35"},3543.95,3511]
[7,"Nifty Midcap 50",5039.35,{"v":5049.849999999999,"d":"5049.85"},{"v":5021.049999999999,"d":"5021.05"},5002.75,4973.95,{"v":5068.149999999999,"d":"5068.15"},5096.95,{"v":5115.249999999998,"d":"5115.25"},5078.65,5031.55]
[8,"ABB",1381.55,{"v":1386.5166666666667,"d":"1386.52"},{"v":1366.0333333333333,"d":"1366.03"},{"v":1350.5166666666667,"d":"1350.52"},{"v":1330.0333333333333,"d":"1330.03"},{"v":1402.0333333333333,"d":"1402.03"},{"v":1422.5166666666664,"d":"1422.52"},{"v":1438.0333333333333,"d":"1438.03"},1407,1371,0.68864]
[9,"ACC",1636.65,{"v":1640.8500000000001,"d":"1640.85"},{"v":1625.8000000000002,"d":"1625.80"},1614.95,{"v":1599.9,"d":"1599.90"},{"v":1651.7000000000003,"d":"1651.70"},1666.75,{"v":1677.6000000000004,"d":"1677.60"},1655.9,1630,5.59285]
[10,"AIAENG",1798.95,{"v":1786.6666666666667,"d":"1786.67"},{"v":1773.2833333333335,"d":"1773.28"},{"v":1747.6166666666668,"d":"1747.62"},{"v":1734.2333333333336,"d":"1734.23"},{"v":1812.3333333333335,"d":"1812.33"},{"v":1825.7166666666667,"d":"1825.72"},{"v":1851.3833333333334,"d":"1851.38"},1800.05,1761,0.72676]
[11,"AUBANK",585.55,587.65,{"v":581.4,"d":"581.40"},577.25,{"v":571,"d":"571.00"},{"v":591.8,"d":"591.80"},598.05,{"v":602.1999999999999,"d":"602.20"},593.9,583.5,2.15777]
{"$rows_left_out":228}
{"sheet":"MidCap Intra","index":3,"n_rows":510,"n_cols":13,"rows_kept":510,"merged":[[0,0,0,1],[8,0,9,0],[8,1,9,1],[8,2,9,2],[8,3,9,3],[8,4,8,6],[8,7,8,9]]}
[]
[]
[]
[]
[{"$nulls":11},"Back To Main Page"]
["FOR INTRA DAY TRADING",{"$nulls":9},{"$f":"Main!B10","v":"2019-04-11"}]
[null,null," "]
[]
["Sr.no","Scrip","CLOSE RATE","Pivot Point","Supports",null,null,"Resistances"]
[null,null,"Point",null,"S1","S2","S3","R1","R2","R3","HIGH","LOW","Total Trade Quanity in Lakhs"]
[1,"3MINDIA",24294.3,{"v":24096.233333333337,"d":"24096.23"},{"v":23592.466666666674,"d":"23592.47"},{"v":22890.63333333334,"d":"22890.63"},{"v":22386.866666666676,"d":"22386.87"},{"v":24798.066666666673,"d":"24798.07"},{"v":25301.833333333336,"d":"25301.83"},{"v":26003.66666666667,"d":"26003.67"},24600,23394.4,0.0421]
[2,"8KMILES",103.8,{"v":103.48333333333335,"d":"103.48"},{"v":101.4666666666667,"d":"101.47"},{"v":99.13333333333335,"d":"99.13"},{"v":97.1166666666667,"d":"97.12"},{"v":105.81666666666669,"d":"105.82"},{"v":107.83333333333334,"d":"107.83"},{"v":110.16666666666669,"d":"110.17"},105.5,101.15,1.88739]
[3,"AARTIIND",1640.2,{"v":1646.8500000000001,"d":"1646.85"},{"v":1619.0000000000002,"d":"1619.00"},{"v":1597.8000000000002,"d":"1597.80"},{"v":1569.9500000000003,"d":"1569.95"},{"v":1668.0500000000002,"d":"1668.05"},{"v":1695.9,"d":"1695.90"},{"v":1717.1000000000001,"d":"1717.10"},1674.7,1625.65,0.80498]
[4,"ABAN",58.25,{"v":58.53333333333333,"d":"58.53"},{"v":57.71666666666666,"d":"57.72"},{"v":57.18333333333333,"d":"57.18"},{"v":56.36666666666666,"d":"56.37"},{"v":59.06666666666666,"d":"59.07"},{"v":59.883333333333326,"d":"59.88"},{"v":60.416666666666664,"d":"60.42"},59.35,58,0.33968]
[5,"ABB",1381.55,{"v":1386.5166666666667,"d":"1386.52"},{"v":1366.0333333333333,"d":"1366.03"},{"v":1350.5166666666667,"d":"1350.52"},{"v":1330.0333333333333,"d":"1330.03"},{"v":1402.0333333333333,"d":"1402.03"},{"v":1422.5166666666664,"d":"1422.52"},{"v":1438.0333333333333,"d":"1438.03"},1407,1371,0.68864]
[6,"ABCAPITAL",96.65,{"v":97.11666666666667,"d":"97.12"},{"v":95.93333333333335,"d":"95.93"},{"v":95.21666666666668,"d":"95.22"},{"v":94.03333333333336,"d":"94.03"},{"v":97.83333333333334,"d":"97.83"},{"v":99.01666666666668,"d":"99.02"},{"v":99.73333333333333,"d":"99.73"},98.3,96.4,14.07939]
[7,"ABFRL",222.7,{"v":222.0666666666667,"d":"222.07"},{"v":220.13333333333338,"d":"220.13"},{"v":217.5666666666667,"d":"217.57"},{"v":215.63333333333338,"d":"215.63"},{"v":224.63333333333338,"d":"224.63"},{"v":226.56666666666672,"d":"226.57"},{"v":229.13333333333338,"d":"229.13"},224,219.5,7.28505]
[8,"ACC",1636.65,{"v":1640.8500000000001,"d":"1640.85"},{"v":1625.8000000000002,"d":"1625.80"},1614.95,{"v":1599.9,"d":"1599.90"},{"v":1651.7000000000003,"d":"1651.70"},1666.75,{"v":1677.6000000000004,"d":"1677.60"},1655.9,1630,5.59285]
[9,"ADANIPORTS",383.45,{"v":381.34999999999997,"d":"381.35"},{"v":377.29999999999995,"d":"377.30"},371.15,{"v":367.09999999999997,"d":"367.10"},{"v":387.49999999999994,"d":"387.50"},391.55,{"v":397.69999999999993,"d":"397.70"},385.4,375.2,20.67637]
[10,"ADANIPOWER",49.05,{"v":49.416666666666664,"d":"49.42"},{"v":48.43333333333333,"d":"48.43"},{"v":47.81666666666666,"d":"47.82"},{"v":46.83333333333333,"d":"46.83"},{"v":50.03333333333333,"d":"50.03"},{"v":51.016666666666666,"d":"51.02"},{"v":51.63333333333333,"d":"51.63"},50.4,48.8,80.75543]
{"$rows_left_out":491}
{"sheet":"Bulk Deals","index":4,"n_rows":82,"n_cols":8,"rows_kept":82,"merged":[[4,0,4,1],[4,2,4,3],[6,1,6,2]]}
[" "]
[]
[]
[]
[]
[{"$nulls":4},"Back To Main Page"]
["Subject :","BULK DEAL",null,{"$f":"Main!B10","v":"2019-04-11"}]
[]
["Date","Scrip code","Scrip Name","Client Name","Buy / Sell","Quantity Traded","Trade Price / Wt.Avg.trade price","Exchange  "]
["2019-04-10",542580,"AARTECH","MAHENDRAKUMAR HARJIVANDAS KHANDHAR","SELL",{"v":48000,"d":"48,000"},34.8,"BSE"]
["2019-04-10",542580,"AARTECH","AKHILESH SHUKLA","BUY",{"v":144000,"d":"144,000"},35.33,"BSE"]
["2019-04-10",542580,"AARTECH","MAHESH TOLANI","SELL",140000,35.34,"BSE"]
["2019-04-10",540024,"ASHARI","PRADIP KUMAR","SELL",118650,9.32,"BSE"]
["2019-04-10",540024,"ASHARI","SANJIV SURENDERSINGH VARMA","BUY",53650,9.32,"BSE"]
["2019-04-10",537766,"BCP","ACHINTYA SECURITIES PVT. LTD.","BUY",399644,38.64,"BSE"]
["2019-04-10",537766,"BCP","ACHINTYA SECURITIES PVT. LTD.","SELL",399644,38.21,"BSE"]
["2019-04-10",540956,"BHATIA","NEWEDGE VINIMAY PRIVATE LIMITED","SELL",68000,81.86,"BSE"]
["2019-04-10",540903,"CRPRISK","KUSUM JAGANNATH PARCHURE","BUY",100000,38,"BSE"]
["2019-04-10",540903,"CRPRISK","BIJAL HIMANSHU GANDHI","BUY",16000,36,"BSE"]
["2019-04-10",540903,"CRPRISK","BIJAL HIMANSHU GANDHI","SELL",98000,38.01,"BSE"]
{"$rows_left_out":63}
{"sheet":"Call Tracker (Equity & F&O)","index":5,"n_rows":303,"n_cols":18,"rows_kept":303,"merged":[[32,0,33,0],[32,1,33,1],[32,2,33,2],[32,9,33,9],[32,11,33,11],[32,12,33,12],[32,13,33,13],[32,14,33,14],[34,0,35,0],[34,1,35,1],[34,2,35,2],[34,9,35,9],[34,11,35,11],[34,12,35,12],[34,13,35,13],[34,14,35,14],[46,0,47,0],[46,1,47,1],[46,2,47,2],[46,9,47,9],[46,11,47,11],[46,12,47,12],[46,13,47,13],[46,14,47,14],[50,0,51,0],[50,1,51,1],[50,2,51,2],[50,9,51,9],[50,11,51,11],[50,12,51,12],[50,13,51,13],[50,14,51,14],[54,0,55,0],[54,1,55,1],[54,2,55,2],[54,9,55,9],[54,11,55,11],[54,12,55,12],[54,13,55,13],[54,14,55,14],[56,0,57,0],[56,1,57,1],[56,2,57,2],[56,9,57,9],[56,11,57,11],[56,12,57,12],[56,13,57,13],[56,14,57,14]]}
[]
[]
[]
[]
[{"$nulls":12},"Back To Main Page"]
["Retail Research Technical Calls & Fundamental Performance Report for the month of April -2019 "]
[{"$nulls":12},{"$f":"Main!B10","v":"2019-04-11"}]
[null,"Positional  Call"]
["Sr.no","Date",null,"Company","Rec","Rec Price","Stop Loss***","Call Closed At","Target","Remark","Profit / Loss per Share","Gain / Loss  %","Status","Closed Date","NSE Closed Price"]
[1,"2019-03-07",null,"RAYMOND","Sell","825-830",888.8,null,"720-730","Open",{"$nulls":4},{"$f":"VLOOKUP(D10,Sheet2!A16:M1811,6,0)","v":777.85},null,null,"R"]
[2,"2019-03-13",null,"DLF","Sell",193,206.6,206.6,"164-168 ","Loss of Rs.13.6/-",{"$f":"F11-H11","v":-13.599999999999994},{"$f":"K11/F11","v":{"v":-0.07046632124352328,"d":"-7.05%"}},"Unsuccessful","2019-04-03",{"$nulls":3},"R"]
[3,"2019-03-15",null,"OFSS","Buy",3395,3250,3497,"3650-3700"," Profit of Rs.102/-",{"$f":"H12-F12","v":102},{"$f":"K12/F12","v":{"v":0.03004418262150221,"d":"3.00%"}},"Successful","2019-04-03",{"$nulls":3},"H"]
[4,"2019-03-20",null,"HEROMOTOCO","Buy","2610-2630",2490,null,"2850-2900","Open",{"$nulls":4},{"$f":"VLOOKUP(D13,Sheet2!A19:M1814,6,0)","v":2594.4},null,null,"H"]
[5,"2019-03-25",null,"MARUTI","Buy",6600,6290,6940,"7000-7100"," Profit of Rs.340/-",{"$f":"H14-F14","v":340},{"$f":"K14/F14","v":{"v":0.051515151515151514,"d":"5.15%"}},"Successful","2019-04-03",{"$nulls":3},"R"]
[6,"2019-04-01",null,"WIPRO","Buy",258,248,268.5,280," Profit of Rs.10.5/-",10.5,{"v":0.040697674418604654,"d":"4.07%"},"Successful","2019-04-09",{"$nulls":3},"H"]
[7,"2019-04-03",null,"BOSCHLTD","Buy","17950-18000",16850,null,"19500-20000","Open",{"$nulls":4},{"$f":"VLOOKUP(D16,Sheet2!A22:M1817,6,0)","v":17788.65},null,null,"R"]
[8,"2019-04-05",null,"YESBANK","Sell",274,292,259.5,"245-240"," Profit of Rs.14.5/-",{"$f":"F17-H17","v":14.5},{"$f":"K17/F17","v":{"v":0.05291970802919708,"d":"5.29%"}},"Successful","2019-04-08",{"$nulls":3},"H"]
[9,"2019-04-08",null,"BERGEPAINT","Sell",331,343,321," 310-300"," Profit of Rs.10/-",{"$f":"F18-H18","v":10},{"v":0.030211480362537766,"d":"3.02%"},"Successful","2019-04-10",{"$nulls":3},"H"]
[10,"2019-04-08",null,"BAJFINANCE","Sell","3000-3010",3166.6,null,"2750-2700","Open",{"$nulls":7},"R"]
[11,"2019-04-10",null,"JUBLFOOD","Buy","1410-1420",1348.8,null,"1550-1570","Open",{"$nulls":7},"R"]
{"$rows_left_out":261}
{"sheet":"Sheet2","index":6,"n_rows":1641,"n_cols":14,"rows_kept":1641,"hidden":true}
["SYMBOL","SERIES","OPEN","HIGH","LOW","CLOSE","LAST","PREVCLOSE","TOTTRDQTY","TOTTRDVAL","TIMESTAMP","TOTALTRADES","ISIN","ISIN"]
["20MICRONS","EQ",38.7,39,37.7,38,37.7,38.45,22136,852890.65,"2019-04-10",281,"INE144J01027"]
["21STCENMGM","EQ",22.3,22.3,22.3,22.3,22.3,21.9,1678,37419.4,"2019-04-10",18,"INE253B01015"]
["3IINFOTECH","EQ",3.8,3.85,3.75,3.75,3.75,3.8,1057581,4027448.2,"2019-04-10",370,"INE748C01020"]
["3MINDIA","EQ",23394.4,24600,23394.4,24294.3,24393,23359.1,4210,102054240.95,"2019-04-10",1389,"INE470A01017"]
["3PLAND","EQ",10.95,10.95,10.5,10.7,10.7,10.75,665,7235.75,"2019-04-10",7,"INE105C01023"]
["5PAISA","EQ",236.15,244.9,233.1,235.95,234.05,238.15,13310,3173010.05,"2019-04-10",480,"INE618L01018"]
["63MOONS","EQ",81.15,81.15,79.15,79.55,79.55,81.2,103280,8272129.8,"2019-04-10",2371,"INE111B01023"]
["8KMILES","EQ",102.65,105.5,101.15,103.8,103.6,101.65,188739,19542730.35,"2019-04-10",2552,"INE650K01021"]
["A2ZINFRA","EQ",19,19.25,18.2,18.55,18.5,19,128949,2421686.3,"2019-04-10",568,"INE619I01012"]
["AARTIDRUGS","EQ",632.9,639.9,630,634.95,632.4,634.6,6449,4090860.45,"2019-04-10",530,"INE767A01016"]
["AARTIIND","EQ",1635.1,1674.7,1625.65,1640.2,1637.85,1637.05,80498,133450921.3,"2019-04-10",6345,"INE769A01020"]
["AARVEEDEN","EQ",23.05,23.9,23,23.55,23.5,23.3,11653,272027.6,"2019-04-10",67,"INE273D01019"]
["AAVAS","EQ",1144.55,1173,1135,1168.6,1164.9,1136.3,9497,11000625.85,"2019-04-10",1211,"INE216P01012"]
["ABAN","BE",58,59.35,58,58.25,58.7,58.75,33968,1988826.05,"2019-04-10",532,"INE421A01028"]
["ABB","EQ",1405,1407,1371,1381.55,1374.7,1408.35,68864,96145548.35,"2019-04-10",6000,"INE117A01022"]
["ABBOTINDIA","EQ",7375,7375,7309.95,7338.25,7369,7332.3,959,7041793.4,"2019-04-10",284,"INE358A01014"]
["ABCAPITAL","EQ",97.3,98.3,96.4,96.65,96.6,97,1407939,137056296.6,"2019-04-10",9154,"INE674K01013"]
["ABFRL","EQ",221.65,224,219.5,222.7,222.5,218.15,728505,161745769.05,"2019-04-10",14333,"INE647O01011"]
["ACC","EQ",1652.6,1655.9,1630,1636.65,1640,1654.3,559285,918016102.6,"2019-04-10",17238,"INE012A01025"]
{"$rows_left_out":1622}
{"sheet":"Sheet1","index":7,"n_rows":0,"n_cols":0,"rows_kept":0,"hidden":true}

{"sheet":"Sheet3","index":8,"n_rows":0,"n_cols":0,"rows_kept":0,"hidden":true}

{"sheet":"Sheet4","index":9,"n_rows":0,"n_cols":0,"rows_kept":0,"hidden":true}