{"text_format":"3","workbook":"xlsx","n_sheets":9,"sheets":["Main","Future Intra","Cash Intra","MidCap Intra","Bulk Deals","Call Tracker (Equity & F&O)","Sheet2","Sheet1","Sheet3"],"not_rendered":{"images":4,"defined_names":4},"read":"whole","date_system":"1900"}

{"sheet":"Main","index":0,"n_rows":17,"n_cols":4,"rows_kept":17}
[null,"                                                                                                 "]
{"$rows_empty":8}
[null,"2019-03-11"]
[]
[null,"Sheet No.","Template Name","Summary"]
[null,1,"Future Intra","For Intraday trading in F&O segment"]
[null,2,"Cash Intra","For Intraday trading in cash market segment"]
[null,3,"Mid-cap Intra","For Intraday trading in Mid-cap stocks"]
[null,4,"Bulk Deals","Reveals Bulk Deals carried on NSE & BSE"]
[null,5,"Call Tracker"]

{"sheet":"Future Intra","index":1,"n_rows":237,"n_cols":15,"rows_kept":237,"merged":[[8,0,9,0],[8,1,9,1],[8,2,9,2],[8,5,8,7],[8,8,8,10]]}
[]
[]
[]
[]
[{"$nulls":12},"Back to Main Page"]
["FOR INTRA DAY TRADING",{"$nulls":10},{"$f":"Main!B10","v":"2019-03-11"}]
[]
[]
["Sr.no","Sector","Scrip","CLOSE RATE","Pivot Point","Supports",null,null,"Resistances"]
[null,"Sector",null,"Point","Point","S1","S2","S3","R1","R2","R3","HIGH","LOW","OI","% Change in OI"]
[1,"Index","BANKNIFTY",27883.15,{"v":27837.716666666664,"d":"27837.72"},{"v":27755.433333333327,"d":"27755.43"},{"v":27627.716666666664,"d":"27627.72"},{"v":27545.433333333327,"d":"27545.43"},{"v":27965.433333333327,"d":"27965.43"},{"v":28047.71666666666,"d":"28047.72"},{"v":28175.433333333327,"d":"28175.43"},27920,27710,2133460,{"v":0.008079910790224725,"d":"0.81%"}]
[2,"Index","NIFTY",11076.05,{"v":11064.366666666669,"d":"11064.37"},{"v":11044.883333333337,"d":"11044.88"},{"v":11013.716666666669,"d":"11013.72"},{"v":10994.233333333337,"d":"10994.23"},{"v":11095.533333333336,"d":"11095.53"},{"v":11115.016666666666,"d":"11115.02"},{"v":11146.183333333336,"d":"11146.18"},11083.85,11033.2,15595650,{"v":1.7004754587189108E-3,"d":"0.17%"}]
[3,"Index","NIFTYIT",{"v":15488,"d":"15488.00"},{"v":15543.666666666666,"d":"15543.67"},{"v":15419.333333333332,"d":"15419.33"},{"v":15350.666666666666,"d":"15350.67"},{"v":15226.333333333332,"d":"15226.33"},{"v":15612.333333333332,"d":"15612.33"},{"v":15736.666666666664,"d":"15736.67"},{"v":15805.333333333332,"d":"15805.33"},15668,15475,19800,{"v":0.09090909090909091,"d":"9.09%"}]
[4,"Cement","ACC",{"v":1584,"d":"1584.00"},{"v":1574.8333333333333,"d":"1574.83"},{"v":1560.1666666666665,"d":"1560.17"},{"v":1536.3333333333333,"d":"1536.33"},{"v":1521.6666666666665,"d":"1521.67"},{"v":1598.6666666666665,"d":"1598.67"},{"v":1613.333333333333,"d":"1613.33"},{"v":1637.1666666666665,"d":"1637.17"},1589.5,1551,2326000,{"v":0.014126264387861876,"d":"1.41%"}]
[5,"Others","ADANIENT",138.75,{"v":138.13333333333333,"d":"138.13"},{"v":136.36666666666665,"d":"136.37"},{"v":133.98333333333332,"d":"133.98"},{"v":132.21666666666664,"d":"132.22"},{"v":140.51666666666665,"d":"140.52"},{"v":142.2833333333333,"d":"142.28"},{"v":144.66666666666666,"d":"144.67"},139.9,135.75,40360000,{"v":0.005982053838484547,"d":"0.60%"}]
[6,"Others","ADANIPORTS",344.25,{"v":342.9166666666667,"d":"342.92"},{"v":340.78333333333336,"d":"340.78"},{"v":337.31666666666666,"d":"337.32"},{"v":335.18333333333334,"d":"335.18"},{"v":346.3833333333334,"d":"346.38"},{"v":348.5166666666667,"d":"348.52"},{"v":351.9833333333334,"d":"351.98"},345.05,339.45,24657500,{"v":-5.54547287759629E-3,"d":"-0.55%"}]
[7,"Power","ADANIPOWER",{"v":50.2,"d":"50.20"},{"v":50.21666666666666,"d":"50.22"},{"v":49.533333333333324,"d":"49.53"},{"v":48.86666666666666,"d":"48.87"},{"v":48.18333333333332,"d":"48.18"},{"v":50.883333333333326,"d":"50.88"},{"v":51.56666666666666,"d":"51.57"},{"v":52.23333333333333,"d":"52.23"},50.9,49.55,160060000,{"v":0.012141140761350701,"d":"1.21%"}]
[8,"Pharma","AJANTPHARM",{"v":958.6,"d":"958.60"},{"v":956.9166666666666,"d":"956.92"},{"v":945.8833333333332,"d":"945.88"},{"v":933.1666666666666,"d":"933.17"},{"v":922.1333333333332,"d":"922.13"},{"v":969.6333333333332,"d":"969.63"},{"v":980.6666666666667,"d":"980.67"},{"v":993.3833333333332,"d":"993.38"},967.95,944.2,1008500,{"v":0.04183884297520661,"d":"4.18%"}]
[9,"Banking","ALBK",{"v":54,"d":"54.00"},{"v":53.666666666666664,"d":"53.67"},{"v":52.43333333333333,"d":"52.43"},{"v":50.86666666666667,"d":"50.87"},{"v":49.63333333333333,"d":"49.63"},{"v":55.23333333333333,"d":"55.23"},{"v":56.46666666666666,"d":"56.47"},{"v":58.033333333333324,"d":"58.03"},54.9,52.1,26923000,{"v":0.02626362735381566,"d":"2.63%"}]
[10,"Automobile","AMARAJABAT",{"v":743.8,"d":"743.80"},{"v":743.3833333333333,"d":"743.38"},{"v":736.5666666666666,"d":"736.57"},{"v":729.3333333333333,"d":"729.33"},{"v":722.5166666666665,"d":"722.52"},{"v":750.6166666666667,"d":"750.62"},{"v":757.4333333333335,"d":"757.43"},{"v":764.6666666666667,"d":"764.67"},750.2,736.15,735700,{"v":-0.008490566037735849,"d":"-0.85%"}]
{"$rows_left_out":208}
{"sheet":"Cash Intra","index":2,"n_rows":247,"n_cols":13,"rows_kept":247,"merged":[[7,0,8,0],[7,1,8,1],[7,2,8,2],[7,3,8,3],[7,4,7,6],[7,7,7,9]]}
[]
[]
[]
[]
[{"$nulls":12},"Back to Main Page"]
["FOR INTRA DAY TRADING",{"$nulls":9},{"$f":"Main!B10","v":"2019-03-11"}]
[]
["Sr.no","Scrip","CLOSE RATE","Pivot Point","Supports",null,null,"Resistances"]
[null,null,"Point",null,"S1","S2","S3","R1","R2","R3","HIGH","LOW","Total Trade Quanity in Lakhs"]
[1,"Nifty 50",11035.4,{"v":11031.116666666669,"d":"11031.12"},{"v":11013.233333333337,"d":"11013.23"},{"v":10991.06666666667,"d":"10991.07"},{"v":10973.183333333338,"d":"10973.18"},{"v":11053.283333333336,"d":"11053.28"},{"v":11071.166666666668,"d":"11071.17"},{"v":11093.333333333336,"d":"11093.33"},11049,11008.95]
[2,"Nifty Bank",27761.8,{"v":27739.516666666663,"d":"27739.52"},{"v":27667.683333333327,"d":"27667.68"},{"v":27573.566666666666,"d":"27573.57"},{"v":27501.73333333333,"d":"27501.73"},{"v":27833.633333333324,"d":"27833.63"},{"v":27905.46666666666,"d":"27905.47"},{"v":27999.58333333332,"d":"27999.58"},27811.35,27645.4]
[3,"Nifty CPSE",2119.1,2113.75,{"v":2093.5,"d":"2093.50"},{"v":2067.9,"d":"2067.90"},2047.65,2139.35,{"v":2159.6,"d":"2159.60"},{"v":2185.2,"d":"2185.20"},2134,2088.15]
[4,"Nifty Infra",3038.55,{"v":3040,"d":"3040.00"},3022.05,3005.55,{"v":2987.6000000000004,"d":"2987.60"},{"v":3056.5,"d":"3056.50"},3074.45,3090.95,3057.95,3023.5]
[5,"Nifty IT",15408.7,{"v":15447.516666666668,"d":"15447.52"},{"v":15349.383333333337,"d":"15349.38"},{"v":15290.06666666667,"d":"15290.07"},{"v":15191.933333333338,"d":"15191.93"},{"v":15506.833333333336,"d":"15506.83"},{"v":15604.966666666667,"d":"15604.97"},{"v":15664.283333333335,"d":"15664.28"},15545.65,15388.2]
[6,"Nifty PSE",3383.15,{"v":3376.316666666667,"d":"3376.32"},{"v":3352.983333333334,"d":"3352.98"},{"v":3322.816666666667,"d":"3322.82"},{"v":3299.483333333334,"d":"3299.48"},{"v":3406.483333333334,"d":"3406.48"},{"v":3429.816666666667,"d":"3429.82"},{"v":3459.983333333334,"d":"3459.98"},3399.65,3346.15]
[7,"Nifty Midcap 50",4795.5,{"v":4799,"d":"4799.00"},4769.95,{"v":4744.4,"d":"4744.40"},{"v":4715.349999999999,"d":"4715.35"},4824.55,{"v":4853.599999999999,"d":"4853.60"},{"v":4879.150000000001,"d":"4879.15"},4828.05,4773.45]
[8,"ABB",1266,{"v":1264.8500000000001,"d":"1264.85"},{"v":1249.9500000000003,"d":"1249.95"},{"v":1233.9,"d":"1233.90"},{"v":1219.0000000000002,"d":"1219.00"},{"v":1280.9000000000003,"d":"1280.90"},{"v":1295.8000000000004,"d":"1295.80"},{"v":1311.8500000000004,"d":"1311.85"},1279.75,1248.8,1.25797]
[9,"ACC",1574.55,{"v":1566.5,"d":"1566.50"},1553.05,1531.55,{"v":1518.1,"d":"1518.10"},{"v":1588,"d":"1588.00"},{"v":1601.4499999999998,"d":"1601.45"},1622.95,1579.95,1545,8.47268]
[10,"AIAENG",1829.8,{"v":1816.9833333333336,"d":"1816.98"},{"v":1793.9666666666672,"d":"1793.97"},{"v":1758.1333333333337,"d":"1758.13"},{"v":1735.1166666666672,"d":"1735.12"},{"v":1852.816666666667,"d":"1852.82"},{"v":1875.8333333333335,"d":"1875.83"},{"v":1911.666666666667,"d":"1911.67"},1840,1781.15,0.08515]
[11,"AUBANK",584.5,{"v":582.6666666666666,"d":"582.67"},{"v":577.3333333333333,"d":"577.33"},{"v":570.1666666666666,"d":"570.17"},{"v":564.8333333333333,"d":"564.83"},{"v":589.8333333333333,"d":"589.83"},{"v":595.1666666666665,"d":"595.17"},{"v":602.3333333333333,"d":"602.33"},588,575.5,0.75292]
{"$rows_left_out":228}
{"sheet":"MidCap Intra","index":3,"n_rows":510,"n_cols":13,"rows_kept":510,"merged":[[0,0,0,1],[8,0,9,0],[8,1,9,1],[8,2,9,2],[8,3,9,3],[8,4,8,6],[8,7,8,9]]}
[]
[]
[]
[]
[{"$nulls":11},"Back To Main Page"]
["FOR INTRA DAY TRADING",{"$nulls":9},{"$f":"Main!B10","v":"2019-03-11"}]
[null,null," "]
[]
["Sr.no","Scrip","CLOSE RATE","Pivot Point","Supports",null,null,"Resistances"]
[null,null,"Point",null,"S1","S2","S3","R1","R2","R3","HIGH","LOW","Total Trade Quanity in Lakhs"]
[1,"3MINDIA",24848.15,{"v":24594.833333333332,"d":"24594.83"},{"v":24215.716666666664,"d":"24215.72"},{"v":23583.283333333333,"d":"23583.28"},{"v":23204.166666666664,"d":"23204.17"},{"v":25227.266666666663,"d":"25227.27"},{"v":25606.38333333333,"d":"25606.38"},{"v":26238.816666666662,"d":"26238.82"},24973.95,23962.4,0.06591]
[2,"8KMILES",108.15,{"v":108.61666666666667,"d":"108.62"},{"v":106.53333333333335,"d":"106.53"},{"v":104.91666666666667,"d":"104.92"},{"v":102.83333333333334,"d":"102.83"},{"v":110.23333333333335,"d":"110.23"},{"v":112.31666666666666,"d":"112.32"},{"v":113.93333333333335,"d":"113.93"},110.7,107,1.46825]
[3,"AARTIIND",1474.55,{"v":1486.8500000000001,"d":"1486.85"},{"v":1453.7000000000003,"d":"1453.70"},{"v":1432.8500000000001,"d":"1432.85"},{"v":1399.7000000000003,"d":"1399.70"},{"v":1507.7000000000003,"d":"1507.70"},{"v":1540.8500000000004,"d":"1540.85"},{"v":1561.7000000000003,"d":"1561.70"},1520,1466,1.14972]
[4,"ABAN",75.05,{"v":74.11666666666666,"d":"74.12"},{"v":71.63333333333333,"d":"71.63"},{"v":68.21666666666667,"d":"68.22"},{"v":65.73333333333333,"d":"65.73"},{"v":77.53333333333332,"d":"77.53"},{"v":80.01666666666664,"d":"80.02"},{"v":83.43333333333331,"d":"83.43"},76.6,70.7,16.80981]
[5,"ABB",1266,{"v":1264.8500000000001,"d":"1264.85"},{"v":1249.9500000000003,"d":"1249.95"},{"v":1233.9,"d":"1233.90"},{"v":1219.0000000000002,"d":"1219.00"},{"v":1280.9000000000003,"d":"1280.90"},{"v":1295.8000000000004,"d":"1295.80"},{"v":1311.8500000000004,"d":"1311.85"},1279.75,1248.8,1.25797]
[6,"ABCAPITAL",100,99.75,{"v":98.5,"d":"98.50"},{"v":97,"d":"97.00"},95.75,101.25,{"v":102.5,"d":"102.50"},{"v":104,"d":"104.00"},101,98.25,30.25599]
[7,"ABFRL",223.4,{"v":224.16666666666666,"d":"224.17"},{"v":221.2833333333333,"d":"221.28"},{"v":219.16666666666666,"d":"219.17"},{"v":216.2833333333333,"d":"216.28"},{"v":226.2833333333333,"d":"226.28"},{"v":229.16666666666669,"d":"229.17"},{"v":231.2833333333333,"d":"231.28"},227.05,222.05,13.97701]
[8,"ACC",1574.55,{"v":1566.5,"d":"1566.50"},1553.05,1531.55,{"v":1518.1,"d":"1518.10"},{"v":1588,"d":"1588.00"},{"v":1601.4499999999998,"d":"1601.45"},1622.95,1579.95,1545,8.47268]
[9,"ADANIPORTS",342.15,{"v":341.06666666666666,"d":"341.07"},{"v":339.18333333333334,"d":"339.18"},{"v":336.2166666666667,"d":"336.22"},{"v":334.33333333333337,"d":"334.33"},{"v":344.0333333333333,"d":"344.03"},{"v":345.91666666666663,"d":"345.92"},{"v":348.88333333333327,"d":"348.88"},342.95,338.1,22.65]
[10,"ADANIPOWER",50,{"v":50.03333333333333,"d":"50.03"},{"v":49.31666666666666,"d":"49.32"},{"v":48.63333333333333,"d":"48.63"},{"v":47.916666666666664,"d":"47.92"},{"v":50.71666666666666,"d":"50.72"},{"v":51.43333333333333,"d":"51.43"},{"v":52.11666666666666,"d":"52.12"},50.75,49.35,119.08805]
{"$rows_left_out":491}
{"sheet":"Bulk Deals","index":4,"n_rows":140,"n_cols":8,"rows_kept":140,"merged":[[4,0,4,1],[4,2,4,3],[6,1,6,2]]}
[" "]
[]
[]
[]
[]
[{"$nulls":4},"Back To Main Page"]
["Subject :","BULK DEAL",null,{"$f":"Main!B10","v":"2019-03-11"}]
[]
["Date","Scrip code","Scrip Name","Client Name","Buy / Sell","Quantity Traded","Trade Price / Wt.Avg.trade price","Exchange  "]
["2019-03-08",540025,"ADVENZYMES","CHANDRAKANT RATHI INNOVATIONS & PROJECTS PVT LTD","SELL",{"v":1166880,"d":"1,166,880"},177,"BSE"]
["2019-03-08",540025,"ADVENZYMES","ATHARVA GREEN ECOTECH LLP","SELL",{"v":3482350,"d":"3,482,350"},176.95,"BSE"]
["2019-03-08",540025,"ADVENZYMES","ORBIMED ASIA III MAURITIUS LIMITED","BUY",5526624,176.63,"BSE"]
["2019-03-08",511463,"ALEXANDER","KAHAR NIKLESH KANAIYABHAI","BUY",63292,16.09,"BSE"]
["2019-03-08",511463,"ALEXANDER","KAHAR NIKLESH KANAIYABHAI","SELL",65834,16.08,"BSE"]
["2019-03-08",511463,"ALEXANDER","OMSHANTHI COMMODITIES","BUY",75010,16.1,"BSE"]
["2019-03-08",511463,"ALEXANDER","OMSHANTHI COMMODITIES","SELL",75010,16.05,"BSE"]
["2019-03-08",542460,"ANUP","AVADH MATERIAL AND EQUIPMENT SUPPLIERS LLP","BUY",59633,556.53,"BSE"]
["2019-03-08",540024,"ASHARI","ARCADIA SHARE & STOCK BROKERS PVT. LTD","SELL",54770,6.66,"BSE"]
["2019-03-08",540024,"ASHARI","VIJAY KUMAR AGGARWAL","SELL",68183,6.66,"BSE"]
["2019-03-08",532382,"BALAJITELE","SHOBHA RAVI KAPOOR","BUY",702964,87,"BSE"]
{"$rows_left_out":121}
{"sheet":"Call Tracker (Equity & F&O)","index":5,"n_rows":411,"n_cols":18,"rows_kept":411,"merged":[[36,0,37,0],[36,1,37,1],[36,2,37,2],[36,9,37,9],[36,11,37,11],[36,12,37,12],[36,13,37,13],[36,14,37,14],[39,0,40,0],[39,1,40,1],[39,2,40,2],[39,9,40,9],[39,11,40,11],[39,12,40,12],[39,13,40,13],[39,14,40,14],[52,0,53,0],[52,1,53,1],[52,2,53,2],[52,9,53,9],[52,11,53,11],[52,12,53,12],[52,13,53,13],[52,14,53,14]]}
[]
[]
[]
[]
[{"$nulls":12},"Back To Main Page"]
["Retail Research Technical Calls & Fundamental Performance Report for the month of March -2019 "]
[{"$nulls":12},{"$f":"Main!B10","v":"2019-03-11"}]
[null,"Positional  Call"]
["Sr.no","Date",null,"Company","Rec","Rec Price","Stop Loss***","Call Closed At","Target","Remark","Profit / Loss per Share","Gain / Loss  %","Status","Closed Date","NSE Closed Price"]
[1,"2019-01-24",null,"ITC","Buy",280,268,292,305,"Profit of Rs.12/-",{"$f":"H10-F10","v":12},{"$f":"K10/F10","v":{"v":0.04285714285714286,"d":"4.29%"}},"Successful","2019-03-08",{"$nulls":3},"R"]
[2,"2019-03-01",null,"UPL","Sell","879-884",922.2,null,800,"Open",{"$nulls":4},{"$f":"VLOOKUP(D11,Sheet2!A11:M1806,6,0)","v":872.05},null,null,"R"]
[3,"2019-03-01",null,"BEL","Buy",83,78.5,86.25,92,"Profit of Rs.3.25/-",3.25,{"$f":"K12/F12","v":{"v":0.0391566265060241,"d":"3.92%"}},"Successful","2019-03-05",{"$nulls":3},"H"]
[4,"2019-03-01",null,"ZEEL","Sell",478.5,507.3,458.5,"435-425","Profit of Rs.20/-",{"$f":"F13-H13","v":20},{"$f":"K13/F13","v":{"v":0.04179728317659352,"d":"4.18%"}},"Successful","2019-03-07",{"$nulls":3},"R"]
[5,"2019-03-06",null,"MARUTI","Buy","7010-7040",6700,null,"7500-7600","Open",{"$nulls":4},{"$f":"VLOOKUP(D14,Sheet2!A14:M1809,6,0)","v":7029.05},null,null,"H"]
[6,"2019-03-07",null,"BPCL","Sell",376.5,395.6,365,"345-335","Part Profit of Rs.11.5/-",{"$f":"F15-H15","v":11.5},{"$f":"K15/F15","v":{"v":0.03054448871181939,"d":"3.05%"}},"Successful","2019-03-08",{"$nulls":3},"R"]
[7,"2019-03-07",null,"RAYMOND","Sell","825-830",888.8,null,"720-730","Open",{"$nulls":4},{"$f":"VLOOKUP(D16,Sheet2!A16:M1811,6,0)","v":815.15},null,null,"R"]
[8,"2019-03-08",null,"BHEL","Sell","67-68",70.5,null,"63-61","Open",{"$nulls":4},{"$f":"VLOOKUP(D17,Sheet2!A17:M1812,6,0)","v":68.1},null,null,"H"]
{"$rows_empty":14}
["CLBS = Closing Basis ***",{"$nulls":4},"Reinitiated $"]
["Dividend adjusted <>",{"$nulls":4},"Revised stoploss #"]
{"$rows_left_out":237}
{"sheet":"Sheet2","index":6,"n_rows":1640,"n_cols":14,"rows_kept":1640,"hidden":true}
["SYMBOL","SERIES","OPEN","HIGH","LOW","CLOSE","LAST","PREVCLOSE","TOTTRDQTY","TOTTRDVAL","TIMESTAMP","TOTALTRADES","ISIN","ISIN"]
["20MICRONS","EQ",41.4,41.4,39,39.45,39.5,40.55,20465,823732.65,"2019-03-07",350,"INE144J01027"]
["21STCENMGM","EQ",18.45,18.8,18.15,18.5,18.5,18.45,879,16358.45,"2019-03-07",17,"INE253B01015"]
["3IINFOTECH","EQ",3.75,3.85,3.65,3.65,3.7,3.8,2861941,10673046.8,"2019-03-07",909,"INE748C01020"]
["3MINDIA","EQ",23270,24199.1,23016.7,23834.5,23800,23252.1,5869,139849795.25,"2019-03-07",3117,"INE470A01017"]
["3PLAND","EQ",11.2,11.2,10.6,10.6,10.6,10.7,30,326.2,"2019-03-07",4,"INE105C01023"]
["5PAISA","EQ",230.15,237,226,227.1,226.5,229.2,6648,1525494.2,"2019-03-07",242,"INE618L01018"]
["63MOONS","EQ",85.4,85.9,82.65,83.05,82.75,85.25,190022,15958418.9,"2019-03-07",3279,"INE111B01023"]
["8KMILES","EQ",110,111.25,107.5,108.05,107.75,110,131671,14293724.55,"2019-03-07",2035,"INE650K01021"]
["A2ZINFRA","BE",19.2,19.2,18.25,18.25,18.35,19.2,594008,10910729.1,"2019-03-07",680,"INE619I01012"]
["AARTIDRUGS","EQ",633,640.5,624,634.65,637.95,628.75,15487,9794146.8,"2019-03-07",1134,"INE767A01016"]
["AARTIIND","EQ",1526.8,1545,1472.65,1484.05,1480,1517.35,111984,167723669.8,"2019-03-07",9351,"INE769A01020"]
["AARVEEDEN","EQ",23.5,24.15,23.3,23.6,23.4,23.25,17965,422631.65,"2019-03-07",437,"INE273D01019"]
["AAVAS","EQ",1166,1238.9,1165,1226.2,1222,1166.2,226934,274537859.7,"2019-03-07",7847,"INE216P01012"]
["ABAN","EQ",75,77.9,72.55,73.65,74.2,72.1,4005200,299734179.9,"2019-03-07",29425,"INE421A01028"]
["ABB","EQ",1252,1294.9,1244.75,1270.7,1271,1244.55,174204,222003102.4,"2019-03-07",8476,"INE117A01022"]
["ABBOTINDIA","EQ",7360,7400,7261.5,7280.65,7285,7362.7,2927,21451845.2,"2019-03-07",879,"INE358A01014"]
["ABCAPITAL","EQ",100,102.75,97.8,98.5,98.5,99.8,3375216,338764611.2,"2019-03-07",43749,"INE674K01013"]
["ABFRL","EQ",219,224.8,219,223.7,224,219.85,716755,159814313.9,"2019-03-07",8670,"INE647O01011"]
["ACC","EQ",1550,1571.85,1537,1555.05,1558.7,1554.4,757839,1180286100.75,"2019-03-07",32789,"INE012A01025"]
{"$rows_left_out":1621}
{"sheet":"Sheet1","index":7,"n_rows":0,"n_cols":0,"rows_kept":0,"hidden":true}

{"sheet":"Sheet3","index":8,"n_rows":0,"n_cols":0,"rows_kept":0,"hidden":true}