{"text_format":"3","workbook":"xlsx","n_sheets":7,"sheets":["Main","Future Intra","Cash Intra","MidCap Intra","Bulk Deals","Call Tracker (Equity & F&O)","Sheet2"],"not_rendered":{"images":4,"defined_names":4},"read":"whole","date_system":"1900"}

{"sheet":"Main","index":0,"n_rows":17,"n_cols":4,"rows_kept":17}
[null,"                                                                                                 "]
{"$rows_empty":8}
[null,"2018-12-10"]
[]
[null,"Sheet No.","Template Name","Summary"]
[null,1,"Future Intra","For Intraday trading in F&O segment"]
[null,2,"Cash Intra","For Intraday trading in cash market segment"]
[null,3,"Mid-cap Intra","For Intraday trading in Mid-cap stocks"]
[null,4,"Bulk Deals","Reveals Bulk Deals carried on NSE & BSE"]
[null,5,"Call Tracker"]

{"sheet":"Future Intra","index":1,"n_rows":242,"n_cols":15,"rows_kept":242,"merged":[[8,0,9,0],[8,1,9,1],[8,2,9,2],[8,5,8,7],[8,8,8,10]]}
[]
[]
[]
[]
[{"$nulls":12},"Back to Main Page"]
["FOR INTRA DAY TRADING",{"$nulls":10},{"$f":"Main!B10","v":"2018-12-10"}]
[]
[]
["Sr.no","Sector","Scrip","CLOSE RATE","Pivot Point","Supports",null,null,"Resistances"]
[null,"Sector",null,"Point","Point","S1","S2","S3","R1","R2","R3","HIGH","LOW","OI","% Change in OI"]
[1,"Index","BANKNIFTY",{"v":26660,"d":"26660.00"},{"v":26577.016666666666,"d":"26577.02"},{"v":26418.13333333333,"d":"26418.13"},{"v":26176.266666666666,"d":"26176.27"},{"v":26017.38333333333,"d":"26017.38"},{"v":26818.88333333333,"d":"26818.88"},{"v":26977.76666666667,"d":"26977.77"},{"v":27219.63333333333,"d":"27219.63"},26735.9,26335.15,1726860,{"v":0.11650912288415036,"d":"11.65%"}]
[2,"Index","NIFTY",10735.15,{"v":10706.733333333332,"d":"10706.73"},{"v":10665.516666666663,"d":"10665.52"},{"v":10595.883333333331,"d":"10595.88"},{"v":10554.666666666662,"d":"10554.67"},{"v":10776.366666666663,"d":"10776.37"},{"v":10817.583333333334,"d":"10817.58"},{"v":10887.216666666664,"d":"10887.22"},10747.95,10637.1,22780350,{"v":0.03252892045048934,"d":"3.25%"}]
[3,"Index","NIFTYIT",{"v":14717,"d":"14717.00"},{"v":14657.666666666666,"d":"14657.67"},{"v":14559.333333333332,"d":"14559.33"},{"v":14401.666666666666,"d":"14401.67"},{"v":14303.333333333332,"d":"14303.33"},{"v":14815.333333333332,"d":"14815.33"},{"v":14913.666666666664,"d":"14913.67"},{"v":15071.333333333332,"d":"15071.33"},14756,14500,18300,{"v":-0.10073710073710074,"d":"-10.07%"}]
[4,"Index","NIFTYMID50",{"v":4628.2,"d":"4628.20"},{"v":4656.8,"d":"4656.80"},{"v":4599.6,"d":"4599.60"},{"v":4571,"d":"4571.00"},{"v":4513.8,"d":"4513.80"},{"v":4685.400000000001,"d":"4685.40"},{"v":4742.599999999999,"d":"4742.60"},{"v":4771.200000000001,"d":"4771.20"},4714,4628.2,591690,{"v":0,"d":"0.00%"}]
[5,"Cement","ACC",1449.05,{"v":1444.0333333333335,"d":"1444.03"},{"v":1435.866666666667,"d":"1435.87"},{"v":1422.6833333333334,"d":"1422.68"},{"v":1414.5166666666669,"d":"1414.52"},{"v":1457.2166666666672,"d":"1457.22"},{"v":1465.3833333333337,"d":"1465.38"},{"v":1478.5666666666673,"d":"1478.57"},1452.2,1430.85,1387200,{"v":0.00960698689956332,"d":"0.96%"}]
[6,"Others","ADANIENT",{"v":153.4,"d":"153.40"},{"v":152.68333333333334,"d":"152.68"},{"v":150.76666666666668,"d":"150.77"},{"v":148.13333333333335,"d":"148.13"},{"v":146.2166666666667,"d":"146.22"},{"v":155.31666666666666,"d":"155.32"},{"v":157.2333333333333,"d":"157.23"},{"v":159.86666666666665,"d":"159.87"},154.6,150.05,47168000,{"v":0.03729767769176636,"d":"3.73%"}]
[7,"Others","ADANIPORTS",{"v":375.2,"d":"375.20"},{"v":372,"d":"372.00"},367.75,{"v":360.3,"d":"360.30"},356.05,379.45,{"v":383.7,"d":"383.70"},391.15,376.25,364.55,18500000,{"v":5.4083288263926451E-4,"d":"0.05%"}]
[8,"Power","ADANIPOWER",{"v":52.8,"d":"52.80"},{"v":52.633333333333326,"d":"52.63"},{"v":51.86666666666665,"d":"51.87"},{"v":50.93333333333333,"d":"50.93"},{"v":50.16666666666666,"d":"50.17"},{"v":53.56666666666665,"d":"53.57"},{"v":54.33333333333333,"d":"54.33"},{"v":55.266666666666644,"d":"55.27"},53.4,51.7,170140000,{"v":0.013824335597664165,"d":"1.38%"}]
[9,"Pharma","AJANTPHARM",{"v":1053.8,"d":"1053.80"},{"v":1073.3666666666666,"d":"1073.37"},{"v":1028.9333333333332,"d":"1028.93"},{"v":1004.0666666666666,"d":"1004.07"},{"v":959.6333333333332,"d":"959.63"},{"v":1098.2333333333331,"d":"1098.23"},{"v":1142.6666666666665,"d":"1142.67"},{"v":1167.533333333333,"d":"1167.53"},1117.8,1048.5,604000,{"v":0.039586919104991396,"d":"3.96%"}]
[10,"Banking","ALBK",{"v":43.3,"d":"43.30"},{"v":43.63333333333333,"d":"43.63"},{"v":41.916666666666664,"d":"41.92"},{"v":40.53333333333333,"d":"40.53"},{"v":38.81666666666666,"d":"38.82"},{"v":45.016666666666666,"d":"45.02"},{"v":46.733333333333334,"d":"46.73"},{"v":48.11666666666667,"d":"48.12"},45.35,42.25,17212000,{"v":0.017017253604348855,"d":"1.70%"}]
{"$rows_left_out":213}
{"sheet":"Cash Intra","index":2,"n_rows":246,"n_cols":13,"rows_kept":246,"merged":[[7,0,8,0],[7,1,8,1],[7,2,8,2],[7,3,8,3],[7,4,7,6],[7,7,7,9]]}
[]
[]
[]
[]
[{"$nulls":12},"Back to Main Page"]
["FOR INTRA DAY TRADING",{"$nulls":9},{"$f":"Main!B10","v":"2018-12-10"}]
[]
["Sr.no","Scrip","CLOSE RATE","Pivot Point","Supports",null,null,"Resistances"]
[null,null,"Point",null,"S1","S2","S3","R1","R2","R3","HIGH","LOW","Total Trade Quanity in Lakhs"]
[1,"Nifty 50",10693.7,{"v":10665.866666666667,"d":"10665.87"},{"v":10627.183333333334,"d":"10627.18"},{"v":10560.666666666668,"d":"10560.67"},{"v":10521.983333333335,"d":"10521.98"},{"v":10732.383333333333,"d":"10732.38"},{"v":10771.066666666664,"d":"10771.07"},{"v":10837.583333333332,"d":"10837.58"},10704.55,10599.35]
[2,"Nifty Bank",26594.3,{"v":26502.033333333336,"d":"26502.03"},{"v":26344.366666666672,"d":"26344.37"},{"v":26094.433333333334,"d":"26094.43"},{"v":25936.76666666667,"d":"25936.77"},{"v":26751.966666666674,"d":"26751.97"},{"v":26909.63333333334,"d":"26909.63"},{"v":27159.566666666677,"d":"27159.57"},26659.7,26252.1]
[3,"Nifty CPSE",1932.2,{"v":1942.5166666666664,"d":"1942.52"},{"v":1918.5333333333328,"d":"1918.53"},{"v":1904.8666666666663,"d":"1904.87"},{"v":1880.8833333333328,"d":"1880.88"},{"v":1956.183333333333,"d":"1956.18"},{"v":1980.1666666666665,"d":"1980.17"},{"v":1993.833333333333,"d":"1993.83"},1966.5,1928.85]
[4,"Nifty Infra",3036.95,{"v":3029.2999999999997,"d":"3029.30"},{"v":3017.5499999999993,"d":"3017.55"},{"v":2998.1499999999996,"d":"2998.15"},{"v":2986.399999999999,"d":"2986.40"},{"v":3048.6999999999994,"d":"3048.70"},{"v":3060.4500000000003,"d":"3060.45"},{"v":3079.8499999999995,"d":"3079.85"},3041.05,3009.9]
[5,"Nifty IT",14662.9,{"v":14608.299999999997,"d":"14608.30"},{"v":14516.549999999996,"d":"14516.55"},{"v":14370.199999999999,"d":"14370.20"},{"v":14278.449999999997,"d":"14278.45"},{"v":14754.649999999994,"d":"14754.65"},{"v":14846.399999999998,"d":"14846.40"},{"v":14992.749999999993,"d":"14992.75"},14700.05,14461.95]
[6,"Nifty PSE",3161.4,{"v":3175.7666666666664,"d":"3175.77"},{"v":3140.333333333333,"d":"3140.33"},{"v":3119.2666666666664,"d":"3119.27"},{"v":3083.833333333333,"d":"3083.83"},{"v":3196.833333333333,"d":"3196.83"},{"v":3232.2666666666664,"d":"3232.27"},{"v":3253.333333333333,"d":"3253.33"},3211.2,3154.7]
[7,"Nifty Midcap 50",4630.85,{"v":4621.8,"d":"4621.80"},4588.35,4545.85,{"v":4512.400000000001,"d":"4512.40"},{"v":4664.3,"d":"4664.30"},{"v":4697.749999999999,"d":"4697.75"},4740.25,4655.25,4579.3]
[8,"ABB",1395.9,{"v":1393.3500000000001,"d":"1393.35"},{"v":1377.7000000000003,"d":"1377.70"},{"v":1359.5000000000002,"d":"1359.50"},{"v":1343.8500000000004,"d":"1343.85"},{"v":1411.5500000000002,"d":"1411.55"},{"v":1427.2000000000003,"d":"1427.20"},{"v":1445.4,"d":"1445.40"},1409,1375.15,0.55427]
[9,"ACC",1443.05,{"v":1438.8999999999999,"d":"1438.90"},{"v":1430.1499999999996,"d":"1430.15"},{"v":1417.2499999999998,"d":"1417.25"},{"v":1408.4999999999995,"d":"1408.50"},{"v":1451.7999999999997,"d":"1451.80"},{"v":1460.5500000000002,"d":"1460.55"},{"v":1473.4499999999998,"d":"1473.45"},1447.65,1426,3.06417]
[10,"AIAENG",1676.65,{"v":1679.3500000000001,"d":"1679.35"},{"v":1655.0000000000002,"d":"1655.00"},{"v":1633.3500000000001,"d":"1633.35"},{"v":1609.0000000000002,"d":"1609.00"},{"v":1701.0000000000002,"d":"1701.00"},{"v":1725.3500000000001,"d":"1725.35"},{"v":1747.0000000000002,"d":"1747.00"},1703.7,1657.7,0.07372]
[11,"AUBANK",611.35,616.15,{"v":604.3,"d":"604.30"},597.25,{"v":585.4,"d":"585.40"},{"v":623.1999999999999,"d":"623.20"},{"v":635.0500000000001,"d":"635.05"},{"v":642.0999999999999,"d":"642.10"},628,609.1,3.55827]
{"$rows_left_out":227}
{"sheet":"MidCap Intra","index":3,"n_rows":510,"n_cols":13,"rows_kept":510,"merged":[[0,0,0,1],[8,0,9,0],[8,1,9,1],[8,2,9,2],[8,3,9,3],[8,4,8,6],[8,7,8,9]]}
[]
[]
[]
[]
[{"$nulls":11},"Back To Main Page"]
["FOR INTRA DAY TRADING",{"$nulls":9},{"$f":"Main!B10","v":"2018-12-10"}]
[null,null," "]
[]
["Sr.no","Scrip","CLOSE RATE","Pivot Point","Supports",null,null,"Resistances"]
[null,null,"Point",null,"S1","S2","S3","R1","R2","R3","HIGH","LOW","Total Trade Quanity in Lakhs"]
[1,"3MINDIA",21816.6,{"v":21735.516666666666,"d":"21735.52"},{"v":21471.033333333333,"d":"21471.03"},{"v":21125.466666666667,"d":"21125.47"},{"v":20860.983333333334,"d":"20860.98"},{"v":22081.083333333332,"d":"22081.08"},{"v":22345.566666666662,"d":"22345.57"},{"v":22691.13333333333,"d":"22691.13"},22000,21389.95,5.11E-3]
[2,"8KMILES",173.85,173.85,173.85,173.85,173.85,173.85,173.85,173.85,173.85,173.85,0.07156]
[3,"AARTIIND",1448.35,{"v":1446.8166666666666,"d":"1446.82"},{"v":1433.5333333333333,"d":"1433.53"},{"v":1418.7166666666667,"d":"1418.72"},{"v":1405.4333333333334,"d":"1405.43"},{"v":1461.6333333333332,"d":"1461.63"},{"v":1474.9166666666665,"d":"1474.92"},{"v":1489.7333333333331,"d":"1489.73"},1460.1,1432,0.42122]
[4,"ABAN",71.25,{"v":71.71666666666667,"d":"71.72"},{"v":69.63333333333334,"d":"69.63"},{"v":68.01666666666667,"d":"68.02"},{"v":65.93333333333334,"d":"65.93"},{"v":73.33333333333334,"d":"73.33"},{"v":75.41666666666666,"d":"75.42"},{"v":77.03333333333335,"d":"77.03"},73.8,70.1,3.69384]
[5,"ABB",1395.9,{"v":1393.3500000000001,"d":"1393.35"},{"v":1377.7000000000003,"d":"1377.70"},{"v":1359.5000000000002,"d":"1359.50"},{"v":1343.8500000000004,"d":"1343.85"},{"v":1411.5500000000002,"d":"1411.55"},{"v":1427.2000000000003,"d":"1427.20"},{"v":1445.4,"d":"1445.40"},1409,1375.15,0.55427]
[6,"ABCAPITAL",97.2,{"v":97.61666666666667,"d":"97.62"},{"v":96.33333333333334,"d":"96.33"},{"v":95.46666666666667,"d":"95.47"},{"v":94.18333333333334,"d":"94.18"},{"v":98.48333333333335,"d":"98.48"},{"v":99.76666666666668,"d":"99.77"},{"v":100.63333333333335,"d":"100.63"},98.9,96.75,10.85705]
[7,"ABFRL",181.6,181.85,{"v":180,"d":"180.00"},{"v":178.4,"d":"178.40"},176.55,183.45,{"v":185.29999999999995,"d":"185.30"},{"v":186.89999999999998,"d":"186.90"},183.7,180.25,2.80964]
[8,"ACC",1443.05,{"v":1438.8999999999999,"d":"1438.90"},{"v":1430.1499999999996,"d":"1430.15"},{"v":1417.2499999999998,"d":"1417.25"},{"v":1408.4999999999995,"d":"1408.50"},{"v":1451.7999999999997,"d":"1451.80"},{"v":1460.5500000000002,"d":"1460.55"},{"v":1473.4499999999998,"d":"1473.45"},1447.65,1426,3.06417]
[9,"ADANIPORTS",373.45,{"v":370.59999999999997,"d":"370.60"},{"v":366.5999999999999,"d":"366.60"},{"v":359.74999999999994,"d":"359.75"},{"v":355.7499999999999,"d":"355.75"},{"v":377.44999999999993,"d":"377.45"},{"v":381.45000000000005,"d":"381.45"},{"v":388.29999999999995,"d":"388.30"},374.6,363.75,32.86454]
[10,"ADANIPOWER",52.55,{"v":52.333333333333336,"d":"52.33"},{"v":51.66666666666667,"d":"51.67"},{"v":50.78333333333334,"d":"50.78"},{"v":50.116666666666674,"d":"50.12"},{"v":53.21666666666667,"d":"53.22"},{"v":53.88333333333334,"d":"53.88"},{"v":54.766666666666666,"d":"54.77"},53,51.45,96.94543]
{"$rows_left_out":491}
{"sheet":"Bulk Deals","index":4,"n_rows":65,"n_cols":8,"rows_kept":65,"merged":[[4,0,4,1],[4,2,4,3],[6,1,6,2]]}
[" "]
[]
[]
[]
[]
[{"$nulls":4},"Back To Main Page"]
["Subject :","BULK DEAL",null,{"$f":"Main!B10","v":"2018-12-10"}]
[]
["Date","Scrip code","Scrip Name","Client Name","Buy / Sell","Quantity Traded","Trade Price / Wt.Avg.trade price","Exchange  "]
["2018-12-07",542057,"BCPL","KAMLESH BALCHAND SHAH HUF","SELL",{"v":116000,"d":"116,000"},35,"BSE"]
["2018-12-07",542057,"BCPL","NEWEDGE VINIMAY PRIVATE LIMITED .","BUY",{"v":116000,"d":"116,000"},35,"BSE"]
["2018-12-07",530393,"DBSTOCKBRO","MANGALJYOTI SYNDICATE PRIVATE LIMITED","BUY",{"v":690000,"d":"690,000"},8.4,"BSE"]
["2018-12-07",530393,"DBSTOCKBRO","GURU KIRPA FINVEST LTD","SELL",{"v":688779,"d":"688,779"},8.4,"BSE"]
["2018-12-07",530663,"GOYALASS","RITESH PRAFUL SHAH .","SELL",{"v":395100,"d":"395,100"},2.9,"BSE"]
["2018-12-07",530663,"GOYALASS","YOGESH DHARNIDHARKA","BUY",{"v":540300,"d":"540,300"},2.9,"BSE"]
["2018-12-07",536709,"INDRENEW","SHALAKA SANTOSH GURAV","SELL",{"v":79084,"d":"79,084"},17.96,"BSE"]
["2018-12-07",536709,"INDRENEW","MUKESH MEHTA","BUY",{"v":50496,"d":"50,496"},18,"BSE"]
["2018-12-07",506134,"INTELLCAP","N K WEALTH SOLUTIONS LLP","BUY",{"v":359716,"d":"359,716"},8.95,"BSE"]
["2018-12-07",506134,"INTELLCAP","SIVANARAYANAN FINANCIAL SERVICES PRIVATE LIMITED","SELL",{"v":359716,"d":"359,716"},8.95,"BSE"]
["2018-12-07",540756,"KAARYAFSL","SAMATA VIKRAMBHAI SHAH","BUY",{"v":27000,"d":"27,000"},34,"BSE"]
{"$rows_left_out":46}
{"sheet":"Call Tracker (Equity & F&O)","index":5,"n_rows":303,"n_cols":18,"rows_kept":303,"merged":[[38,0,39,0],[38,1,39,1],[38,2,39,2],[38,9,39,9],[38,11,39,11],[38,12,39,12],[38,13,39,13],[38,14,39,14],[40,0,41,0],[40,1,41,1],[40,2,41,2],[40,9,41,9],[40,11,41,11],[40,12,41,12],[40,13,41,13],[40,14,41,14],[42,0,43,0],[42,1,43,1],[42,2,43,2],[42,9,43,9],[42,11,43,11],[42,12,43,12],[42,13,43,13],[42,14,43,14],[51,0,52,0],[51,1,52,1],[51,2,52,2],[51,9,52,9],[51,11,52,11],[51,12,52,12],[51,13,52,13],[51,14,52,14],[53,0,54,0],[53,1,54,1],[53,2,54,2],[53,9,54,9],[53,11,54,11],[53,12,54,12],[53,13,54,13],[53,14,54,14]]}
[]
[]
[]
[]
[{"$nulls":12},"Back To Main Page"]
["Retail Research Technical Calls & Fundamental Performance Report for the month of December -2018 "]
[{"$nulls":12},{"$f":"Main!B10","v":"2018-12-10"}]
[null,"Positional  Call"]
["Sr.no","Date",null,"Company","Rec","Rec Price","Stop Loss***","Call Closed At","Target","Remark","Profit / Loss per Share","Gain / Loss  %","Status","Closed Date","NSE Closed Price"]
[1,"2018-11-14",null,"ASHOKLEY","Buy",108,100.7,111.25,"122-125","Part Profit of Rs.3.25/-",{"$f":"H10-F10","v":3.25},{"$f":"K10/F10","v":{"v":0.03009259259259259,"d":"3.01%"}},"Successful","2018-11-30",{"$nulls":3},"R"]
[2,"2018-11-21",null,"ADANIPORTS","Sell","358-361",377.7,null,"322-326","Open",{"$nulls":4},{"$f":"VLOOKUP(D11,Sheet2!A11:M1637,6,0)","v":373.45},null,null,"R"]
[3,"2018-11-29",null,"JSWSTEEL","Buy{}",312,297.7,{"$f":"(322+296)/2","v":309},"344-350","Loss of Rs.3/-",{"$f":"H12-F12","v":-3},{"$f":"K12/F12","v":{"v":-0.009615384615384616,"d":"-0.96%"}},"Unsuccessful","2018-12-07",{"$nulls":3},"R"]
[4,"2018-11-30",null,"RAYMOND","Sell",820,861.6,789,"745-735","Profit of Rs.31/-",{"$f":"F13-H13","v":31},{"v":0.03780487804878049,"d":"3.78%"},"Successful","2018-12-07",{"$nulls":3},"R"]
[5,"2018-11-30",null,"INFY","Buy",665,628,685,725,"Profit of Rs.20/-",20,{"$f":"K14/F14","v":{"v":0.03007518796992481,"d":"3.01%"}},"Successful","2018-12-07",{"$nulls":3},"H"]
{"$rows_empty":19}
["CLBS = Closing Basis ***",{"$nulls":4},"Reinitiated $"]
["Dividend adjusted <>",{"$nulls":4},"Revised stoploss #"]
["Part book {}"]
["Master Trade High Risk"]
["Sr.no","Date",null,"Company","Rec","Rec Price","Stop Loss","Call Closed At","Target","Remark","Profit / Loss per share","Gain / Loss  per Lot","Lot","Status","Closed Date"]
{"$rows_left_out":220}
{"sheet":"Sheet2","index":6,"n_rows":1629,"n_cols":14,"rows_kept":1629,"hidden":true}
["SYMBOL","SERIES","OPEN","HIGH","LOW","CLOSE","LAST","PREVCLOSE","TOTTRDQTY","TOTTRDVAL","TIMESTAMP","TOTALTRADES","ISIN","ISIN"]
["20MICRONS","EQ",42.6,43.4,42,42.8,42.55,42.65,17623,752180.85,"2018-12-07",256,"INE144J01027"]
["21STCENMGM","EQ",23.7,24.3,23.4,24.25,24.25,23.85,1098,26254.25,"2018-12-07",14,"INE253B01015"]
["3IINFOTECH","EQ",3.7,3.7,3.6,3.65,3.7,3.65,835882,3067011.45,"2018-12-07",455,"INE748C01020"]
["3MINDIA","EQ",21650,22000,21389.95,21816.6,21749,21598.6,511,11085743.25,"2018-12-07",335,"INE470A01017"]
["5PAISA","EQ",190.25,194.85,190,190.1,190,190.95,965,184548.85,"2018-12-07",94,"INE618L01018"]
["63MOONS","EQ",94.05,95.35,87.55,88.6,87.8,94,332156,30200106.6,"2018-12-07",4758,"INE111B01023"]
["8KMILES","EQ",173.85,173.85,173.85,173.85,173.85,182.95,7156,1244070.6,"2018-12-07",279,"INE650K01021"]
["A2ZINFRA","EQ",12.2,12.6,12,12.35,12.3,12.3,141030,1730544.4,"2018-12-07",450,"INE619I01012"]
["AARTIDRUGS","EQ",558.9,569.95,558.5,566.1,569.95,559.7,5208,2928779.7,"2018-12-07",356,"INE767A01016"]
["AARTIIND","EQ",1460.1,1460.1,1432,1448.35,1432,1451.35,42122,60926715.95,"2018-12-07",2476,"INE769A01020"]
["AARVEEDEN","EQ",24.8,24.8,24.1,24.65,24.65,24.4,9318,229484.65,"2018-12-07",17,"INE273D01019"]
["AAVAS","EQ",771.05,784,765,778.55,775.5,775.1,8816,6849608.8,"2018-12-07",1276,"INE216P01012"]
["ABAN","EQ",73.8,73.8,70.1,71.25,71.1,72.35,369384,26301070.25,"2018-12-07",4560,"INE421A01028"]
["ABB","EQ",1386.95,1409,1375.15,1395.9,1403,1378.35,55427,77140381.55,"2018-12-07",5549,"INE117A01022"]
["ABBOTINDIA","EQ",7594.9,7594.9,7417,7495.2,7488,7504.05,1192,8934319.1,"2018-12-07",627,"INE358A01014"]
["ABCAPITAL","EQ",98,98.9,96.75,97.2,96.85,97.6,1085705,105931256,"2018-12-07",22452,"INE674K01013"]
["ABFRL","EQ",181.75,183.7,180.25,181.6,181.35,182,280964,51064903.4,"2018-12-07",3522,"INE647O01011"]
["ACC","EQ",1426,1447.65,1426,1443.05,1438.25,1423.8,306417,440629819.45,"2018-12-07",11608,"INE012A01025"]
["ACCELYA","EQ",959.95,980,949.55,979.9,980,963.95,28618,28001885.8,"2018-12-07",696,"INE793A01012"]
{"$rows_left_out":1609}