{"text_format":"3","workbook":"xlsx","n_sheets":10,"sheets":["Main","Future Intra","Cash Intra","MidCap Intra","Bulk Deals","Call Tracker (Equity & F&O)","Sheet2","Sheet1","Sheet3","Sheet4"],"not_rendered":{"images":4,"defined_names":4},"read":"whole","date_system":"1900"}

{"sheet":"Main","index":0,"n_rows":27,"n_cols":11,"rows_kept":27}
[null,"                                                                                                 "]
{"$rows_empty":8}
[null,"2019-05-09"]
[]
[null,"Sheet No.","Template Name","Summary"]
[null,1,"Future Intra","For Intraday trading in F&O segment"]
[null,2,"Cash Intra","For Intraday trading in cash market segment"]
[null,3,"Mid-cap Intra","For Intraday trading in Mid-cap stocks"]
[null,4,"Bulk Deals","Reveals Bulk Deals carried on NSE & BSE"]
[null,5,"Call Tracker"]
{"$rows_empty":9}
[{"$nulls":10},"`"]

{"sheet":"Future Intra","index":1,"n_rows":236,"n_cols":15,"rows_kept":236,"merged":[[8,0,9,0],[8,1,9,1],[8,2,9,2],[8,5,8,7],[8,8,8,10]]}
[]
[]
[]
[]
[{"$nulls":12},"Back to Main Page"]
["FOR INTRA DAY TRADING",{"$nulls":10},{"$f":"Main!B10","v":"2019-05-09"}]
[]
[]
["Sr.no","Sector","Scrip","CLOSE RATE","Pivot Point","Supports",null,null,"Resistances"]
[null,"Sector",null,"Point","Point","S1","S2","S3","R1","R2","R3","HIGH","LOW","OI","% Change in OI"]
[1,"Index","BANKNIFTY",{"v":29145.7,"d":"29145.70"},{"v":29226.433333333334,"d":"29226.43"},{"v":29034.26666666667,"d":"29034.27"},{"v":28922.833333333336,"d":"28922.83"},{"v":28730.66666666667,"d":"28730.67"},{"v":29337.86666666667,"d":"29337.87"},{"v":29530.033333333333,"d":"29530.03"},{"v":29641.466666666667,"d":"29641.47"},29418.6,29115,1891640,{"v":-0.006324592368465288,"d":"-0.63%"}]
[2,"Index","NIFTY",{"v":11418.6,"d":"11418.60"},{"v":11447.316666666668,"d":"11447.32"},{"v":11374.683333333334,"d":"11374.68"},{"v":11330.766666666666,"d":"11330.77"},{"v":11258.133333333333,"d":"11258.13"},{"v":11491.233333333335,"d":"11491.23"},{"v":11563.86666666667,"d":"11563.87"},{"v":11607.783333333336,"d":"11607.78"},11519.95,11403.4,20439825,{"v":0.021109266870740398,"d":"2.11%"}]
[3,"Index","NIFTYIT",{"v":16123,"d":"16123.00"},{"v":16116,"d":"16116.00"},{"v":16047,"d":"16047.00"},{"v":15971,"d":"15971.00"},{"v":15902,"d":"15902.00"},{"v":16192,"d":"16192.00"},{"v":16261,"d":"16261.00"},{"v":16337,"d":"16337.00"},16185,16040,15600,{"v":-0.10086455331412104,"d":"-10.09%"}]
[4,"Cement","ACC",{"v":1598.7,"d":"1598.70"},{"v":1592.3166666666666,"d":"1592.32"},{"v":1577.5833333333333,"d":"1577.58"},{"v":1556.4666666666667,"d":"1556.47"},{"v":1541.7333333333333,"d":"1541.73"},{"v":1613.4333333333332,"d":"1613.43"},{"v":1628.1666666666667,"d":"1628.17"},{"v":1649.283333333333,"d":"1649.28"},1607.05,1571.2,2384800,{"v":-0.05139220365950676,"d":"-5.14%"}]
[5,"Others","ADANIENT",{"v":121.4,"d":"121.40"},{"v":122.16666666666667,"d":"122.17"},{"v":119.93333333333334,"d":"119.93"},{"v":118.46666666666667,"d":"118.47"},{"v":116.23333333333333,"d":"116.23"},{"v":123.63333333333334,"d":"123.63"},{"v":125.86666666666666,"d":"125.87"},{"v":127.33333333333334,"d":"127.33"},124.4,120.7,40632000,{"v":-7.8693684831792243E-4,"d":"-0.08%"}]
[6,"Others","ADANIPORTS",{"v":372.6,"d":"372.60"},{"v":373.3999999999999,"d":"373.40"},{"v":369.34999999999985,"d":"369.35"},{"v":366.0999999999999,"d":"366.10"},{"v":362.04999999999984,"d":"362.05"},{"v":376.64999999999986,"d":"376.65"},{"v":380.69999999999993,"d":"380.70"},{"v":383.9499999999999,"d":"383.95"},377.45,370.15,14915000,{"v":-0.011924478304074197,"d":"-1.19%"}]
[7,"Power","ADANIPOWER",{"v":41.6,"d":"41.60"},{"v":41.61666666666667,"d":"41.62"},{"v":40.93333333333334,"d":"40.93"},{"v":40.26666666666667,"d":"40.27"},{"v":39.58333333333334,"d":"39.58"},{"v":42.28333333333333,"d":"42.28"},{"v":42.966666666666654,"d":"42.97"},{"v":43.633333333333326,"d":"43.63"},42.3,40.95,145060000,{"v":-0.002475587952138633,"d":"-0.25%"}]
[8,"Pharma","AJANTPHARM",{"v":1059.7,"d":"1059.70"},{"v":1055.8166666666666,"d":"1055.82"},{"v":1046.8833333333332,"d":"1046.88"},{"v":1034.0666666666666,"d":"1034.07"},{"v":1025.1333333333332,"d":"1025.13"},{"v":1068.6333333333332,"d":"1068.63"},{"v":1077.5666666666666,"d":"1077.57"},{"v":1090.3833333333332,"d":"1090.38"},1064.75,1043,651500,{"v":-0.04050073637702504,"d":"-4.05%"}]
[9,"Banking","ALBK",44.55,{"v":44.43333333333334,"d":"44.43"},{"v":43.76666666666667,"d":"43.77"},{"v":42.983333333333334,"d":"42.98"},{"v":42.31666666666667,"d":"42.32"},{"v":45.216666666666676,"d":"45.22"},{"v":45.88333333333333,"d":"45.88"},{"v":46.66666666666668,"d":"46.67"},45.1,43.65,20930000,{"v":-0.013480392156862746,"d":"-1.35%"}]
[10,"Automobile","AMARAJABAT",639.45,{"v":641.4666666666667,"d":"641.47"},{"v":634.1833333333334,"d":"634.18"},{"v":628.9166666666667,"d":"628.92"},{"v":621.6333333333334,"d":"621.63"},{"v":646.7333333333333,"d":"646.73"},{"v":654.0166666666667,"d":"654.02"},{"v":659.2833333333333,"d":"659.28"},648.75,636.2,1647100,{"v":3.8395904436860067E-3,"d":"0.38%"}]
{"$rows_left_out":207}
{"sheet":"Cash Intra","index":2,"n_rows":247,"n_cols":13,"rows_kept":247,"merged":[[7,0,8,0],[7,1,8,1],[7,2,8,2],[7,3,8,3],[7,4,7,6],[7,7,7,9]]}
[]
[]
[]
[]
[{"$nulls":12},"Back to Main Page"]
["FOR INTRA DAY TRADING",{"$nulls":9},{"$f":"Main!B10","v":"2019-05-09"}]
[]
["Sr.no","Scrip","CLOSE RATE","Pivot Point","Supports",null,null,"Resistances"]
[null,null,"Point",null,"S1","S2","S3","R1","R2","R3","HIGH","LOW","Total Trade Quanity in Lakhs"]
[1,"Nifty 50",11359.45,{"v":11395.166666666666,"d":"11395.17"},{"v":11311.233333333332,"d":"11311.23"},{"v":11263.016666666666,"d":"11263.02"},{"v":11179.083333333332,"d":"11179.08"},{"v":11443.383333333331,"d":"11443.38"},{"v":11527.316666666666,"d":"11527.32"},{"v":11575.533333333331,"d":"11575.53"},11479.1,11346.95]
[2,"Nifty Bank",28994.4,{"v":29069.016666666663,"d":"29069.02"},{"v":28876.733333333326,"d":"28876.73"},{"v":28759.066666666662,"d":"28759.07"},{"v":28566.783333333326,"d":"28566.78"},{"v":29186.683333333327,"d":"29186.68"},{"v":29378.966666666667,"d":"29378.97"},{"v":29496.633333333328,"d":"29496.63"},29261.3,28951.35]
[3,"Nifty CPSE",2228.45,{"v":2236.883333333333,"d":"2236.88"},{"v":2215.1666666666665,"d":"2215.17"},{"v":2201.883333333333,"d":"2201.88"},{"v":2180.1666666666665,"d":"2180.17"},{"v":2250.1666666666665,"d":"2250.17"},{"v":2271.8833333333337,"d":"2271.88"},{"v":2285.1666666666665,"d":"2285.17"},2258.6,2223.6]
[4,"Nifty Infra",3075.5,{"v":3083.383333333333,"d":"3083.38"},{"v":3061.8666666666663,"d":"3061.87"},{"v":3048.233333333333,"d":"3048.23"},{"v":3026.7166666666662,"d":"3026.72"},{"v":3097.0166666666664,"d":"3097.02"},{"v":3118.533333333333,"d":"3118.53"},{"v":3132.1666666666665,"d":"3132.17"},3104.9,3069.75]
[5,"Nifty IT",16061.6,{"v":16063.199999999999,"d":"16063.20"},{"v":15996.999999999998,"d":"15997.00"},{"v":15932.4,"d":"15932.40"},{"v":15866.199999999999,"d":"15866.20"},{"v":16127.799999999997,"d":"16127.80"},{"v":16193.999999999998,"d":"16194.00"},{"v":16258.599999999997,"d":"16258.60"},16129.4,15998.6]
[6,"Nifty PSE",3474.45,{"v":3486.6499999999996,"d":"3486.65"},{"v":3454.4499999999994,"d":"3454.45"},3434.45,{"v":3402.2499999999995,"d":"3402.25"},{"v":3506.649999999999,"d":"3506.65"},3538.85,{"v":3558.849999999999,"d":"3558.85"},3518.85,3466.65]
[7,"Nifty Midcap 50",4695.95,{"v":4708.766666666666,"d":"4708.77"},{"v":4671.383333333333,"d":"4671.38"},{"v":4646.816666666667,"d":"4646.82"},{"v":4609.433333333333,"d":"4609.43"},{"v":4733.333333333333,"d":"4733.33"},{"v":4770.716666666666,"d":"4770.72"},{"v":4795.283333333333,"d":"4795.28"},4746.15,4684.2]
[8,"ABB",1453.55,{"v":1466.1833333333334,"d":"1466.18"},{"v":1435.3666666666668,"d":"1435.37"},{"v":1417.1833333333334,"d":"1417.18"},{"v":1386.3666666666668,"d":"1386.37"},{"v":1484.3666666666668,"d":"1484.37"},{"v":1515.1833333333334,"d":"1515.18"},{"v":1533.3666666666668,"d":"1533.37"},1497,1448,1.7541]
[9,"ACC",1593.2,{"v":1587.8999999999999,"d":"1587.90"},{"v":1568.8499999999997,"d":"1568.85"},{"v":1544.4999999999998,"d":"1544.50"},{"v":1525.4499999999996,"d":"1525.45"},{"v":1612.2499999999998,"d":"1612.25"},{"v":1631.3,"d":"1631.30"},{"v":1655.6499999999999,"d":"1655.65"},1606.95,1563.55,9.47559]
[10,"AUBANK",641.3,{"v":639,"d":"639.00"},{"v":634.5,"d":"634.50"},{"v":627.7,"d":"627.70"},{"v":623.2,"d":"623.20"},{"v":645.8,"d":"645.80"},{"v":650.3,"d":"650.30"},{"v":657.0999999999999,"d":"657.10"},643.5,632.2,7.76828]
[11,"ADANIPORTS",369.8,{"v":370.8,"d":"370.80"},{"v":366.70000000000005,"d":"366.70"},{"v":363.6,"d":"363.60"},{"v":359.50000000000006,"d":"359.50"},{"v":373.90000000000003,"d":"373.90"},{"v":378.00000000000006,"d":"378.00"},{"v":381.1,"d":"381.10"},374.9,367.7,16.8811]
{"$rows_left_out":228}
{"sheet":"MidCap Intra","index":3,"n_rows":546,"n_cols":13,"rows_kept":546,"merged":[[0,0,0,1],[8,0,9,0],[8,1,9,1],[8,2,9,2],[8,3,9,3],[8,4,8,6],[8,7,8,9]]}
[]
[]
[]
[]
[{"$nulls":11},"Back To Main Page"]
["FOR INTRA DAY TRADING",{"$nulls":9},{"$f":"Main!B10","v":"2019-05-09"}]
[null,null," "]
[]
["Sr.no","Scrip","CLOSE RATE","Pivot Point","Supports",null,null,"Resistances"]
[null,null,"Point",null,"S1","S2","S3","R1","R2","R3","HIGH","LOW","Total Trade Quanity in Lakhs"]
[1,"3MINDIA",23122.25,{"v":23140.516666666666,"d":"23140.52"},{"v":22982.033333333333,"d":"22982.03"},{"v":22841.816666666666,"d":"22841.82"},{"v":22683.333333333332,"d":"22683.33"},{"v":23280.733333333334,"d":"23280.73"},{"v":23439.216666666664,"d":"23439.22"},{"v":23579.433333333334,"d":"23579.43"},23299,23000.3,3.49E-3]
[2,"ABB",1453.55,{"v":1466.1833333333334,"d":"1466.18"},{"v":1435.3666666666668,"d":"1435.37"},{"v":1417.1833333333334,"d":"1417.18"},{"v":1386.3666666666668,"d":"1386.37"},{"v":1484.3666666666668,"d":"1484.37"},{"v":1515.1833333333334,"d":"1515.18"},{"v":1533.3666666666668,"d":"1533.37"},1497,1448,1.7541]
[3,"ACC",1593.2,{"v":1587.8999999999999,"d":"1587.90"},{"v":1568.8499999999997,"d":"1568.85"},{"v":1544.4999999999998,"d":"1544.50"},{"v":1525.4499999999996,"d":"1525.45"},{"v":1612.2499999999998,"d":"1612.25"},{"v":1631.3,"d":"1631.30"},{"v":1655.6499999999999,"d":"1655.65"},1606.95,1563.55,9.47559]
[4,"AIAENG",1673.45,{"v":1691.1499999999999,"d":"1691.15"},{"v":1647.2999999999997,"d":"1647.30"},{"v":1621.1499999999999,"d":"1621.15"},{"v":1577.2999999999997,"d":"1577.30"},{"v":1717.2999999999997,"d":"1717.30"},{"v":1761.1499999999996,"d":"1761.15"},{"v":1787.2999999999997,"d":"1787.30"},1735,1665,0.22662]
[5,"APLAPOLLO",1527.1,{"v":1519.6333333333332,"d":"1519.63"},{"v":1506.4666666666665,"d":"1506.47"},{"v":1485.8333333333333,"d":"1485.83"},{"v":1472.6666666666665,"d":"1472.67"},{"v":1540.2666666666664,"d":"1540.27"},{"v":1553.4333333333334,"d":"1553.43"},{"v":1574.0666666666664,"d":"1574.07"},1532.8,1499,0.18946]
[6,"AUBANK",641.3,{"v":639,"d":"639.00"},{"v":634.5,"d":"634.50"},{"v":627.7,"d":"627.70"},{"v":623.2,"d":"623.20"},{"v":645.8,"d":"645.80"},{"v":650.3,"d":"650.30"},{"v":657.0999999999999,"d":"657.10"},643.5,632.2,7.76828]
[7,"AAVAS",1426.6,{"v":1418.9833333333336,"d":"1418.98"},{"v":1389.766666666667,"d":"1389.77"},{"v":1352.9333333333336,"d":"1352.93"},{"v":1323.7166666666672,"d":"1323.72"},{"v":1455.816666666667,"d":"1455.82"},{"v":1485.0333333333333,"d":"1485.03"},{"v":1521.866666666667,"d":"1521.87"},1448.2,1382.15,6.66307]
[8,"ADANIGREEN",38.05,{"v":38.61666666666667,"d":"38.62"},{"v":37.233333333333334,"d":"37.23"},{"v":36.416666666666664,"d":"36.42"},{"v":35.03333333333333,"d":"35.03"},{"v":39.43333333333334,"d":"39.43"},{"v":40.81666666666668,"d":"40.82"},{"v":41.63333333333334,"d":"41.63"},40,37.8,7.93079]
[9,"ADANIPORTS",369.8,{"v":370.8,"d":"370.80"},{"v":366.70000000000005,"d":"366.70"},{"v":363.6,"d":"363.60"},{"v":359.50000000000006,"d":"359.50"},{"v":373.90000000000003,"d":"373.90"},{"v":378.00000000000006,"d":"378.00"},{"v":381.1,"d":"381.10"},374.9,367.7,16.8811]
[10,"ADANIPOWER",41.35,{"v":41.4,"d":"41.40"},{"v":40.699999999999996,"d":"40.70"},40.05,{"v":39.349999999999994,"d":"39.35"},42.05,42.75,{"v":43.4,"d":"43.40"},42.1,40.75,75.10676]
{"$rows_left_out":513}
{"sheet":"Bulk Deals","index":4,"n_rows":85,"n_cols":8,"rows_kept":85,"merged":[[4,0,4,1],[4,2,4,3],[6,1,6,2]]}
[" "]
[]
[]
[]
[]
[{"$nulls":4},"Back To Main Page"]
["Subject :","BULK DEAL",null,{"$f":"Main!B10","v":"2019-05-09"}]
[]
["Date","Scrip code","Scrip Name","Client Name","Buy / Sell","Quantity Traded","Trade Price / Wt.Avg.trade price","Exchange  "]
["2019-05-08",532975,"AISHWARYA","SRINIDHI INFIN LIMITED","BUY",{"v":260000,"d":"260,000"},2.08,"BSE"]
["2019-05-08",532975,"AISHWARYA","NAYANSIKH REDDY BADDAM","SELL",{"v":260000,"d":"260,000"},2.08,"BSE"]
["2019-05-08",538716,"ARYACAPM","JHAVERI TRADING AND INVESTMENT PVT LTD","SELL",{"v":80000,"d":"80,000"},27.9,"BSE"]
["2019-05-08",538716,"ARYACAPM","HARSH SHAILESH JHAVERI","SELL",{"v":90000,"d":"90,000"},27.9,"BSE"]
["2019-05-08",538716,"ARYACAPM","JAI AMBE TRADEXIM PRIVATE LIMITED","BUY",{"v":60000,"d":"60,000"},27.9,"BSE"]
["2019-05-08",538716,"ARYACAPM","PARESH BABULAL SHAH","BUY",{"v":65000,"d":"65,000"},27.9,"BSE"]
["2019-05-08",537766,"BCP","ACHINTYA SECURITIES PVT. LTD.","BUY",{"v":613438,"d":"613,438"},38.32,"BSE"]
["2019-05-08",537766,"BCP","ACHINTYA SECURITIES PVT. LTD.","SELL",{"v":635438,"d":"635,438"},37.62,"BSE"]
["2019-05-08",537766,"BCP","ITJ RETAILS PRIVATE LIMITED","SELL",{"v":313830,"d":"313,830"},38.22,"BSE"]
["2019-05-08",539770,"DARJEELING","CHOKSHI KINSHIL KIRANBHAI","BUY",{"v":19000,"d":"19,000"},85.85,"BSE"]
["2019-05-08",539770,"DARJEELING","SHAH DEEPAK BHOGILAL","SELL",{"v":19000,"d":"19,000"},85.85,"BSE"]
{"$rows_left_out":66}
{"sheet":"Call Tracker (Equity & F&O)","index":5,"n_rows":272,"n_cols":18,"rows_kept":272,"merged":[[30,0,31,0],[30,1,31,1],[30,2,31,2],[30,9,31,9],[30,11,31,11],[30,12,31,12],[30,13,31,13],[30,14,31,14],[32,0,33,0],[32,1,33,1],[32,2,33,2],[32,9,33,9],[32,11,33,11],[32,12,33,12],[32,13,33,13],[32,14,33,14],[34,0,35,0],[34,1,35,1],[34,2,35,2],[34,9,35,9],[34,11,35,11],[34,12,35,12],[34,13,35,13],[34,14,35,14],[36,0,37,0],[36,1,37,1],[36,2,37,2],[36,9,37,9],[36,11,37,11],[36,12,37,12],[36,13,37,13],[36,14,37,14]]}
[]
[]
[]
[]
[{"$nulls":12},"Back To Main Page"]
["Retail Research Technical Calls & Fundamental Performance Report for the month of May-2019 "]
[{"$nulls":12},{"$f":"Main!B10","v":"2019-05-09"}]
[null,"Positional  Call"]
["Sr.no","Date",null,"Company","Rec","Rec Price","Stop Loss***","Call Closed At","Target","Remark","Profit / Loss per Share","Gain / Loss  %","Status","Closed Date","NSE Closed Price"]
[1,"2019-04-03",null,"BOSCHLTD","Buy","17950-18000",16850,null,"19500-20000","Open",{"$nulls":4},{"$f":"VLOOKUP(D10,Sheet2!A22:M1817,6,0)","v":17328.85},null,null,"R"]
[2,"2019-04-08",null,"BAJFINANCE","Sell",3005,3166.6,2910,"2750-2700","Part Profit of Rs.95",{"$f":"F11-H11","v":95},{"$f":"K11/F11","v":{"v":0.03161397670549085,"d":"3.16%"}},"Successful","2019-05-08",{"$nulls":3},"R"]
[3,"2019-04-23",null,"DMART","Buy","1300-1310",1212,null,"1470-1500","Open",{"$nulls":4},{"$f":"VLOOKUP(D12,Sheet2!A29:M1824,6,0)","v":1245.55},null,null,"R"]
[4,"2019-04-24",null,"VEDL","Buy",173,164,164,"190-195","Loss of Rs.9/-",{"$f":"H13-F13","v":-9},{"$f":"K13/F13","v":{"v":-0.05202312138728324,"d":"-5.20%"}},"Unsuccessful","2019-05-07",{"$nulls":3},"H"]
[5,"2019-04-25",null,"GRASIM","Sell",900.5,945.6,873,"820-810","Part Profit of Rs.27.5",{"$f":"F14-H14","v":27.5},{"$f":"K14/F14","v":{"v":0.03053858967240422,"d":"3.05%"}},"Successful","2019-05-07",{"$nulls":3},"R"]
[6,"2019-05-02",null,"BAJAJFINSV","Sell",7620,7880,7375,7200,"Part Profit of Rs.245",{"$f":"F15-H15","v":245},{"$f":"K15/F15","v":{"v":0.03215223097112861,"d":"3.22%"}},"Successful","2019-05-08",{"$nulls":3},"H"]
[7,"2019-05-02",null,"IDFCFIRSTB","Buy","50.20-50.70",48,null,"55-56","Open",{"$nulls":4},{"$f":"VLOOKUP(D16,Sheet2!A34:M1829,6,0)","v":49.35},null,null,"H"]
[8,"2019-05-03",null,"APOLLOTYRE","Buy","202-204",189,null,"225-230","Open",{"$nulls":4},{"$f":"VLOOKUP(D17,Sheet2!A35:M1830,6,0)","v":191.75},null,null,"H"]
[9,"2019-05-03",null,"M&M","Buy","642-646",615,null,"690-700","Open",{"$nulls":4},{"$f":"VLOOKUP(D18,Sheet2!A36:M1831,6,0)","v":621.65},null,null,"H"]
[10,"2019-05-06",null,"MARUTI","Buy","6650-6700",6400,null,"7200-7300","Open",{"$nulls":4},{"$f":"VLOOKUP(D19,Sheet2!A37:M1832,6,0)","v":6650.15},null,null,"H"]
[11,"2019-05-08",null,"COLPAL","Buy","1140-1150",1089,null,"1240-1260","Open",{"$nulls":4},{"$f":"VLOOKUP(D20,Sheet2!A38:M1833,6,0)","v":1142.4},null,null,"H"]
{"$rows_left_out":241}
{"sheet":"Sheet2","index":6,"n_rows":1640,"n_cols":14,"rows_kept":1640,"hidden":true}
["SYMBOL","SERIES","OPEN","HIGH","LOW","CLOSE","LAST","PREVCLOSE","TOTTRDQTY","TOTTRDVAL","TIMESTAMP","TOTALTRADES","ISIN","ISIN"]
["20MICRONS","EQ",37.4,37.4,35.3,35.5,35.65,37,19122,687990.25,"2019-05-08",319,"INE144J01027"]
["21STCENMGM","EQ",22,22,21.3,21.3,21.3,21.7,2404,51919.2,"2019-05-08",17,"INE253B01015"]
["3IINFOTECH","EQ",3.8,4.1,3.75,3.9,3.95,3.8,4521562,17942730.7,"2019-05-08",2628,"INE748C01020"]
["3MINDIA","EQ",23000.55,23299,23000.3,23122.25,23010,23225.7,349,8088590.1,"2019-05-08",216,"INE470A01017"]
["3PLAND","BE",11.3,11.3,11.3,11.3,11.3,11.3,300,3390,"2019-05-08",1,"INE105C01023"]
["5PAISA","EQ",285.2,289.95,282,286.45,286,291.1,5510,1570746.65,"2019-05-08",237,"INE618L01018"]
["63MOONS","EQ",175.4,175.4,175.4,175.4,175.4,167.05,101708,17839583.2,"2019-05-08",675,"INE111B01023"]
["8KMILES","EQ",105.05,105.4,102.15,102.7,103.45,106.45,101230,10525279,"2019-05-08",1555,"INE650K01021"]
["A2ZINFRA","EQ",16.6,16.7,15.25,15.45,15.6,16.5,356655,5657376.6,"2019-05-08",489,"INE619I01012"]
["AARTIDRUGS","EQ",619.95,619.95,612.95,616.25,618.8,617.9,4934,3043263.6,"2019-05-08",298,"INE767A01016"]
["AARTIIND","EQ",1600,1603.95,1572.45,1578,1581,1599.5,28976,45800689.35,"2019-05-08",4641,"INE769A01020"]
["AARVEEDEN","EQ",24.3,24.3,22.85,22.9,22.9,23.8,4766,110512.3,"2019-05-08",130,"INE273D01019"]
["AAVAS","EQ",1399.9,1448.2,1382.15,1426.6,1429.95,1411.6,666307,952377956.05,"2019-05-08",14168,"INE216P01012"]
["ABAN","BE",50.8,50.8,49,49.2,49.85,50.5,54164,2677091.55,"2019-05-08",522,"INE421A01028"]
["ABB","EQ",1480.25,1497,1448,1453.55,1453.6,1478.8,175410,257435118.85,"2019-05-08",9793,"INE117A01022"]
["ABBOTINDIA","EQ",7300,7314,7260,7267.9,7265,7287.3,7624,55620306.35,"2019-05-08",837,"INE358A01014"]
["ABCAPITAL","EQ",99.7,99.75,98,98.6,98.75,100.35,3021121,298044783.25,"2019-05-08",71761,"INE674K01013"]
["ABFRL","EQ",207.95,209.7,204.6,207.15,207,209,329716,68181325.25,"2019-05-08",8359,"INE647O01011"]
["ABSLNN50ET","EQ",303,318.49,280.04,280.04,280.04,313.2,20,5939.82,"2019-05-08",6,"INF209KB1B87"]
{"$rows_left_out":1621}
{"sheet":"Sheet1","index":7,"n_rows":0,"n_cols":0,"rows_kept":0,"hidden":true}

{"sheet":"Sheet3","index":8,"n_rows":0,"n_cols":0,"rows_kept":0,"hidden":true}

{"sheet":"Sheet4","index":9,"n_rows":0,"n_cols":0,"rows_kept":0,"hidden":true}