{"text_format":"3","workbook":"xlsx","n_sheets":10,"sheets":["Main","Future Intra","Cash Intra","MidCap Intra","Bulk Deals","Call Tracker (Equity & F&O)","Sheet2","Sheet1","Sheet3","Sheet4"],"not_rendered":{"images":4,"defined_names":4},"read":"whole","date_system":"1900"}

{"sheet":"Main","index":0,"n_rows":27,"n_cols":11,"rows_kept":27}
[null,"                                                                                                 "]
{"$rows_empty":8}
[null,"2019-05-08"]
[]
[null,"Sheet No.","Template Name","Summary"]
[null,1,"Future Intra","For Intraday trading in F&O segment"]
[null,2,"Cash Intra","For Intraday trading in cash market segment"]
[null,3,"Mid-cap Intra","For Intraday trading in Mid-cap stocks"]
[null,4,"Bulk Deals","Reveals Bulk Deals carried on NSE & BSE"]
[null,5,"Call Tracker"]
{"$rows_empty":9}
[{"$nulls":10},"`"]

{"sheet":"Future Intra","index":1,"n_rows":236,"n_cols":15,"rows_kept":236,"merged":[[8,0,9,0],[8,1,9,1],[8,2,9,2],[8,5,8,7],[8,8,8,10]]}
[]
[]
[]
[]
[{"$nulls":12},"Back to Main Page"]
["FOR INTRA DAY TRADING",{"$nulls":10},{"$f":"Main!B10","v":"2019-05-08"}]
[]
[]
["Sr.no","Sector","Scrip","CLOSE RATE","Pivot Point","Supports",null,null,"Resistances"]
[null,"Sector",null,"Point","Point","S1","S2","S3","R1","R2","R3","HIGH","LOW","OI","% Change in OI"]
[1,"Index","BANKNIFTY",29418.45,{"v":29578.100000000002,"d":"29578.10"},{"v":29210.350000000006,"d":"29210.35"},{"v":29002.250000000004,"d":"29002.25"},{"v":28634.500000000007,"d":"28634.50"},{"v":29786.200000000004,"d":"29786.20"},{"v":30153.949999999997,"d":"30153.95"},{"v":30362.050000000003,"d":"30362.05"},29945.85,29370,1903680,{"v":0.06420992609653291,"d":"6.42%"}]
[2,"Index","NIFTY",{"v":11541.9,"d":"11541.90"},{"v":11588.416666666666,"d":"11588.42"},{"v":11484.833333333332,"d":"11484.83"},{"v":11427.766666666666,"d":"11427.77"},{"v":11324.183333333332,"d":"11324.18"},{"v":11645.483333333332,"d":"11645.48"},{"v":11749.066666666664,"d":"11749.07"},{"v":11806.133333333331,"d":"11806.13"},11692,11531.35,20017275,{"v":-0.004795233105752415,"d":"-0.48%"}]
[3,"Index","NIFTYIT",{"v":16163,"d":"16163.00"},{"v":16189.333333333334,"d":"16189.33"},{"v":16113.666666666668,"d":"16113.67"},{"v":16064.333333333334,"d":"16064.33"},{"v":15988.666666666668,"d":"15988.67"},{"v":16238.666666666668,"d":"16238.67"},{"v":16314.333333333336,"d":"16314.33"},{"v":16363.666666666668,"d":"16363.67"},16265,16140,17350,{"v":0.017595307917888565,"d":"1.76%"}]
[4,"Cement","ACC",1608.65,{"v":1620.0666666666668,"d":"1620.07"},{"v":1592.1833333333336,"d":"1592.18"},{"v":1575.7166666666667,"d":"1575.72"},{"v":1547.8333333333335,"d":"1547.83"},{"v":1636.5333333333338,"d":"1636.53"},{"v":1664.416666666667,"d":"1664.42"},{"v":1680.883333333334,"d":"1680.88"},1647.95,1603.6,2514000,{"v":-0.017815283638068447,"d":"-1.78%"}]
[5,"Others","ADANIENT",{"v":122.3,"d":"122.30"},{"v":123.46666666666665,"d":"123.47"},{"v":119.63333333333331,"d":"119.63"},{"v":116.96666666666665,"d":"116.97"},{"v":113.13333333333331,"d":"113.13"},{"v":126.13333333333331,"d":"126.13"},{"v":129.96666666666664,"d":"129.97"},{"v":132.63333333333333,"d":"132.63"},127.3,120.8,40664000,{"v":-1.37524557956778E-3,"d":"-0.14%"}]
[6,"Others","ADANIPORTS",{"v":373.7,"d":"373.70"},{"v":377.34999999999997,"d":"377.35"},{"v":368.79999999999995,"d":"368.80"},{"v":363.9,"d":"363.90"},{"v":355.34999999999997,"d":"355.35"},{"v":382.24999999999994,"d":"382.25"},{"v":390.8,"d":"390.80"},{"v":395.69999999999993,"d":"395.70"},385.9,372.45,15095000,{"v":-0.005599472990777339,"d":"-0.56%"}]
[7,"Power","ADANIPOWER",41.55,{"v":42.18333333333333,"d":"42.18"},{"v":40.61666666666666,"d":"40.62"},{"v":39.68333333333333,"d":"39.68"},{"v":38.11666666666666,"d":"38.12"},{"v":43.11666666666666,"d":"43.12"},{"v":44.68333333333334,"d":"44.68"},{"v":45.61666666666666,"d":"45.62"},43.75,41.25,145420000,{"v":2.6199669056811915E-3,"d":"0.26%"}]
[8,"Pharma","AJANTPHARM",1052.85,{"v":1059.7333333333333,"d":"1059.73"},{"v":1038.4666666666667,"d":"1038.47"},{"v":1024.0833333333333,"d":"1024.08"},{"v":1002.8166666666666,"d":"1002.82"},{"v":1074.1166666666668,"d":"1074.12"},{"v":1095.3833333333337,"d":"1095.38"},{"v":1109.7666666666669,"d":"1109.77"},1081,1045.35,679000,{"v":-0.08305199189736664,"d":"-8.31%"}]
[9,"Banking","ALBK",44.65,{"v":45.28333333333333,"d":"45.28"},{"v":43.766666666666666,"d":"43.77"},{"v":42.88333333333333,"d":"42.88"},{"v":41.36666666666667,"d":"41.37"},{"v":46.166666666666664,"d":"46.17"},{"v":47.68333333333333,"d":"47.68"},{"v":48.56666666666666,"d":"48.57"},46.8,44.4,21216000,{"v":0.03225806451612903,"d":"3.23%"}]
[10,"Automobile","AMARAJABAT",646.25,{"v":648.9166666666666,"d":"648.92"},{"v":641.8333333333333,"d":"641.83"},{"v":637.4166666666666,"d":"637.42"},{"v":630.3333333333333,"d":"630.33"},{"v":653.3333333333333,"d":"653.33"},{"v":660.4166666666665,"d":"660.42"},{"v":664.8333333333333,"d":"664.83"},656,644.5,1640800,{"v":0.031236251649802024,"d":"3.12%"}]
{"$rows_left_out":207}
{"sheet":"Cash Intra","index":2,"n_rows":247,"n_cols":13,"rows_kept":247,"merged":[[7,0,8,0],[7,1,8,1],[7,2,8,2],[7,3,8,3],[7,4,7,6],[7,7,7,9]]}
[]
[]
[]
[]
[{"$nulls":12},"Back to Main Page"]
["FOR INTRA DAY TRADING",{"$nulls":9},{"$f":"Main!B10","v":"2019-05-08"}]
[]
["Sr.no","Scrip","CLOSE RATE","Pivot Point","Supports",null,null,"Resistances"]
[null,null,"Point",null,"S1","S2","S3","R1","R2","R3","HIGH","LOW","Total Trade Quanity in Lakhs"]
[1,"Nifty 50",11497.9,{"v":11546.466666666665,"d":"11546.47"},{"v":11435.883333333331,"d":"11435.88"},{"v":11373.866666666667,"d":"11373.87"},{"v":11263.283333333333,"d":"11263.28"},{"v":11608.48333333333,"d":"11608.48"},{"v":11719.066666666662,"d":"11719.07"},{"v":11781.083333333328,"d":"11781.08"},11657.05,11484.45]
[2,"Nifty Bank",29288.2,{"v":29455.983333333334,"d":"29455.98"},{"v":29076.466666666667,"d":"29076.47"},{"v":28864.733333333334,"d":"28864.73"},{"v":28485.216666666667,"d":"28485.22"},{"v":29667.716666666667,"d":"29667.72"},{"v":30047.233333333337,"d":"30047.23"},{"v":30258.966666666667,"d":"30258.97"},29835.5,29244.25]
[3,"Nifty CPSE",2256.95,{"v":2264.6166666666663,"d":"2264.62"},{"v":2244.1333333333328,"d":"2244.13"},{"v":2231.3166666666666,"d":"2231.32"},{"v":2210.833333333333,"d":"2210.83"},{"v":2277.4333333333325,"d":"2277.43"},{"v":2297.916666666666,"d":"2297.92"},{"v":2310.733333333332,"d":"2310.73"},2285.1,2251.8]
[4,"Nifty Infra",3108.3,{"v":3117.133333333333,"d":"3117.13"},{"v":3093.0166666666664,"d":"3093.02"},{"v":3077.733333333333,"d":"3077.73"},{"v":3053.6166666666663,"d":"3053.62"},{"v":3132.4166666666665,"d":"3132.42"},{"v":3156.5333333333333,"d":"3156.53"},{"v":3171.8166666666666,"d":"3171.82"},3141.25,3101.85]
[5,"Nifty IT",16135.75,{"v":16154.083333333334,"d":"16154.08"},{"v":16082.316666666668,"d":"16082.32"},{"v":16028.883333333333,"d":"16028.88"},{"v":15957.116666666667,"d":"15957.12"},{"v":16207.516666666668,"d":"16207.52"},{"v":16279.283333333335,"d":"16279.28"},{"v":16332.716666666669,"d":"16332.72"},16225.85,16100.65]
[6,"Nifty PSE",3515.6,{"v":3528.4500000000003,"d":"3528.45"},{"v":3496.6500000000005,"d":"3496.65"},{"v":3477.7000000000003,"d":"3477.70"},{"v":3445.9000000000005,"d":"3445.90"},{"v":3547.4000000000005,"d":"3547.40"},{"v":3579.2000000000007,"d":"3579.20"},{"v":3598.1500000000005,"d":"3598.15"},3560.25,3509.5]
[7,"Nifty Midcap 50",4741.95,{"v":4771.8,"d":"4771.80"},{"v":4704.1,"d":"4704.10"},4666.25,4598.55,{"v":4809.650000000001,"d":"4809.65"},{"v":4877.349999999999,"d":"4877.35"},{"v":4915.200000000001,"d":"4915.20"},4839.5,4733.95]
[8,"ABB",1478.8,{"v":1480.4166666666667,"d":"1480.42"},{"v":1463.9333333333334,"d":"1463.93"},{"v":1449.0666666666666,"d":"1449.07"},{"v":1432.5833333333333,"d":"1432.58"},{"v":1495.2833333333335,"d":"1495.28"},{"v":1511.7666666666667,"d":"1511.77"},{"v":1526.6333333333337,"d":"1526.63"},1496.9,1465.55,0.57445]
[9,"ACC",1596.9,{"v":1608.3166666666668,"d":"1608.32"},{"v":1578.7333333333336,"d":"1578.73"},{"v":1560.5666666666668,"d":"1560.57"},{"v":1530.9833333333336,"d":"1530.98"},{"v":1626.4833333333336,"d":"1626.48"},{"v":1656.066666666667,"d":"1656.07"},{"v":1674.2333333333336,"d":"1674.23"},1637.9,1590.15,4.27581]
[10,"AUBANK",639.4,{"v":636.8000000000001,"d":"636.80"},{"v":627.6000000000001,"d":"627.60"},{"v":615.8000000000001,"d":"615.80"},{"v":606.6000000000001,"d":"606.60"},{"v":648.6000000000001,"d":"648.60"},{"v":657.8000000000002,"d":"657.80"},{"v":669.6000000000001,"d":"669.60"},646,625,3.82191]
[11,"ADANIPORTS",371.9,{"v":375.3166666666666,"d":"375.32"},{"v":366.6833333333332,"d":"366.68"},{"v":361.46666666666664,"d":"361.47"},{"v":352.83333333333326,"d":"352.83"},{"v":380.5333333333332,"d":"380.53"},{"v":389.16666666666663,"d":"389.17"},{"v":394.38333333333316,"d":"394.38"},383.95,370.1,16.28805]
{"$rows_left_out":228}
{"sheet":"MidCap Intra","index":3,"n_rows":546,"n_cols":13,"rows_kept":546,"merged":[[0,0,0,1],[8,0,9,0],[8,1,9,1],[8,2,9,2],[8,3,9,3],[8,4,8,6],[8,7,8,9]]}
[]
[]
[]
[]
[{"$nulls":11},"Back To Main Page"]
["FOR INTRA DAY TRADING",{"$nulls":9},{"$f":"Main!B10","v":"2019-05-08"}]
[null,null," "]
[]
["Sr.no","Scrip","CLOSE RATE","Pivot Point","Supports",null,null,"Resistances"]
[null,null,"Point",null,"S1","S2","S3","R1","R2","R3","HIGH","LOW","Total Trade Quanity in Lakhs"]
[1,"3MINDIA",23225.7,{"v":23063.816666666666,"d":"23063.82"},{"v":22799.63333333333,"d":"22799.63"},{"v":22373.566666666666,"d":"22373.57"},{"v":22109.38333333333,"d":"22109.38"},{"v":23489.88333333333,"d":"23489.88"},{"v":23754.066666666666,"d":"23754.07"},{"v":24180.13333333333,"d":"24180.13"},23328,22637.75,0.00786]
[2,"ABB",1478.8,{"v":1480.4166666666667,"d":"1480.42"},{"v":1463.9333333333334,"d":"1463.93"},{"v":1449.0666666666666,"d":"1449.07"},{"v":1432.5833333333333,"d":"1432.58"},{"v":1495.2833333333335,"d":"1495.28"},{"v":1511.7666666666667,"d":"1511.77"},{"v":1526.6333333333337,"d":"1526.63"},1496.9,1465.55,0.57445]
[3,"ACC",1596.9,{"v":1608.3166666666668,"d":"1608.32"},{"v":1578.7333333333336,"d":"1578.73"},{"v":1560.5666666666668,"d":"1560.57"},{"v":1530.9833333333336,"d":"1530.98"},{"v":1626.4833333333336,"d":"1626.48"},{"v":1656.066666666667,"d":"1656.07"},{"v":1674.2333333333336,"d":"1674.23"},1637.9,1590.15,4.27581]
[4,"AIAENG",1722.1,{"v":1730.7333333333333,"d":"1730.73"},{"v":1701.3666666666668,"d":"1701.37"},{"v":1680.6333333333334,"d":"1680.63"},{"v":1651.2666666666669,"d":"1651.27"},{"v":1751.4666666666667,"d":"1751.47"},{"v":1780.833333333333,"d":"1780.83"},{"v":1801.5666666666666,"d":"1801.57"},1760.1,1710,0.05161]
[5,"APLAPOLLO",1512.05,{"v":1509.1166666666668,"d":"1509.12"},{"v":1482.2333333333336,"d":"1482.23"},{"v":1452.4166666666667,"d":"1452.42"},{"v":1425.5333333333335,"d":"1425.53"},{"v":1538.9333333333336,"d":"1538.93"},{"v":1565.8166666666668,"d":"1565.82"},{"v":1595.6333333333337,"d":"1595.63"},1536,1479.3,0.22256]
[6,"AUBANK",639.4,{"v":636.8000000000001,"d":"636.80"},{"v":627.6000000000001,"d":"627.60"},{"v":615.8000000000001,"d":"615.80"},{"v":606.6000000000001,"d":"606.60"},{"v":648.6000000000001,"d":"648.60"},{"v":657.8000000000002,"d":"657.80"},{"v":669.6000000000001,"d":"669.60"},646,625,3.82191]
[7,"AAVAS",1411.6,{"v":1408.5166666666667,"d":"1408.52"},{"v":1354.0833333333333,"d":"1354.08"},{"v":1296.5666666666666,"d":"1296.57"},{"v":1242.1333333333332,"d":"1242.13"},{"v":1466.0333333333333,"d":"1466.03"},{"v":1520.4666666666667,"d":"1520.47"},{"v":1577.9833333333333,"d":"1577.98"},1462.95,1351,4.26869]
[8,"ADANIGREEN",39.45,{"v":40.06666666666666,"d":"40.07"},{"v":38.48333333333333,"d":"38.48"},{"v":37.516666666666666,"d":"37.52"},{"v":35.93333333333333,"d":"35.93"},{"v":41.033333333333324,"d":"41.03"},{"v":42.61666666666667,"d":"42.62"},{"v":43.58333333333332,"d":"43.58"},41.65,39.1,7.52888]
[9,"ADANIPORTS",371.9,{"v":375.3166666666666,"d":"375.32"},{"v":366.6833333333332,"d":"366.68"},{"v":361.46666666666664,"d":"361.47"},{"v":352.83333333333326,"d":"352.83"},{"v":380.5333333333332,"d":"380.53"},{"v":389.16666666666663,"d":"389.17"},{"v":394.38333333333316,"d":"394.38"},383.95,370.1,16.28805]
[10,"ADANIPOWER",41.5,{"v":42.06666666666666,"d":"42.07"},{"v":40.58333333333333,"d":"40.58"},{"v":39.666666666666664,"d":"39.67"},{"v":38.18333333333333,"d":"38.18"},{"v":42.98333333333333,"d":"42.98"},{"v":44.46666666666666,"d":"44.47"},{"v":45.383333333333326,"d":"45.38"},43.55,41.15,84.36065]
{"$rows_left_out":513}
{"sheet":"Bulk Deals","index":4,"n_rows":104,"n_cols":8,"rows_kept":104,"merged":[[4,0,4,1],[4,2,4,3],[6,1,6,2]]}
[" "]
[]
[]
[]
[]
[{"$nulls":4},"Back To Main Page"]
["Subject :","BULK DEAL",null,{"$f":"Main!B10","v":"2019-05-08"}]
[]
["Date","Scrip code","Scrip Name","Client Name","Buy / Sell","Quantity Traded","Trade Price / Wt.Avg.trade price","Exchange  "]
["2019-05-07",537766,"BCP","JITAL ASHISH THAKAR","BUY",{"v":300000,"d":"300,000"},{"v":38.3,"d":"38.30"},"BSE"]
["2019-05-07",537766,"BCP","ACHINTYA SECURITIES PVT. LTD.","BUY",{"v":645513,"d":"645,513"},39.03,"BSE"]
["2019-05-07",537766,"BCP","ACHINTYA SECURITIES PVT. LTD.","SELL",{"v":645513,"d":"645,513"},38.35,"BSE"]
["2019-05-07",537766,"BCP","ITJ RETAILS PRIVATE LIMITED","SELL",{"v":400000,"d":"400,000"},38.55,"BSE"]
["2019-05-07",542627,"CHANDNIMACH","ASHWINI JITEN AJMERA","SELL",{"v":22000,"d":"22,000"},16.2,"BSE"]
["2019-05-07",538432,"DIVINUS","ASHARI AGENCIES LIMITED","BUY",{"v":50000,"d":"50,000"},22.1,"BSE"]
["2019-05-07",538432,"DIVINUS","MANOJKUMAR GUNVANTRAI SOMANI","BUY",23,21.95,"BSE"]
["2019-05-07",538432,"DIVINUS","MANOJKUMAR GUNVANTRAI SOMANI","SELL",{"v":38430,"d":"38,430"},22.02,"BSE"]
["2019-05-07",538432,"DIVINUS","SAMADHAN SHANKAR KADAM","BUY",{"v":36000,"d":"36,000"},{"v":22,"d":"22.00"},"BSE"]
["2019-05-07",533090,"EXCEL","SHRIRAM CREDIT COMPANY LIMITED","SELL",{"v":523820,"d":"523,820"},1.04,"BSE"]
["2019-05-07",541276,"GARVIND","SWATI KAPOOR","SELL",{"v":80000,"d":"80,000"},10.1,"BSE"]
{"$rows_left_out":85}
{"sheet":"Call Tracker (Equity & F&O)","index":5,"n_rows":267,"n_cols":18,"rows_kept":267,"merged":[[30,0,31,0],[30,1,31,1],[30,2,31,2],[30,9,31,9],[30,11,31,11],[30,12,31,12],[30,13,31,13],[30,14,31,14],[32,0,33,0],[32,1,33,1],[32,2,33,2],[32,9,33,9],[32,11,33,11],[32,12,33,12],[32,13,33,13],[32,14,33,14],[34,0,35,0],[34,1,35,1],[34,2,35,2],[34,9,35,9],[34,11,35,11],[34,12,35,12],[34,13,35,13],[34,14,35,14]]}
[]
[]
[]
[]
[{"$nulls":12},"Back To Main Page"]
["Retail Research Technical Calls & Fundamental Performance Report for the month of May-2019 "]
[{"$nulls":12},{"$f":"Main!B10","v":"2019-05-08"}]
[null,"Positional  Call"]
["Sr.no","Date",null,"Company","Rec","Rec Price","Stop Loss***","Call Closed At","Target","Remark","Profit / Loss per Share","Gain / Loss  %","Status","Closed Date","NSE Closed Price"]
[1,"2019-04-03",null,"BOSCHLTD","Buy","17950-18000",16850,null,"19500-20000","Open",{"$nulls":4},{"$f":"VLOOKUP(D10,Sheet2!A22:M1817,6,0)","v":17784.7},null,null,"R"]
[2,"2019-04-08",null,"BAJFINANCE","Sell","3000-3010",3166.6,null,"2750-2700","Open",{"$nulls":4},{"$f":"VLOOKUP(D11,Sheet2!A25:M1820,6,0)","v":3017.05},null,null,"R"]
[3,"2019-04-23",null,"DMART","Buy","1300-1310",1212,null,"1470-1500","Open",{"$nulls":4},{"$f":"VLOOKUP(D12,Sheet2!A29:M1824,6,0)","v":1255.1},null,null,"R"]
[4,"2019-04-24",null,"VEDL","Buy",173,164,164,"190-195","Loss of Rs.9/-",{"$f":"H13-F13","v":-9},{"$f":"K13/F13","v":{"v":-0.05202312138728324,"d":"-5.20%"}},"Unsuccessful","2019-05-07",{"$nulls":3},"H"]
[5,"2019-04-25",null,"GRASIM","Sell",900.5,945.6,873,"820-810","Part Profit of Rs.27.5",{"$f":"F14-H14","v":27.5},{"$f":"K14/F14","v":{"v":0.03053858967240422,"d":"3.05%"}},"Successful","2019-05-07",{"$nulls":3},"R"]
[6,"2019-05-02",null,"BAJAJFINSV","Sell","7610-7630 ",7880,null,7200,"Open",{"$nulls":4},{"$f":"VLOOKUP(D15,Sheet2!A33:M1828,6,0)","v":7561.95},null,null,"H"]
[7,"2019-05-02",null,"IDFCFIRSTB","Buy","50.20-50.70",48,null,"55-56","Open",{"$nulls":4},{"$f":"VLOOKUP(D16,Sheet2!A34:M1829,6,0)","v":48.75},null,null,"H"]
[8,"2019-05-03",null,"APOLLOTYRE","Buy","202-204",189,null,"225-230","Open",{"$nulls":4},{"$f":"VLOOKUP(D17,Sheet2!A35:M1830,6,0)","v":195.2},null,null,"H"]
[9,"2019-05-03",null,"M&M","Buy","642-646",615,null,"690-700","Open",{"$nulls":4},{"$f":"VLOOKUP(D18,Sheet2!A36:M1831,6,0)","v":636},null,null,"H"]
[10,"2019-05-06",null,"MARUTI","Buy","6650-6700",6400,null,"7200-7300","Open",{"$nulls":4},{"$f":"VLOOKUP(D19,Sheet2!A37:M1832,6,0)","v":6702},null,null,"H"]
[]
{"$rows_left_out":236}
{"sheet":"Sheet2","index":6,"n_rows":1630,"n_cols":14,"rows_kept":1630,"hidden":true}
["SYMBOL","SERIES","OPEN","HIGH","LOW","CLOSE","LAST","PREVCLOSE","TOTTRDQTY","TOTTRDVAL","TIMESTAMP","TOTALTRADES","ISIN","ISIN"]
["20MICRONS","EQ",37.7,37.75,36.65,37,36.75,37.3,17100,635716.35,"2019-05-07",226,"INE144J01027"]
["21STCENMGM","EQ",22.1,22.5,21.7,21.7,21.7,22.1,1887,41267.8,"2019-05-07",18,"INE253B01015"]
["3IINFOTECH","EQ",3.85,4,3.75,3.8,3.75,3.8,2995986,11614515.35,"2019-05-07",992,"INE748C01020"]
["3MINDIA","EQ",22830,23328,22637.75,23225.7,23210,22831.65,786,18115799.4,"2019-05-07",470,"INE470A01017"]
["3PLAND","BE",11.3,11.3,11.3,11.3,11.3,10.8,1,11.3,"2019-05-07",1,"INE105C01023"]
["5PAISA","EQ",280.05,294.45,280.05,291.1,290.65,286.25,5907,1710006.1,"2019-05-07",358,"INE618L01018"]
["63MOONS","EQ",167.05,167.05,167.05,167.05,167.05,159.1,207767,34707477.35,"2019-05-07",849,"INE111B01023"]
["8KMILES","EQ",108.4,112,105.95,106.45,106.7,107.1,158479,17358477.55,"2019-05-07",2361,"INE650K01021"]
["A2ZINFRA","EQ",16.6,16.75,16.4,16.5,16.45,16.5,92820,1538454.95,"2019-05-07",235,"INE619I01012"]
["AARTIDRUGS","EQ",613.6,620.05,608.5,617.9,620,616.45,5375,3310634.75,"2019-05-07",342,"INE767A01016"]
["AARTIIND","EQ",1587,1610,1587,1599.5,1600.6,1577.1,17792,28462359.4,"2019-05-07",2293,"INE769A01020"]
["AARVEEDEN","EQ",23.8,26.3,22.7,23.8,23.8,23.55,82041,2025155.75,"2019-05-07",552,"INE273D01019"]
["AAVAS","EQ",1357,1462.95,1351,1411.6,1405,1343.15,426869,596813857.2,"2019-05-07",16287,"INE216P01012"]
["ABAN","BE",50.5,51.5,50,50.5,50.3,50.5,28724,1456314.25,"2019-05-07",374,"INE421A01028"]
["ABB","EQ",1475,1496.9,1465.55,1478.8,1476,1479.05,57445,84915399.7,"2019-05-07",3974,"INE117A01022"]
["ABBOTINDIA","EQ",7420,7430,7252.3,7287.3,7280,7381,3922,28708025.35,"2019-05-07",808,"INE358A01014"]
["ABCAPITAL","EQ",102,102.45,99.25,100.35,99.35,101.15,2009126,202693392.75,"2019-05-07",10831,"INE674K01013"]
["ABFRL","EQ",209.5,210.4,204.35,209,208,209.8,448973,93246564.4,"2019-05-07",17199,"INE647O01011"]
["ABSLNN50ET","EQ",315,319,293,313.2,313.2,318.9,229,69732.39,"2019-05-07",28,"INF209KB1B87"]
{"$rows_left_out":1611}
{"sheet":"Sheet1","index":7,"n_rows":0,"n_cols":0,"rows_kept":0,"hidden":true}

{"sheet":"Sheet3","index":8,"n_rows":0,"n_cols":0,"rows_kept":0,"hidden":true}

{"sheet":"Sheet4","index":9,"n_rows":0,"n_cols":0,"rows_kept":0,"hidden":true}