{"text_format":"3","workbook":"xlsx","n_sheets":7,"sheets":["Main","Future Intra","Cash Intra","MidCap Intra","Bulk Deals","Call Tracker (Equity & F&O)","Sheet2"],"not_rendered":{"images":4,"defined_names":4},"read":"whole","date_system":"1900"}

{"sheet":"Main","index":0,"n_rows":17,"n_cols":4,"rows_kept":17}
[null,"                                                                                                 "]
{"$rows_empty":8}
[null,"2018-09-07"]
[]
[null,"Sheet No.","Template Name","Summary"]
[null,1,"Future Intra","For Intraday trading in F&O segment"]
[null,2,"Cash Intra","For Intraday trading in cash market segment"]
[null,3,"Mid-cap Intra","For Intraday trading in Mid-cap stocks"]
[null,4,"Bulk Deals","Reveals Bulk Deals carried on NSE & BSE"]
[null,5,"Call Tracker"]

{"sheet":"Future Intra","index":1,"n_rows":250,"n_cols":15,"rows_kept":250,"merged":[[8,0,9,0],[8,1,9,1],[8,2,9,2],[8,5,8,7],[8,8,8,10]]}
[]
[]
[]
[]
[{"$nulls":12},"Back to Main Page"]
["FOR INTRA DAY TRADING",{"$nulls":10},{"$f":"Main!B10","v":"2018-09-07"}]
[]
[]
["Sr.no","Sector","Scrip","CLOSE RATE","Pivot Point","Supports",null,null,"Resistances"]
[null,"Sector",null,"Point","Point","S1","S2","S3","R1","R2","R3","HIGH","LOW","OI","% Change in OI"]
[1,"Index","BANKNIFTY",27578.15,{"v":27544.316666666666,"d":"27544.32"},{"v":27418.783333333333,"d":"27418.78"},{"v":27259.416666666668,"d":"27259.42"},{"v":27133.883333333335,"d":"27133.88"},{"v":27703.68333333333,"d":"27703.68"},{"v":27829.216666666664,"d":"27829.22"},{"v":27988.58333333333,"d":"27988.58"},27669.85,27384.95,1530960,{"v":-0.07396385279814183,"d":"-7.40%"}]
[2,"Index","NIFTY",11567.15,{"v":11546.800000000001,"d":"11546.80"},{"v":11490.600000000002,"d":"11490.60"},{"v":11414.050000000001,"d":"11414.05"},{"v":11357.850000000002,"d":"11357.85"},{"v":11623.350000000002,"d":"11623.35"},{"v":11679.550000000003,"d":"11679.55"},{"v":11756.100000000002,"d":"11756.10"},11603,11470.25,28455300,{"v":0.037703182821461685,"d":"3.77%"}]
[3,"Index","NIFTYCPSE",{"v":2187.4,"d":"2187.40"},{"v":729.1333333333333,"d":"729.13"},{"v":1458.2666666666667,"d":"1458.27"},{"v":729.1333333333333,"d":"729.13"},{"v":1458.2666666666667,"d":"1458.27"},{"v":1458.2666666666667,"d":"1458.27"},{"v":729.1333333333333,"d":"729.13"},{"v":1458.2666666666667,"d":"1458.27"},0,0,0,{"v":0,"d":"0.00%"}]
[4,"Index","NIFTYINFRA",3108.75,1036.25,{"v":2072.5,"d":"2072.50"},1036.25,{"v":2072.5,"d":"2072.50"},{"v":2072.5,"d":"2072.50"},1036.25,{"v":2072.5,"d":"2072.50"},0,0,0,{"v":0,"d":"0.00%"}]
[5,"Index","NIFTYIT",{"v":16110,"d":"16110.00"},{"v":16093.666666666666,"d":"16093.67"},{"v":16017.333333333332,"d":"16017.33"},{"v":15924.666666666666,"d":"15924.67"},{"v":15848.333333333332,"d":"15848.33"},{"v":16186.333333333332,"d":"16186.33"},{"v":16262.666666666664,"d":"16262.67"},{"v":16355.333333333332,"d":"16355.33"},16170,16001,26250,{"v":0.041666666666666664,"d":"4.17%"}]
[6,"Index","NIFTYMID50",5279.55,5279.55,5279.55,5279.55,5279.55,5279.55,5279.55,5279.55,5279.55,5279.55,591910,{"v":0,"d":"0.00%"}]
[7,"Index","NIFTYPSE",3501.05,{"v":1167.0166666666667,"d":"1167.02"},{"v":2334.0333333333333,"d":"2334.03"},{"v":1167.0166666666667,"d":"1167.02"},{"v":2334.0333333333333,"d":"2334.03"},{"v":2334.0333333333333,"d":"2334.03"},{"v":1167.0166666666667,"d":"1167.02"},{"v":2334.0333333333333,"d":"2334.03"},0,0,0,{"v":0,"d":"0.00%"}]
[8,"Cement","ACC",{"v":1568.3,"d":"1568.30"},{"v":1578.2833333333335,"d":"1578.28"},{"v":1542.566666666667,"d":"1542.57"},{"v":1516.8333333333335,"d":"1516.83"},{"v":1481.116666666667,"d":"1481.12"},{"v":1604.016666666667,"d":"1604.02"},{"v":1639.7333333333338,"d":"1639.73"},{"v":1665.4666666666672,"d":"1665.47"},1614,1552.55,1687200,{"v":0.03306392358559882,"d":"3.31%"}]
[9,"Others","ADANIENT",{"v":164.9,"d":"164.90"},{"v":158.5,"d":"158.50"},{"v":146.4,"d":"146.40"},{"v":127.9,"d":"127.90"},{"v":115.80000000000001,"d":"115.80"},{"v":177,"d":"177.00"},{"v":189.10000000000002,"d":"189.10"},{"v":207.6,"d":"207.60"},170.6,140,11156000,{"v":0.13651181744091279,"d":"13.65%"}]
[10,"Others","ADANIPORTS",{"v":386.4,"d":"386.40"},383.95,{"v":378.9,"d":"378.90"},{"v":371.4,"d":"371.40"},{"v":366.34999999999997,"d":"366.35"},391.45,{"v":396.50000000000006,"d":"396.50"},{"v":404,"d":"404.00"},389,376.45,8887500,{"v":0.015424164524421594,"d":"1.54%"}]
{"$rows_left_out":224}
{"sheet":"Cash Intra","index":2,"n_rows":248,"n_cols":13,"rows_kept":248,"merged":[[7,0,8,0],[7,1,8,1],[7,2,8,2],[7,3,8,3],[7,4,7,6],[7,7,7,9]]}
[]
[]
[]
[]
[{"$nulls":12},"Back to Main Page"]
["FOR INTRA DAY TRADING",{"$nulls":9},{"$f":"Main!B10","v":"2018-09-07"}]
[]
["Sr.no","Scrip","CLOSE RATE","Pivot Point","Supports",null,null,"Resistances"]
[null,null,"Point",null,"S1","S2","S3","R1","R2","R3","HIGH","LOW","Total Trade Quanity in Lakhs"]
[1,"Nifty 50",11536.9,{"v":11511.733333333332,"d":"11511.73"},{"v":11461.216666666664,"d":"11461.22"},{"v":11385.533333333331,"d":"11385.53"},{"v":11335.016666666663,"d":"11335.02"},{"v":11587.416666666664,"d":"11587.42"},{"v":11637.93333333333,"d":"11637.93"},{"v":11713.616666666665,"d":"11713.62"},11562.25,11436.05]
[2,"Nifty Bank",27468.7,{"v":27422.583333333332,"d":"27422.58"},{"v":27292.366666666665,"d":"27292.37"},{"v":27116.033333333333,"d":"27116.03"},{"v":26985.816666666666,"d":"26985.82"},{"v":27598.916666666664,"d":"27598.92"},{"v":27729.13333333333,"d":"27729.13"},{"v":27905.466666666664,"d":"27905.47"},27552.8,27246.25]
[3,"Nifty CPSE",2326.95,{"v":2315.7833333333333,"d":"2315.78"},{"v":2299.4166666666665,"d":"2299.42"},{"v":2271.883333333333,"d":"2271.88"},{"v":2255.5166666666664,"d":"2255.52"},{"v":2343.3166666666666,"d":"2343.32"},{"v":2359.6833333333334,"d":"2359.68"},{"v":2387.2166666666667,"d":"2387.22"},2332.15,2288.25]
[4,"Nifty Infra",3217.65,{"v":3211.7000000000003,"d":"3211.70"},{"v":3199.3000000000006,"d":"3199.30"},{"v":3180.9500000000003,"d":"3180.95"},{"v":3168.5500000000006,"d":"3168.55"},{"v":3230.0500000000006,"d":"3230.05"},{"v":3242.4500000000003,"d":"3242.45"},{"v":3260.8000000000006,"d":"3260.80"},3224.1,3193.35]
[5,"Nifty IT",16081.65,{"v":16045.266666666668,"d":"16045.27"},{"v":15969.033333333336,"d":"15969.03"},{"v":15856.416666666668,"d":"15856.42"},{"v":15780.183333333336,"d":"15780.18"},{"v":16157.883333333337,"d":"16157.88"},{"v":16234.11666666667,"d":"16234.12"},{"v":16346.733333333337,"d":"16346.73"},16121.5,15932.65]
[6,"Nifty PSE",3653.8,3641.35,3623.25,{"v":3592.7000000000003,"d":"3592.70"},{"v":3574.6000000000004,"d":"3574.60"},{"v":3671.8999999999996,"d":"3671.90"},{"v":3689.999999999999,"d":"3690.00"},{"v":3720.5499999999993,"d":"3720.55"},3659.45,3610.8]
[7,"Nifty Midcap 50",5155.05,{"v":5144.666666666667,"d":"5144.67"},{"v":5110.033333333334,"d":"5110.03"},{"v":5065.016666666666,"d":"5065.02"},{"v":5030.383333333333,"d":"5030.38"},{"v":5189.683333333334,"d":"5189.68"},{"v":5224.3166666666675,"d":"5224.32"},{"v":5269.333333333335,"d":"5269.33"},5179.3,5099.65]
[8,"ABB",1296,{"v":1291.7,"d":"1291.70"},{"v":1274.4,"d":"1274.40"},{"v":1252.8,"d":"1252.80"},{"v":1235.5,"d":"1235.50"},{"v":1313.3000000000002,"d":"1313.30"},{"v":1330.6,"d":"1330.60"},{"v":1352.2000000000003,"d":"1352.20"},1309,1270.1,1.67557]
[9,"ACC",1557.6,{"v":1568.3,"d":"1568.30"},{"v":1532.3,"d":"1532.30"},{"v":1507,"d":"1507.00"},{"v":1471,"d":"1471.00"},{"v":1593.6,"d":"1593.60"},{"v":1629.6,"d":"1629.60"},{"v":1654.8999999999999,"d":"1654.90"},1604.3,1543,6.79382]
[10,"AIAENG",1764.95,{"v":1750.6000000000001,"d":"1750.60"},{"v":1722.8500000000004,"d":"1722.85"},{"v":1680.7500000000002,"d":"1680.75"},{"v":1653.0000000000005,"d":"1653.00"},{"v":1792.7000000000003,"d":"1792.70"},{"v":1820.4499999999998,"d":"1820.45"},{"v":1862.5500000000002,"d":"1862.55"},1778.35,1708.5,0.21642]
[11,"AUBANK",680.05,{"v":686.7833333333334,"d":"686.78"},{"v":666.4666666666668,"d":"666.47"},{"v":652.8833333333334,"d":"652.88"},{"v":632.5666666666668,"d":"632.57"},{"v":700.3666666666668,"d":"700.37"},{"v":720.6833333333334,"d":"720.68"},{"v":734.2666666666668,"d":"734.27"},707.1,673.2,5.82829]
{"$rows_left_out":229}
{"sheet":"MidCap Intra","index":3,"n_rows":510,"n_cols":13,"rows_kept":510,"merged":[[0,0,0,1],[8,0,9,0],[8,1,9,1],[8,2,9,2],[8,3,9,3],[8,4,8,6],[8,7,8,9]]}
[]
[]
[]
[]
[{"$nulls":11},"Back To Main Page"]
["FOR INTRA DAY TRADING",{"$nulls":9},{"$f":"Main!B10","v":"2018-09-07"}]
[null,null," "]
[]
["Sr.no","Scrip","CLOSE RATE","Pivot Point","Supports",null,null,"Resistances"]
[null,null,"Point",null,"S1","S2","S3","R1","R2","R3","HIGH","LOW","Total Trade Quanity in Lakhs"]
[1,"3MINDIA",25790.35,{"v":25646.783333333336,"d":"25646.78"},{"v":25343.566666666673,"d":"25343.57"},{"v":24896.783333333336,"d":"24896.78"},{"v":24593.566666666673,"d":"24593.57"},{"v":26093.566666666673,"d":"26093.57"},{"v":26396.78333333334,"d":"26396.78"},{"v":26843.566666666673,"d":"26843.57"},25950,25200,0.01465]
[2,"8KMILES",304.9,{"v":305.5333333333333,"d":"305.53"},{"v":301.16666666666663,"d":"301.17"},{"v":297.43333333333334,"d":"297.43"},{"v":293.06666666666666,"d":"293.07"},{"v":309.2666666666666,"d":"309.27"},{"v":313.63333333333327,"d":"313.63"},{"v":317.36666666666656,"d":"317.37"},309.9,301.8,0.3004]
[3,"AARTIIND",1355.85,{"v":1343.8666666666666,"d":"1343.87"},{"v":1325.7333333333331,"d":"1325.73"},{"v":1295.6166666666666,"d":"1295.62"},{"v":1277.4833333333331,"d":"1277.48"},{"v":1373.9833333333331,"d":"1373.98"},{"v":1392.1166666666668,"d":"1392.12"},{"v":1422.2333333333331,"d":"1422.23"},1362,1313.75,0.21341]
[4,"ABAN",111.4,{"v":112,"d":"112.00"},{"v":110.3,"d":"110.30"},{"v":109.2,"d":"109.20"},{"v":107.5,"d":"107.50"},{"v":113.1,"d":"113.10"},{"v":114.79999999999998,"d":"114.80"},{"v":115.89999999999999,"d":"115.90"},113.7,110.9,3.64517]
[5,"ABB",1296,{"v":1291.7,"d":"1291.70"},{"v":1274.4,"d":"1274.40"},{"v":1252.8,"d":"1252.80"},{"v":1235.5,"d":"1235.50"},{"v":1313.3000000000002,"d":"1313.30"},{"v":1330.6,"d":"1330.60"},{"v":1352.2000000000003,"d":"1352.20"},1309,1270.1,1.67557]
[6,"ABCAPITAL",137.35,{"v":136.9,"d":"136.90"},{"v":135.95000000000002,"d":"135.95"},134.55,{"v":133.60000000000002,"d":"133.60"},{"v":138.3,"d":"138.30"},139.25,140.65,137.85,135.5,9.28653]
[7,"ABFRL",199.3,{"v":202.79999999999998,"d":"202.80"},{"v":194.59999999999997,"d":"194.60"},{"v":189.89999999999998,"d":"189.90"},{"v":181.69999999999996,"d":"181.70"},{"v":207.49999999999997,"d":"207.50"},{"v":215.69999999999996,"d":"215.70"},{"v":220.39999999999998,"d":"220.40"},211,198.1,22.64576]
[8,"ACC",1557.6,{"v":1568.3,"d":"1568.30"},{"v":1532.3,"d":"1532.30"},{"v":1507,"d":"1507.00"},{"v":1471,"d":"1471.00"},{"v":1593.6,"d":"1593.60"},{"v":1629.6,"d":"1629.60"},{"v":1654.8999999999999,"d":"1654.90"},1604.3,1543,6.79382]
[9,"ADANIPORTS",384.8,{"v":382.3166666666666,"d":"382.32"},{"v":377.1333333333332,"d":"377.13"},{"v":369.4666666666666,"d":"369.47"},{"v":364.2833333333332,"d":"364.28"},{"v":389.98333333333323,"d":"389.98"},{"v":395.16666666666663,"d":"395.17"},{"v":402.83333333333326,"d":"402.83"},387.5,374.65,18.20623]
[10,"ADANIPOWER",31.9,{"v":31.933333333333337,"d":"31.93"},{"v":31.366666666666674,"d":"31.37"},{"v":30.833333333333336,"d":"30.83"},{"v":30.266666666666673,"d":"30.27"},{"v":32.466666666666676,"d":"32.47"},{"v":33.03333333333334,"d":"33.03"},{"v":33.56666666666668,"d":"33.57"},32.5,31.4,244.26224]
{"$rows_left_out":491}
{"sheet":"Bulk Deals","index":4,"n_rows":62,"n_cols":8,"rows_kept":62,"merged":[[4,0,4,1],[4,2,4,3],[6,1,6,2]]}
[" "]
[]
[]
[]
[]
[{"$nulls":4},"Back To Main Page"]
["Subject :","BULK DEAL",null,{"$f":"Main!B10","v":"2018-09-07"}]
[]
["Date","Scrip code","Scrip Name","Client Name","Buy / Sell","Quantity Traded","Trade Price / Wt.Avg.trade price","Exchange  "]
["2018-09-06",539693,"ALORA","NISHA MAHENDRA SHAH","BUY",{"v":86217,"d":"86,217"},2.66,"BSE"]
["2018-09-06",540694,"ANG","NEERAJ GUPTA","SELL",{"v":22400,"d":"22,400"},59.49,"BSE"]
["2018-09-06",540694,"ANG","NEERAJ GUPTA","BUY",{"v":28800,"d":"28,800"},63.3,"BSE"]
["2018-09-06",540694,"ANG","PRABHSIMRAN KAUR","SELL",{"v":28800,"d":"28,800"},63.3,"BSE"]
["2018-09-06",540694,"ANG","PRABHSIMRAN KAUR","BUY",{"v":28800,"d":"28,800"},59.34,"BSE"]
["2018-09-06",512149,"AVANCE","ORANGE MIST PRODUCTIONS PRIVATE LIMITED","SELL",{"v":1190909,"d":"1,190,909"},0.23,"BSE"]
["2018-09-06",539009,"GBLIL","REKHA RAVI BHANDARI","BUY",{"v":100000,"d":"100,000"},35.51,"BSE"]
["2018-09-06",539009,"GBLIL","DIXIT NARESHBHAI BORISA","SELL",{"v":40000,"d":"40,000"},36.13,"BSE"]
["2018-09-06",539009,"GBLIL","DINESHBHAI KANJIBHAI THAKKAR","SELL",{"v":30000,"d":"30,000"},36.33,"BSE"]
["2018-09-06",541083,"INFLAME","EXCEL STOCK BROKING PRIVATE LIMITED","SELL",{"v":4000,"d":"4,000"},65.85,"BSE"]
["2018-09-06",541083,"INFLAME","EXCEL STOCK BROKING PRIVATE LIMITED","BUY",{"v":30000,"d":"30,000"},68.92,"BSE"]
{"$rows_left_out":43}
{"sheet":"Call Tracker (Equity & F&O)","index":5,"n_rows":289,"n_cols":18,"rows_kept":289,"merged":[[51,0,52,0],[51,1,52,1],[51,8,52,8],[51,9,52,9],[51,10,52,10],[51,11,52,11],[51,12,52,12],[51,13,52,13],[51,14,52,14]]}
[]
[]
[]
[]
[{"$nulls":12},"Back To Main Page"]
["Retail Research Technical Calls & Fundamental Performance Report for the month of September -2018 "]
[{"$nulls":12},{"$f":"Main!B10","v":"2018-09-07"}]
[null,"Positional  Call"]
["Sr.no","Date",null,"Company","Rec","Rec Price","Stop Loss***","Call Closed At","Target","Remark","Profit / Loss per Share","Gain / Loss  %","Status","Closed Date","NSE Closed Price"]
[1,"2018-08-23",null,"PARAGMILK","Buy",304,289.7,289.7,"332-336","Loss of Rs. 14.30/-",{"$f":"H10-F10","v":-14.300000000000011},{"$f":"K10/F10","v":{"v":-0.04703947368421056,"d":"-4.70%"}},"UnSuccessful","2018-09-06",{"$nulls":3},"R"]
[2,"2018-08-31",null,"SIEMENS","Buy","990-1000",945,null,"1085-1095","Open",{"$nulls":4},{"$f":"VLOOKUP(D11,Sheet2!$A$1:M2195,6,0)","v":998.45},null,null,"R"]
[3,"2018-08-31",null,"SUNPHARMA","Buy",651,618,672.5,"700-720","Part profit of Rs.21.5/-",{"$f":"H12-F12","v":21.5},{"$f":"K12/F12","v":{"v":0.03302611367127496,"d":"3.30%"}},"Successful","2018-09-03",{"$f":"VLOOKUP(D12,Sheet2!$A$1:M2196,6,0)","v":677.4},null,null,"H"]
[4,"2018-09-03",null,"RECLTD","Buy",121,116,116,"135-140","Loss of Rs. 5/-",{"$f":"H13-F13","v":-5},{"$f":"K13/F13","v":{"v":-0.04132231404958678,"d":"-4.13%"}},"UnSuccessful","2018-09-04",{"$nulls":3},"H"]
[5,"2018-09-04",null,"KPIT","Sell","300-302",315.3,null,"275-270","Open",{"$nulls":4},{"$f":"VLOOKUP(D14,Sheet2!$A$1:M2198,6,0)","v":310},null,null,"R"]
[6,"2018-09-05",null,"YESBANK","Buy",335.5,319,347.5,360,"Profit of Rs.12/-",{"$f":"H15-F15","v":12},{"$f":"K15/F15","v":{"v":0.03576751117734724,"d":"3.58%"}},"Successful","2018-09-06",{"$nulls":3},"H"]
[7,"2018-09-06",null,"HINDPETRO","Buy","250-252",238.7,null,"272-276","Open",{"$nulls":4},{"$f":"VLOOKUP(D16,Sheet2!$A$1:M2200,6,0)","v":251.85},null,null,"R"]
[8,"2018-09-06",null,"GRASIM","Buy","1020-1030",985,null,1100,"Open",{"$nulls":4},{"$f":"VLOOKUP(D17,Sheet2!$A$1:M2201,6,0)","v":1030.9},null,null,"H"]
[9,"2018-09-06",null,"INDIANB","Buy","311-313",298,null,"330-335","Open",{"$nulls":4},{"$f":"VLOOKUP(D18,Sheet2!$A$1:M2202,6,0)","v":316},null,null,"H"]
[10,"2018-09-06",null,"BRITANNIA","Buy","6120-6140",5865,null,"6600-6650","Open",{"$nulls":4},{"$f":"VLOOKUP(D19,Sheet2!$A$1:M2203,6,0)","v":6194.45},null,null,"R"]
{"$rows_empty":9}
{"$rows_left_out":210}
{"sheet":"Sheet2","index":6,"n_rows":1654,"n_cols":14,"rows_kept":1654,"hidden":true}
["SYMBOL","SERIES","OPEN","HIGH","LOW","CLOSE","LAST","PREVCLOSE","TOTTRDQTY","TOTTRDVAL","TIMESTAMP","TOTALTRADES","ISIN","ISIN"]
["20MICRONS","EQ",48.5,48.5,47.2,47.7,47.6,47.35,45177,2151199.8,"2018-09-06",1269,"INE144J01027"]
["21STCENMGM","EQ",33.2,33.2,32.6,32.6,32.6,33.25,19500,636404.85,"2018-09-06",66,"INE253B01015"]
["3IINFOTECH","EQ",3.55,3.6,3.5,3.55,3.55,3.5,1095660,3869430.45,"2018-09-06",471,"INE748C01020"]
["3MINDIA","EQ",25423,25950,25200,25790.35,25751.1,25307.1,1465,37424790,"2018-09-06",417,"INE470A01017"]
["3PLAND","BE",12.65,12.65,12.65,12.65,12.65,12.05,20,253,"2018-09-06",1,"INE105C01023"]
["5PAISA","EQ",284.4,300,284.4,298.85,298.95,288,4188,1246580.6,"2018-09-06",405,"INE618L01018"]
["63MOONS","EQ",78.35,80.5,78.25,78.6,78.8,78.2,125507,9939191.7,"2018-09-06",1708,"INE111B01023"]
["8KMILES","BE",301.8,309.9,301.8,304.9,304.2,299.05,30040,9183730.45,"2018-09-06",888,"INE650K01021"]
["A2ZINFRA","EQ",19.05,19.35,18.7,19.15,19.1,18.9,213025,4059635.3,"2018-09-06",768,"INE619I01012"]
["AARTIDRUGS","EQ",597,628,592,621.75,620,596.25,105344,64522687.65,"2018-09-06",4361,"INE767A01016"]
["AARTIIND","EQ",1329.1,1362,1313.75,1355.85,1351,1321.1,21341,28758689.2,"2018-09-06",2117,"INE769A01020"]
["AARVEEDEN","EQ",28.9,29.9,28.15,29.35,29.6,29,9168,267065.5,"2018-09-06",77,"INE273D01019"]
["ABAN","EQ",113.5,113.7,110.9,111.4,111.05,113,364517,40760750.3,"2018-09-06",4139,"INE421A01028"]
["ABB","EQ",1280.75,1309,1270.1,1296,1304,1268.15,167557,214129586.45,"2018-09-06",4766,"INE117A01022"]
["ABBOTINDIA","EQ",8298,8540.1,8162.3,8490.85,8475.05,8299.45,12700,106795277.95,"2018-09-06",2670,"INE358A01014"]
["ABCAPITAL","EQ",136.05,137.85,135.5,137.35,137.35,135.9,928653,126963575.9,"2018-09-06",11454,"INE674K01013"]
["ABFRL","EQ",202,211,198.1,199.3,199.05,201.55,2264576,465666891.05,"2018-09-06",27934,"INE647O01011"]
["ABMINTLTD","BE",17.8,17.8,16.2,16.25,16.25,17.05,572,9806.8,"2018-09-06",5,"INE251C01017"]
["ACC","EQ",1563.95,1604.3,1543,1557.6,1560.1,1548.2,679382,1066070707.2,"2018-09-06",25129,"INE012A01025"]
{"$rows_left_out":1634}