{"text_format":"3","workbook":"xlsx","n_sheets":10,"sheets":["Main","Future Intra","Cash Intra","MidCap Intra","Bulk Deals","Call Tracker (Equity & F&O)","Call Tracker (Currency)","Sheet2","Sheet1","Sheet3"],"not_rendered":{"images":4,"defined_names":4},"read":"whole","date_system":"1900"}

{"sheet":"Main","index":0,"n_rows":17,"n_cols":4,"rows_kept":17}
[null,"                                                                                                 "]
{"$rows_empty":8}
[null,"2018-06-07"]
[]
[null,"Sheet No.","Template Name","Summary"]
[null,1,"Future Intra","For Intraday trading in F&O segment"]
[null,2,"Cash Intra","For Intraday trading in cash market segment"]
[null,3,"Mid-cap Intra","For Intraday trading in Mid-cap stocks"]
[null,4,"Bulk Deals","Reveals Bulk Deals carried on NSE & BSE"]
[null,5,"Call Tracker"]

{"sheet":"Future Intra","index":1,"n_rows":250,"n_cols":15,"rows_kept":250,"merged":[[8,0,9,0],[8,1,9,1],[8,2,9,2],[8,5,8,7],[8,8,8,10]]}
[]
[]
[]
[]
[{"$nulls":12},"Back to Main Page"]
["FOR INTRA DAY TRADING",{"$nulls":10},{"$f":"Main!B10","v":"2018-06-07"}]
[]
[]
["Sr.no","Sector","Scrip","CLOSE RATE","Pivot Point","Supports",null,null,"Resistances"]
[null,"Sector",null,"Point","Point","S1","S2","S3","R1","R2","R3","HIGH","LOW","OI","% Change in OI"]
[1,"Index","BANKNIFTY",{"v":26391.5,"d":"26391.50"},{"v":26325.016666666666,"d":"26325.02"},{"v":26200.033333333333,"d":"26200.03"},{"v":26008.566666666666,"d":"26008.57"},{"v":25883.583333333332,"d":"25883.58"},{"v":26516.483333333334,"d":"26516.48"},{"v":26641.466666666664,"d":"26641.47"},{"v":26832.933333333334,"d":"26832.93"},26450,26133.55,2577360,{"v":0.016212976689903163,"d":"1.62%"}]
[2,"Index","NIFTY",10686.25,{"v":10654.083333333334,"d":"10654.08"},{"v":10607.166666666668,"d":"10607.17"},{"v":10528.083333333334,"d":"10528.08"},{"v":10481.166666666668,"d":"10481.17"},{"v":10733.166666666668,"d":"10733.17"},{"v":10780.083333333336,"d":"10780.08"},{"v":10859.166666666668,"d":"10859.17"},10701,10575,21390075,{"v":0.013543480578556451,"d":"1.35%"}]
[3,"Index","NIFTYCPSE",2463.55,{"v":821.1833333333334,"d":"821.18"},{"v":1642.3666666666668,"d":"1642.37"},{"v":821.1833333333334,"d":"821.18"},{"v":1642.3666666666668,"d":"1642.37"},{"v":1642.3666666666668,"d":"1642.37"},{"v":821.1833333333334,"d":"821.18"},{"v":1642.3666666666668,"d":"1642.37"},0,0,0,{"v":0,"d":"0.00%"}]
[4,"Index","NIFTYINFRA",{"v":3389.3,"d":"3389.30"},{"v":1129.7666666666667,"d":"1129.77"},{"v":2259.5333333333333,"d":"2259.53"},{"v":1129.7666666666667,"d":"1129.77"},{"v":2259.5333333333333,"d":"2259.53"},{"v":2259.5333333333333,"d":"2259.53"},{"v":1129.7666666666667,"d":"1129.77"},{"v":2259.5333333333333,"d":"2259.53"},0,0,0,{"v":0,"d":"0.00%"}]
[5,"Index","NIFTYIT",{"v":13489,"d":"13489.00"},{"v":13430,"d":"13430.00"},{"v":13360,"d":"13360.00"},{"v":13231,"d":"13231.00"},{"v":13161,"d":"13161.00"},{"v":13559,"d":"13559.00"},{"v":13629,"d":"13629.00"},{"v":13758,"d":"13758.00"},13500,13301,46450,{"v":-0.053007135575942915,"d":"-5.30%"}]
[6,"Index","NIFTYMID50",{"v":4900,"d":"4900.00"},{"v":4900,"d":"4900.00"},{"v":4900,"d":"4900.00"},{"v":4900,"d":"4900.00"},{"v":4900,"d":"4900.00"},{"v":4900,"d":"4900.00"},{"v":4900,"d":"4900.00"},{"v":4900,"d":"4900.00"},4900,4900,591800,{"v":3.3806626098715348E-4,"d":"0.03%"}]
[7,"Index","NIFTYPSE",{"v":3915.3,"d":"3915.30"},{"v":1305.1000000000001,"d":"1305.10"},{"v":2610.2000000000003,"d":"2610.20"},{"v":1305.1000000000001,"d":"1305.10"},{"v":2610.2000000000003,"d":"2610.20"},{"v":2610.2000000000003,"d":"2610.20"},{"v":1305.1000000000001,"d":"1305.10"},{"v":2610.2000000000003,"d":"2610.20"},0,0,0,{"v":0,"d":"0.00%"}]
[8,"Cement","ACC",1318.35,{"v":1305.2833333333333,"d":"1305.28"},{"v":1289.0666666666666,"d":"1289.07"},{"v":1259.7833333333333,"d":"1259.78"},{"v":1243.5666666666666,"d":"1243.57"},{"v":1334.5666666666666,"d":"1334.57"},{"v":1350.7833333333333,"d":"1350.78"},{"v":1380.0666666666666,"d":"1380.07"},1321.5,1276,3448800,{"v":-0.02156150703586019,"d":"-2.16%"}]
[9,"Others","ADANIENT",{"v":118.4,"d":"118.40"},{"v":117.51666666666667,"d":"117.52"},{"v":115.58333333333333,"d":"115.58"},{"v":112.76666666666667,"d":"112.77"},{"v":110.83333333333333,"d":"110.83"},{"v":120.33333333333333,"d":"120.33"},{"v":122.26666666666667,"d":"122.27"},{"v":125.08333333333333,"d":"125.08"},119.45,114.7,12652000,{"v":-2.8373266078184113E-3,"d":"-0.28%"}]
[10,"Others","ADANIPORTS",377.55,{"v":377,"d":"377.00"},{"v":374.7,"d":"374.70"},{"v":371.84999999999997,"d":"371.85"},{"v":369.54999999999995,"d":"369.55"},379.85,382.15,{"v":385.00000000000006,"d":"385.00"},379.3,374.15,11885000,{"v":0.003800675675675676,"d":"0.38%"}]
{"$rows_left_out":224}
{"sheet":"Cash Intra","index":2,"n_rows":248,"n_cols":13,"rows_kept":248,"merged":[[7,0,8,0],[7,1,8,1],[7,2,8,2],[7,3,8,3],[7,4,7,6],[7,7,7,9]]}
[]
[]
[]
[]
[{"$nulls":12},"Back to Main Page"]
["FOR INTRA DAY TRADING",{"$nulls":9},{"$f":"Main!B10","v":"2018-06-07"}]
[]
["Sr.no","Scrip","CLOSE RATE","Pivot Point","Supports",null,null,"Resistances"]
[null,null,"Point",null,"S1","S2","S3","R1","R2","R3","HIGH","LOW","Total Trade Quanity in Lakhs"]
[1,"Nifty 50",10684.65,{"v":10656.833333333334,"d":"10656.83"},{"v":10615.316666666668,"d":"10615.32"},{"v":10545.983333333334,"d":"10545.98"},{"v":10504.466666666667,"d":"10504.47"},{"v":10726.166666666668,"d":"10726.17"},{"v":10767.683333333334,"d":"10767.68"},{"v":10837.016666666668,"d":"10837.02"},10698.35,10587.5]
[2,"Nifty Bank",26367.6,{"v":26313.533333333336,"d":"26313.53"},{"v":26201.866666666672,"d":"26201.87"},{"v":26036.133333333335,"d":"26036.13"},{"v":25924.46666666667,"d":"25924.47"},{"v":26479.266666666674,"d":"26479.27"},{"v":26590.933333333338,"d":"26590.93"},{"v":26756.666666666675,"d":"26756.67"},26425.2,26147.8]
[3,"Nifty CPSE",2367.6,2361.85,2351.35,{"v":2335.1,"d":"2335.10"},{"v":2324.6,"d":"2324.60"},{"v":2378.1,"d":"2378.10"},{"v":2388.6,"d":"2388.60"},2404.85,2372.35,2345.6]
[4,"Nifty Infra",3252.95,{"v":3236.566666666666,"d":"3236.57"},{"v":3216.2833333333324,"d":"3216.28"},{"v":3179.6166666666663,"d":"3179.62"},{"v":3159.3333333333326,"d":"3159.33"},{"v":3273.233333333332,"d":"3273.23"},{"v":3293.516666666666,"d":"3293.52"},{"v":3330.183333333332,"d":"3330.18"},3256.85,3199.9]
[5,"Nifty IT",13528.8,{"v":13479.416666666666,"d":"13479.42"},{"v":13404.583333333332,"d":"13404.58"},{"v":13280.366666666667,"d":"13280.37"},{"v":13205.533333333333,"d":"13205.53"},{"v":13603.633333333331,"d":"13603.63"},{"v":13678.466666666664,"d":"13678.47"},{"v":13802.68333333333,"d":"13802.68"},13554.25,13355.2]
[6,"Nifty PSE",3759.4,{"v":3749.6999999999994,"d":"3749.70"},{"v":3733.8999999999987,"d":"3733.90"},{"v":3708.399999999999,"d":"3708.40"},{"v":3692.5999999999985,"d":"3692.60"},{"v":3775.199999999999,"d":"3775.20"},{"v":3790.999999999999,"d":"3791.00"},{"v":3816.499999999999,"d":"3816.50"},3765.5,3724.2]
[7,"Nifty Midcap 50",4924.7,{"v":4898.7,"d":"4898.70"},{"v":4861.099999999999,"d":"4861.10"},{"v":4797.5,"d":"4797.50"},{"v":4759.9,"d":"4759.90"},{"v":4962.299999999999,"d":"4962.30"},{"v":4999.9,"d":"4999.90"},{"v":5063.499999999999,"d":"5063.50"},4936.3,4835.1]
[8,"ABB",1196.4,{"v":1183.1166666666668,"d":"1183.12"},{"v":1166.2333333333336,"d":"1166.23"},{"v":1136.0666666666668,"d":"1136.07"},{"v":1119.1833333333336,"d":"1119.18"},{"v":1213.2833333333335,"d":"1213.28"},{"v":1230.1666666666667,"d":"1230.17"},{"v":1260.3333333333335,"d":"1260.33"},1200,1152.95,0.51555]
[9,"ACC",1315.95,{"v":1301.9166666666667,"d":"1301.92"},{"v":1284.5333333333335,"d":"1284.53"},{"v":1253.1166666666668,"d":"1253.12"},{"v":1235.7333333333336,"d":"1235.73"},{"v":1333.3333333333335,"d":"1333.33"},{"v":1350.7166666666667,"d":"1350.72"},{"v":1382.1333333333334,"d":"1382.13"},1319.3,1270.5,5.92872]
[10,"AIAENG",1549.85,1553.05,{"v":1541.8,"d":"1541.80"},1533.75,{"v":1522.5,"d":"1522.50"},{"v":1561.1,"d":"1561.10"},1572.35,{"v":1580.3999999999999,"d":"1580.40"},1564.3,1545,0.17562]
[11,"AUBANK",698.7,{"v":695.8000000000001,"d":"695.80"},{"v":686.9000000000001,"d":"686.90"},{"v":675.1,"d":"675.10"},{"v":666.2,"d":"666.20"},{"v":707.6000000000001,"d":"707.60"},{"v":716.5,"d":"716.50"},{"v":728.3000000000002,"d":"728.30"},704.7,684,0.69205]
{"$rows_left_out":229}
{"sheet":"MidCap Intra","index":3,"n_rows":511,"n_cols":13,"rows_kept":511,"merged":[[0,0,0,1],[8,0,9,0],[8,1,9,1],[8,2,9,2],[8,3,9,3],[8,4,8,6],[8,7,8,9]]}
[]
[]
[]
[]
[{"$nulls":11},"Back To Main Page"]
["FOR INTRA DAY TRADING",{"$nulls":9},{"$f":"Main!B10","v":"2018-06-07"}]
[null,null," "]
[]
["Sr.no","Scrip","CLOSE RATE","Pivot Point","Supports",null,null,"Resistances"]
[null,null,"Point",null,"S1","S2","S3","R1","R2","R3","HIGH","LOW","Total Trade Quanity in Lakhs"]
[1,"3MINDIA",18398.35,{"v":18449.5,"d":"18449.50"},18199.85,18001.35,{"v":17751.699999999997,"d":"17751.70"},{"v":18648,"d":"18648.00"},18897.65,19096.15,18699.15,18251,0.02532]
[2,"8KMILES",538.55,530.35,{"v":511.20000000000005,"d":"511.20"},483.85,{"v":464.70000000000005,"d":"464.70"},{"v":557.7,"d":"557.70"},{"v":576.8499999999999,"d":"576.85"},{"v":604.2,"d":"604.20"},549.5,503,4.66286]
[3,"AARTIIND",1155.8,{"v":1161.9833333333333,"d":"1161.98"},{"v":1143.9166666666667,"d":"1143.92"},{"v":1132.0333333333333,"d":"1132.03"},{"v":1113.9666666666667,"d":"1113.97"},{"v":1173.8666666666668,"d":"1173.87"},{"v":1191.9333333333334,"d":"1191.93"},{"v":1203.8166666666668,"d":"1203.82"},1180.05,1150.1,0.35612]
[4,"ABAN",116.15,117.05,{"v":114.1,"d":"114.10"},112.05,{"v":109.1,"d":"109.10"},{"v":119.1,"d":"119.10"},{"v":122.05000000000001,"d":"122.05"},{"v":124.1,"d":"124.10"},120,115,12.90775]
[5,"ABB",1196.4,{"v":1183.1166666666668,"d":"1183.12"},{"v":1166.2333333333336,"d":"1166.23"},{"v":1136.0666666666668,"d":"1136.07"},{"v":1119.1833333333336,"d":"1119.18"},{"v":1213.2833333333335,"d":"1213.28"},{"v":1230.1666666666667,"d":"1230.17"},{"v":1260.3333333333335,"d":"1260.33"},1200,1152.95,0.51555]
[6,"ABCAPITAL",139.7,{"v":139.4,"d":"139.40"},{"v":138.4,"d":"138.40"},{"v":137.1,"d":"137.10"},{"v":136.1,"d":"136.10"},{"v":140.70000000000002,"d":"140.70"},{"v":141.70000000000002,"d":"141.70"},{"v":143.00000000000003,"d":"143.00"},140.4,138.1,12.3886]
[7,"ABFRL",142.35,{"v":141.23333333333335,"d":"141.23"},{"v":139.4666666666667,"d":"139.47"},{"v":136.58333333333334,"d":"136.58"},{"v":134.8166666666667,"d":"134.82"},{"v":144.1166666666667,"d":"144.12"},{"v":145.88333333333335,"d":"145.88"},{"v":148.7666666666667,"d":"148.77"},143,138.35,2.209]
[8,"ACC",1315.95,{"v":1301.9166666666667,"d":"1301.92"},{"v":1284.5333333333335,"d":"1284.53"},{"v":1253.1166666666668,"d":"1253.12"},{"v":1235.7333333333336,"d":"1235.73"},{"v":1333.3333333333335,"d":"1333.33"},{"v":1350.7166666666667,"d":"1350.72"},{"v":1382.1333333333334,"d":"1382.13"},1319.3,1270.5,5.92872]
[9,"ADANIPORTS",375.8,375.55,{"v":373.6,"d":"373.60"},{"v":371.40000000000003,"d":"371.40"},{"v":369.45000000000005,"d":"369.45"},377.75,{"v":379.69999999999993,"d":"379.70"},{"v":381.9,"d":"381.90"},377.5,373.35,39.27114]
[10,"ADANIPOWER",18.25,{"v":18.033333333333335,"d":"18.03"},{"v":17.61666666666667,"d":"17.62"},{"v":16.983333333333334,"d":"16.98"},{"v":16.56666666666667,"d":"16.57"},{"v":18.66666666666667,"d":"18.67"},{"v":19.083333333333336,"d":"19.08"},{"v":19.716666666666672,"d":"19.72"},18.45,17.4,199.60969]
{"$rows_left_out":492}
{"sheet":"Bulk Deals","index":4,"n_rows":85,"n_cols":8,"rows_kept":85,"merged":[[4,0,4,1],[4,2,4,3],[6,1,6,2]]}
[" "]
[]
[]
[]
[]
[{"$nulls":4},"Back To Main Page"]
["Subject :","BULK DEAL",null,{"$f":"Main!B10","v":"2018-06-07"}]
[]
["Date","Scrip code","Scrip Name","Client Name","Buy / Sell","Quantity Traded","Trade Price / Wt.Avg.trade price","Exchange  "]
["2018-06-06",539042,"AGIIL","JASPREET KAUR","SELL",{"v":74816,"d":"74,816"},104.4,"BSE"]
["2018-06-06",539042,"AGIIL","JASPREET KAUR","BUY",{"v":65491,"d":"65,491"},110.61,"BSE"]
["2018-06-06",539042,"AGIIL","B M TRADERS","SELL",{"v":20181,"d":"20,181"},110.99,"BSE"]
["2018-06-06",539042,"AGIIL","B M TRADERS","BUY",{"v":91181,"d":"91,181"},104.37,"BSE"]
["2018-06-06",539042,"AGIIL","HAVELI INDIA LTD","SELL",{"v":107654,"d":"107,654"},104.57,"BSE"]
["2018-06-06",539042,"AGIIL","HAVELI INDIA LTD","BUY",{"v":73210,"d":"73,210"},110.06,"BSE"]
["2018-06-06",540697,"AMFL","SAGAR RAJESHBHAI JHAVERI","SELL",{"v":88000,"d":"88,000"},12.5,"BSE"]
["2018-06-06",541401,"ARIHANTINS","SEJAL ULLAS SHAH","BUY",{"v":60000,"d":"60,000"},29.11,"BSE"]
["2018-06-06",541401,"ARIHANTINS","NIRMALABEN ANANTRAI DOSHI","BUY",{"v":76000,"d":"76,000"},29.48,"BSE"]
["2018-06-06",541401,"ARIHANTINS","BHUMIBEN DHARMESHBHAI DOSHI","BUY",{"v":100000,"d":"100,000"},29.05,"BSE"]
["2018-06-06",537766,"BCP","KAMAL BABULAL AGARWAL","SELL",{"v":67888,"d":"67,888"},175.06,"BSE"]
{"$rows_left_out":66}
{"sheet":"Call Tracker (Equity & F&O)","index":5,"n_rows":257,"n_cols":18,"rows_kept":257}
[]
[]
[]
[]
[{"$nulls":12},"Back To Main Page"]
["Retail Research Technical Calls & Fundamental Performance Report for the month of June -2018 "]
[{"$nulls":12},{"$f":"Main!B10","v":"2018-06-07"}]
[null,"Positional  Call"]
["Sr.no","Date",null,"Company","Rec","Rec Price","Stop Loss***","Call Closed At","Target","Remark","Profit / Loss per Share","Gain / Loss  %","Status","Closed Date","NSE Closed Price"]
[1,"2018-05-04",null,"HCLTECH","Buy",925,890,890,"980-990","Loss of Rs.35/-",{"$f":"H10-F10","v":{"v":-35,"d":"-35.00"}},{"$f":"K10/F10","v":{"v":-0.03783783783783784,"d":"-3.78%"}},"Unsuccessful","2018-06-05",{"$nulls":3},"H"]
[2,"2018-05-25",null,"MARUTI","Buy",8440,8190,{"$f":"(8640+8805)/2","v":8722.5},"8850-8900"," Profit of Rs.282.5/-",{"$f":"H11-F11","v":282.5},{"$f":"K11/F11","v":{"v":0.03347156398104265,"d":"3.35%"}},"Successful","2018-06-01",{"$nulls":3},"R"]
[3,"2018-05-29",null,"CHOLAFIN","Buy",1530,1460,1582.5,"1620-1640"," Profit of Rs.52.5/-",{"$f":"H12-F12","v":52.5},{"v":0.03431372549019608,"d":"3.43%"},"Successful","2018-06-01",{"$nulls":3},"R"]
[4,"2018-05-30",null,"HEXAWARE","Sell",447,465,434.5,"415-405"," Profit of Rs.12.5/-",{"$f":"F13-H13","v":12.5},{"v":0.02796420581655481,"d":"2.80%"},"Successful","2018-06-01",{"$nulls":3},"H"]
[5,"2018-05-30",null,"VEDL","Buy",248,237,258,"268-272"," Profit of Rs.10/-",{"$f":"H14-F14","v":10},{"$f":"K14/F14","v":{"v":0.04032258064516129,"d":"4.03%"}},"Successful","2018-06-01",{"$nulls":3},"R"]
[6,"2018-06-01",null,"ZEEL","Buy",557.5,539,538,"590-600","Loss of Rs.19.50/-",{"$f":"H15-F15","v":{"v":-19.5,"d":"-19.50"}},{"v":-0.03497757847533632,"d":"-3.50%"},"Unsuccessful","2018-06-06",{"$nulls":3},"H"]
[7,"2018-06-01",null,"UPL","Buy","700-704",668,null,"750-760","Open",{"$nulls":4},{"$f":"VLOOKUP(D16,Sheet2!$A$1:M2165,6,0)","v":693.55},null,null,"H"]
[8,"2018-06-04",null,"CROMPTON","Buy","220-222",209,null,"235-240","Open",{"$nulls":4},{"$f":"VLOOKUP(D17,Sheet2!$A$1:M2166,6,0)","v":225},null,null,"R"]
[9,"2018-06-05",null,"TECHM ","Sell",708,728,686.25,"680-670"," Profit of Rs.21.75/-",{"$f":"F18-H18","v":21.75},{"$f":"K18/F18","v":{"v":0.03072033898305085,"d":"3.07%"}},"Successful","2018-06-06",{"$nulls":3},"H"]
{"$rows_empty":14}
["CLBS = Closing Basis ***",{"$nulls":4},"Reinitiated $"]
{"$rows_left_out":191}
{"sheet":"Call Tracker (Currency)","index":6,"n_rows":58,"n_cols":18,"rows_kept":58,"hidden":true,"merged":[[1,8,1,9],[2,8,2,9],[3,8,3,9],[4,8,4,9],[5,8,5,9],[6,8,6,9],[7,8,7,9],[8,8,8,9],[9,8,9,9],[10,8,10,9],[11,8,11,9],[12,8,12,9],[13,8,13,9],[14,8,14,9],[15,8,15,9],[16,8,16,9],[17,8,17,9],[18,8,18,9],[19,8,19,9],[20,8,20,9],[21,8,21,9],[22,8,22,9],[23,8,23,9],[24,8,24,9],[25,8,25,9],[26,8,26,9],[27,8,27,9],[28,8,28,9],[29,8,29,9],[30,8,30,9],[31,8,31,9],[32,8,32,9],[33,8,33,9],[34,8,34,9],[35,8,35,9],[36,8,36,9],[37,8,37,9],[38,8,38,9],[39,8,39,9],[40,8,40,9],[41,8,41,9],[42,8,42,9],[43,8,43,9],[44,8,44,9],[45,8,45,9],[46,8,46,9],[47,8,47,9],[48,8,48,9],[49,8,49,9],[50,8,50,9],[51,8,51,9],[52,8,52,9],[53,8,53,9],[54,8,54,9],[55,8,55,9],[56,8,56,9],[57,8,57,9],[58,8,58,9],[59,8,59,9],[60,8,60,9],[61,8,61,9],[62,8,62,9],[63,8,63,9],[64,8,64,9],[65,8,65,9],[66,8,66,9],[67,8,67,9],[68,8,68,9],[69,8,69,9],[70,8,70,9],[71,8,71,9],[72,8,72,9],[73,8,73,9],[74,8,74,9],[75,8,75,9],[76,8,76,9],[77,8,77,9],[78,8,78,9],[79,8,79,9],[80,8,80,9],[81,8,81,9],[82,8,82,9],[83,8,83,9],[84,8,84,9],[85,8,85,9],[86,8,86,9],[87,8,87,9],[88,8,88,9],[89,8,89,9],[90,8,90,9],[91,8,91,9],[92,8,92,9],[93,8,93,9],[94,8,94,9],[95,8,95,9],[96,8,96,9],[97,8,97,9],[98,8,98,9],[99,8,99,9],[100,8,100,9],[101,8,101,9],[102,8,102,9],[103,8,103,9],[104,8,104,9],[105,8,105,9],[106,8,106,9],[107,8,107,9],[108,8,108,9],[109,8,109,9],[110,8,110,9],[111,8,111,9],[112,8,112,9],[113,8,113,9],[114,8,114,9],[115,8,115,9],[116,8,116,9],[117,8,117,9],[118,8,118,9],[119,8,119,9],[120,8,120,9],[121,8,121,9],[122,8,122,9],[123,8,123,9],[124,8,124,9]]}
["Master Trade High Risk"]
["Sr.no","Date","Company","Rec","Rec Price","Stop Loss","Call Closed At","Target","Remark",null,"Profit / Loss per share","Gain / Loss  per Lot","Lot","Status","Closed Date"]
[1,"2017-05-08","USDINR MAY FUT","Buy",64.3935,64.29,64.66,64.59,"Profit of Rs.0.27/-",null,{"v":0.2664999999999935,"d":"0.27"},266.4999999999935,1000,"Successful","2017-05-09",null,null,"P"]
[2,"2017-05-08","USDINR JUN FUT","Buy",64.6535,64.45,64.965,65.05,"Profit of Rs 0.31/-",null,{"v":0.31150000000000944,"d":"0.31"},311.50000000000944,1000,"Successful","2017-05-09",null,null,"P"]
[3,"2017-05-09","EUROINR MAY FUT","Sell",70.65,70.8,70.07,70.4,"Profit of Rs 0.58/-",null,{"v":0.580000000000013,"d":"0.58"},580.00000000001,1000,"Successful","2017-05-12",null,null,"P"]
[4,"2017-05-09","GBPINR MAY FUT","Buy",83.774,83.37,83.37,84.77,"Loss of Rs 0.40/-",null,{"v":-0.40399999999999636,"d":"-0.40"},-403.99999999999636,1000,"Unsuccessful","2017-05-11",null,null,"P"]
[5,"2017-05-11","USDINR MAY FUT","Buy",64.6555,64.55,64.55,64.86,"Loss of Rs.0.1055/-",null,-0.10550000000000637,{"$f":"K7*M7","v":{"v":-105.50000000000637,"d":"-105.50"}},1000,"Unsuccessful","2017-05-11",null,null,"P"]
[6,"2017-05-15","USDINR MAY FUT","Buy",64.2275,64.08,64.46,64.48,"Profit of Rs 0.23/-",null,{"v":0.2324999999999875,"d":"0.23"},232.4999999999875,1000,"Successful","2017-05-18",null,null,"P"]
[7,"2017-05-19","USDINR MAY FUT","Sell",64.83,65,65,64.5,"Loss of Rs.0.17/-",null,{"v":-0.1700000000000017,"d":"-0.17"},-170.0000000000017,1000,"Unsuccessful","2017-05-19",null,null,"P"]
[8,"2017-05-23","USDINR MAY FUT","Buy",64.83,64.62,64.95,65.2,"Profit of Rs 0.12/-",null,{"v":0.12000000000000455,"d":"0.12"},120.00000000000455,1000,"Successful","2017-05-24",null,null,"P"]
[9,"2017-05-25","USDINR MAY FUT","Buy",64.57,64.25,64.56,65,"Loss of Rs.0.01/-",null,-0.009999999999990905,-9.999999999990905,1000,"Neutral","2017-05-29",null,null,"P"]
[10,"2017-05-30","USDINR JUN FUT","Buy",64.9125,64.71,64.71,65.31,"Loss of Rs.0.20/-",null,{"v":-0.20250000000000057,"d":"-0.20"},-202.50000000000057,1000,"Unsuccessful","2017-05-31",null,null,"P"]
[11,"2017-06-01","USDINR JUN FUT","Buy",64.655,64.45,64.45,65.05,"Loss of Rs.0.20/-",null,{"$f":"G13-E13","v":{"v":-0.2049999999999983,"d":"-0.20"}},{"$f":"K13*M13","v":-204.9999999999983},{"v":1000,"d":"1000.00"},"Unsuccessful","2017-06-08",null,null,"P"]
[12,"2017-06-12","USDINR JUN FUT","Buy",64.45,64,64.7625,65.2,"Profit of Rs 0.31/-",null,{"v":0.3125,"d":"0.31"},312.5,1000,"Successful","2017-06-16"]
[13,"2017-06-16","USDINR JUN FUT","Buy",64.51,64.2,64.7,65.11,"Profit of Rs 0.19/-",null,{"v":0.18999999999999773,"d":"0.19"},189.99999999999773,1000,"Successful","2017-06-21"]
[14,"2017-06-22","USDINR JUN FUT","Buy",64.56,64.2,64.2,65.1,"Loss of Rs.0.36/-",null,{"v":-0.35999999999999943,"d":"-0.36"},-359.99999999999943,{"v":1000,"d":"1000.00"},"Unsuccessful","2017-06-30"]
[15,"2017-07-10","USDINR JUL FUT","Buy",64.67,64.4,64.4,65.15,"Loss of Rs.0.27/-",null,{"v":-0.269999999999996,"d":"-0.27"},-269.999999999996,{"v":1000,"d":"1000.00"},"Unsuccessful","2017-07-31"]
[16,"2017-08-02","USDINR AUG FUT","Buy",64.235,63.98,63.98,64.75,"Loss of Rs.0.26/-",null,{"v":-0.25500000000000256,"d":"-0.26"},-255.00000000000256,{"v":1000,"d":"1000.00"},"Unsuccessful","2017-08-02"]
[17,"2017-08-08","USDINR AUG FUT","Buy",63.9425,63.6,64.15,64.5,"Profit of Rs 0.21/-",null,{"v":0.20750000000000313,"d":"0.21"},207.50000000000313,1000,"Successful","2017-08-10"]
[18,"2017-08-22","USDINR AUG FUT","Buy",64.1175,63.9,64.01,64.5,"Loss of Rs.0.11/-",null,{"$f":"G20-E20","v":{"v":-0.1075000000000017,"d":"-0.11"}},{"$f":"K20*M20","v":-107.5000000000017},{"v":1000,"d":"1000.00"},"Unsuccessful","2017-08-29"]
{"$rows_left_out":39}
{"sheet":"Sheet2","index":7,"n_rows":1646,"n_cols":14,"rows_kept":1646,"hidden":true}
["SYMBOL","SERIES","OPEN","HIGH","LOW","CLOSE","LAST","PREVCLOSE","TOTTRDQTY","TOTTRDVAL","TIMESTAMP","TOTALTRADES","ISIN","ISIN"]
["20MICRONS","EQ",37.8,40,35.7,36.85,39,37.9,196860,7321015.65,"2018-06-06",1513,"INE144J01027"]
["21STCENMGM","EQ",36,36,36,36,36,36.3,16,576,"2018-06-06",1,"INE253B01015"]
["3IINFOTECH","EQ",4.35,4.5,4.3,4.4,4.45,4.45,1088154,4801841.7,"2018-06-06",650,"INE748C01020"]
["3MINDIA","EQ",18680,18699.15,18251,18398.35,18549.95,18601.3,2532,46785974.05,"2018-06-06",699,"INE470A01017"]
["3PLAND","EQ",13.95,14.25,12.9,13.35,14.25,13.95,2375,32226.7,"2018-06-06",28,"INE105C01023"]
["5PAISA","EQ",350.5,368.05,336.4,368.05,368.05,350.55,5721,2062618.7,"2018-06-06",356,"INE618L01018"]
["63MOONS","EQ",66.1,70.5,65.05,69.2,69,67.25,205470,14014429.8,"2018-06-06",3309,"INE111B01023"]
["8KMILES","EQ",505,549.5,503,538.55,541.5,504.95,466286,248085076.5,"2018-06-06",17737,"INE650K01021"]
["A2ZINFRA","EQ",20.3,21.9,20,21.75,21.5,20.35,415850,8846297.45,"2018-06-06",2576,"INE619I01012"]
["AARTIDRUGS","EQ",516.5,534,510,531.05,533.65,513.35,6148,3217026.2,"2018-06-06",511,"INE767A01016"]
["AARTIIND","EQ",1178.1,1180.05,1150.1,1155.8,1165,1171.05,35612,41147136.9,"2018-06-06",5689,"INE769A01020"]
["AARVEEDEN","EQ",34.9,35.85,32.1,34.2,34,32.7,5581,188194.85,"2018-06-06",72,"INE273D01019"]
["ABAN","EQ",119,120,115,116.15,115.75,121,1290775,151246452.1,"2018-06-06",13618,"INE421A01028"]
["ABB","EQ",1160.1,1200,1152.95,1196.4,1196.25,1161.15,51555,61068893.75,"2018-06-06",4033,"INE117A01022"]
["ABBOTINDIA","EQ",6357,6485.85,6238.15,6441.5,6449.95,6357.25,4320,27349179.3,"2018-06-06",1217,"INE358A01014"]
["ABCAPITAL","EQ",138.5,140.4,138.1,139.7,140.1,138.2,1238860,172686325.3,"2018-06-06",23246,"INE674K01013"]
["ABFRL","EQ",138.35,143,138.35,142.35,142.5,139.1,220900,31118005.6,"2018-06-06",2402,"INE647O01011"]
["ACC","EQ",1285,1319.3,1270.5,1315.95,1314.85,1285.05,592872,772328295.65,"2018-06-06",21922,"INE012A01025"]
["ACCELYA","EQ",1131,1145,1112,1144.55,1142,1137.5,1933,2202647.2,"2018-06-06",400,"INE793A01012"]
{"$rows_left_out":1627}
{"sheet":"Sheet1","index":8,"n_rows":0,"n_cols":0,"rows_kept":0,"hidden":true}

{"sheet":"Sheet3","index":9,"n_rows":0,"n_cols":0,"rows_kept":0,"hidden":true}