{"text_format":"3","workbook":"xlsx","n_sheets":9,"sheets":["Main","Future Intra","Cash Intra","MidCap Intra","Bulk Deals","Call Tracker (Equity & F&O)","Sheet2","Sheet1","Sheet3"],"not_rendered":{"images":4,"defined_names":4},"read":"whole","date_system":"1900"}

{"sheet":"Main","index":0,"n_rows":17,"n_cols":4,"rows_kept":17}
[null,"                                                                                                 "]
{"$rows_empty":8}
[null,"2019-03-07"]
[]
[null,"Sheet No.","Template Name","Summary"]
[null,1,"Future Intra","For Intraday trading in F&O segment"]
[null,2,"Cash Intra","For Intraday trading in cash market segment"]
[null,3,"Mid-cap Intra","For Intraday trading in Mid-cap stocks"]
[null,4,"Bulk Deals","Reveals Bulk Deals carried on NSE & BSE"]
[null,5,"Call Tracker"]

{"sheet":"Future Intra","index":1,"n_rows":237,"n_cols":15,"rows_kept":237,"merged":[[8,0,9,0],[8,1,9,1],[8,2,9,2],[8,5,8,7],[8,8,8,10]]}
[]
[]
[]
[]
[{"$nulls":12},"Back to Main Page"]
["FOR INTRA DAY TRADING",{"$nulls":10},{"$f":"Main!B10","v":"2019-03-07"}]
[]
[]
["Sr.no","Sector","Scrip","CLOSE RATE","Pivot Point","Supports",null,null,"Resistances"]
[null,"Sector",null,"Point","Point","S1","S2","S3","R1","R2","R3","HIGH","LOW","OI","% Change in OI"]
[1,"Index","BANKNIFTY",{"v":27692.4,"d":"27692.40"},{"v":27670.88333333333,"d":"27670.88"},{"v":27581.766666666663,"d":"27581.77"},{"v":27471.13333333333,"d":"27471.13"},{"v":27382.016666666663,"d":"27382.02"},{"v":27781.516666666663,"d":"27781.52"},{"v":27870.63333333333,"d":"27870.63"},{"v":27981.266666666663,"d":"27981.27"},27760,27560.25,1880360,{"v":0.03669643841658397,"d":"3.67%"}]
[2,"Index","NIFTY",{"v":11086.8,"d":"11086.80"},{"v":11071.449999999999,"d":"11071.45"},{"v":11048.399999999998,"d":"11048.40"},{"v":11009.999999999998,"d":"11010.00"},{"v":10986.949999999997,"d":"10986.95"},{"v":11109.849999999999,"d":"11109.85"},{"v":11132.899999999998,"d":"11132.90"},{"v":11171.3,"d":"11171.30"},11094.5,11033.05,15640875,{"v":0.025032931600574092,"d":"2.50%"}]
[3,"Index","NIFTYIT",{"v":15835,"d":"15835.00"},{"v":15822,"d":"15822.00"},{"v":15749,"d":"15749.00"},{"v":15663,"d":"15663.00"},{"v":15590,"d":"15590.00"},{"v":15908,"d":"15908.00"},{"v":15981,"d":"15981.00"},{"v":16067,"d":"16067.00"},15895,15736,15150,{"v":-0.03503184713375796,"d":"-3.50%"}]
[4,"Cement","ACC",1558.85,{"v":1553.9833333333333,"d":"1553.98"},{"v":1542.0666666666666,"d":"1542.07"},{"v":1525.2833333333333,"d":"1525.28"},{"v":1513.3666666666666,"d":"1513.37"},{"v":1570.7666666666667,"d":"1570.77"},{"v":1582.6833333333332,"d":"1582.68"},{"v":1599.4666666666667,"d":"1599.47"},1565.9,1537.2,2278000,{"v":-0.1625,"d":"-16.25%"}]
[5,"Others","ADANIENT",{"v":140.2,"d":"140.20"},{"v":140.83333333333334,"d":"140.83"},{"v":137.9666666666667,"d":"137.97"},{"v":135.73333333333335,"d":"135.73"},{"v":132.8666666666667,"d":"132.87"},{"v":143.0666666666667,"d":"143.07"},{"v":145.9333333333333,"d":"145.93"},{"v":148.16666666666669,"d":"148.17"},143.7,138.6,38404000,{"v":0.010418859187539466,"d":"1.04%"}]
[6,"Others","ADANIPORTS",339.25,{"v":342.3,"d":"342.30"},{"v":333.20000000000005,"d":"333.20"},{"v":327.15000000000003,"d":"327.15"},{"v":318.05000000000007,"d":"318.05"},348.35,{"v":357.45000000000005,"d":"357.45"},{"v":363.5,"d":"363.50"},351.4,336.25,25277500,{"v":0.033316300459887586,"d":"3.33%"}]
[7,"Power","ADANIPOWER",50.95,{"v":50.88333333333333,"d":"50.88"},{"v":49.96666666666667,"d":"49.97"},{"v":48.983333333333334,"d":"48.98"},{"v":48.06666666666667,"d":"48.07"},{"v":51.86666666666667,"d":"51.87"},{"v":52.78333333333334,"d":"52.78"},{"v":53.766666666666666,"d":"53.77"},51.8,49.9,158240000,{"v":-1.7663386323492304E-3,"d":"-0.18%"}]
[8,"Pharma","AJANTPHARM",996.45,{"v":996.5500000000001,"d":"996.55"},{"v":986.9000000000001,"d":"986.90"},977.35,{"v":967.7,"d":"967.70"},{"v":1006.1000000000001,"d":"1006.10"},1015.75,{"v":1025.3000000000002,"d":"1025.30"},1006.2,987,882500,{"v":0.0703456640388114,"d":"7.03%"}]
[9,"Banking","ALBK",51.35,{"v":51.53333333333334,"d":"51.53"},{"v":50.116666666666674,"d":"50.12"},{"v":48.88333333333333,"d":"48.88"},{"v":47.46666666666667,"d":"47.47"},{"v":52.76666666666668,"d":"52.77"},{"v":54.18333333333335,"d":"54.18"},{"v":55.416666666666686,"d":"55.42"},52.95,50.3,21151000,{"v":-0.018697225572979495,"d":"-1.87%"}]
[10,"Automobile","AMARAJABAT",750.75,{"v":749.3666666666668,"d":"749.37"},{"v":741.0833333333336,"d":"741.08"},{"v":731.4166666666669,"d":"731.42"},{"v":723.1333333333337,"d":"723.13"},{"v":759.0333333333335,"d":"759.03"},{"v":767.3166666666668,"d":"767.32"},{"v":776.9833333333335,"d":"776.98"},757.65,739.7,723800,{"v":0.25333333333333335,"d":"25.33%"}]
{"$rows_left_out":208}
{"sheet":"Cash Intra","index":2,"n_rows":247,"n_cols":13,"rows_kept":247,"merged":[[7,0,8,0],[7,1,8,1],[7,2,8,2],[7,3,8,3],[7,4,7,6],[7,7,7,9]]}
[]
[]
[]
[]
[{"$nulls":12},"Back to Main Page"]
["FOR INTRA DAY TRADING",{"$nulls":9},{"$f":"Main!B10","v":"2019-03-07"}]
[]
["Sr.no","Scrip","CLOSE RATE","Pivot Point","Supports",null,null,"Resistances"]
[null,null,"Point",null,"S1","S2","S3","R1","R2","R3","HIGH","LOW","Total Trade Quanity in Lakhs"]
[1,"Nifty 50",11053,{"v":11038.050000000001,"d":"11038.05"},{"v":11013.800000000003,"d":"11013.80"},{"v":10974.600000000002,"d":"10974.60"},{"v":10950.350000000004,"d":"10950.35"},{"v":11077.250000000002,"d":"11077.25"},{"v":11101.499999999998,"d":"11101.50"},{"v":11140.7,"d":"11140.70"},11062.3,10998.85]
[2,"Nifty Bank",27625.65,{"v":27599.783333333336,"d":"27599.78"},{"v":27517.91666666667,"d":"27517.92"},{"v":27410.183333333334,"d":"27410.18"},{"v":27328.31666666667,"d":"27328.32"},{"v":27707.516666666674,"d":"27707.52"},{"v":27789.383333333335,"d":"27789.38"},{"v":27897.116666666676,"d":"27897.12"},27681.65,27492.05]
[3,"Nifty CPSE",2168.9,{"v":2168.3333333333335,"d":"2168.33"},{"v":2154.666666666667,"d":"2154.67"},{"v":2140.4333333333334,"d":"2140.43"},{"v":2126.766666666667,"d":"2126.77"},{"v":2182.566666666667,"d":"2182.57"},{"v":2196.233333333334,"d":"2196.23"},{"v":2210.466666666667,"d":"2210.47"},2182,2154.1]
[4,"Nifty Infra",3009.05,{"v":3008.316666666667,"d":"3008.32"},{"v":2994.833333333334,"d":"2994.83"},{"v":2980.616666666667,"d":"2980.62"},{"v":2967.1333333333337,"d":"2967.13"},{"v":3022.533333333334,"d":"3022.53"},{"v":3036.016666666667,"d":"3036.02"},{"v":3050.2333333333345,"d":"3050.23"},3021.8,2994.1]
[5,"Nifty IT",15735.05,{"v":15743.616666666667,"d":"15743.62"},{"v":15672.533333333333,"d":"15672.53"},{"v":15610.016666666666,"d":"15610.02"},{"v":15538.933333333332,"d":"15538.93"},{"v":15806.133333333333,"d":"15806.13"},{"v":15877.216666666665,"d":"15877.22"},{"v":15939.733333333334,"d":"15939.73"},15814.7,15681.1]
[6,"Nifty PSE",3417.7,{"v":3416.0500000000006,"d":"3416.05"},{"v":3398.950000000001,"d":"3398.95"},{"v":3380.2000000000007,"d":"3380.20"},{"v":3363.1000000000013,"d":"3363.10"},{"v":3434.800000000001,"d":"3434.80"},{"v":3451.9000000000005,"d":"3451.90"},{"v":3470.650000000001,"d":"3470.65"},3433.15,3397.3]
[7,"Nifty Midcap 50",4847.25,{"v":4845.233333333333,"d":"4845.23"},{"v":4821.916666666665,"d":"4821.92"},{"v":4796.583333333332,"d":"4796.58"},{"v":4773.266666666665,"d":"4773.27"},{"v":4870.566666666666,"d":"4870.57"},{"v":4893.883333333333,"d":"4893.88"},{"v":4919.216666666666,"d":"4919.22"},4868.55,4819.9]
[8,"ABB",1244.55,{"v":1240.1833333333334,"d":"1240.18"},{"v":1229.3666666666668,"d":"1229.37"},{"v":1214.1833333333334,"d":"1214.18"},{"v":1203.3666666666668,"d":"1203.37"},{"v":1255.3666666666668,"d":"1255.37"},{"v":1266.1833333333334,"d":"1266.18"},{"v":1281.3666666666668,"d":"1281.37"},1251,1225,1.69943]
[9,"ACC",1554.4,{"v":1549.7666666666667,"d":"1549.77"},{"v":1537.6333333333332,"d":"1537.63"},{"v":1520.8666666666666,"d":"1520.87"},{"v":1508.7333333333331,"d":"1508.73"},{"v":1566.5333333333333,"d":"1566.53"},{"v":1578.666666666667,"d":"1578.67"},{"v":1595.4333333333334,"d":"1595.43"},1561.9,1533,20.3588]
[10,"AIAENG",1798.5,{"v":1804.2333333333333,"d":"1804.23"},{"v":1774.2666666666667,"d":"1774.27"},{"v":1750.0333333333333,"d":"1750.03"},{"v":1720.0666666666666,"d":"1720.07"},{"v":1828.4666666666667,"d":"1828.47"},{"v":1858.4333333333334,"d":"1858.43"},{"v":1882.6666666666667,"d":"1882.67"},1834.2,1780,0.66056]
[11,"AUBANK",589.15,{"v":587.3333333333334,"d":"587.33"},{"v":579.7666666666668,"d":"579.77"},{"v":570.3833333333334,"d":"570.38"},{"v":562.8166666666668,"d":"562.82"},{"v":596.7166666666667,"d":"596.72"},{"v":604.2833333333333,"d":"604.28"},{"v":613.6666666666666,"d":"613.67"},594.9,577.95,2.27989]
{"$rows_left_out":228}
{"sheet":"MidCap Intra","index":3,"n_rows":510,"n_cols":13,"rows_kept":510,"merged":[[0,0,0,1],[8,0,9,0],[8,1,9,1],[8,2,9,2],[8,3,9,3],[8,4,8,6],[8,7,8,9]]}
[]
[]
[]
[]
[{"$nulls":11},"Back To Main Page"]
["FOR INTRA DAY TRADING",{"$nulls":9},{"$f":"Main!B10","v":"2019-03-07"}]
[null,null," "]
[]
["Sr.no","Scrip","CLOSE RATE","Pivot Point","Supports",null,null,"Resistances"]
[null,null,"Point",null,"S1","S2","S3","R1","R2","R3","HIGH","LOW","Total Trade Quanity in Lakhs"]
[1,"3MINDIA",23252.1,23401.05,22802.05,{"v":22352,"d":"22352.00"},{"v":21753,"d":"21753.00"},{"v":23851.1,"d":"23851.10"},{"v":24450.1,"d":"24450.10"},{"v":24900.149999999998,"d":"24900.15"},24000.05,22951,0.06683]
[2,"8KMILES",110,{"v":111.66666666666667,"d":"111.67"},{"v":107.33333333333334,"d":"107.33"},{"v":104.66666666666667,"d":"104.67"},{"v":100.33333333333334,"d":"100.33"},{"v":114.33333333333334,"d":"114.33"},{"v":118.66666666666669,"d":"118.67"},{"v":121.33333333333334,"d":"121.33"},116,109,4.52309]
[3,"AARTIIND",1517.35,{"v":1505.1333333333332,"d":"1505.13"},{"v":1490.2666666666664,"d":"1490.27"},{"v":1463.1833333333332,"d":"1463.18"},{"v":1448.3166666666664,"d":"1448.32"},{"v":1532.2166666666665,"d":"1532.22"},{"v":1547.0833333333333,"d":"1547.08"},{"v":1574.1666666666665,"d":"1574.17"},1520,1478.05,1.605]
[4,"ABAN",72.1,{"v":68.16666666666667,"d":"68.17"},{"v":64.23333333333335,"d":"64.23"},{"v":56.366666666666674,"d":"56.37"},{"v":52.43333333333335,"d":"52.43"},{"v":76.03333333333335,"d":"76.03"},{"v":79.96666666666665,"d":"79.97"},{"v":87.83333333333334,"d":"87.83"},72.1,60.3,33.86567]
[5,"ABB",1244.55,{"v":1240.1833333333334,"d":"1240.18"},{"v":1229.3666666666668,"d":"1229.37"},{"v":1214.1833333333334,"d":"1214.18"},{"v":1203.3666666666668,"d":"1203.37"},{"v":1255.3666666666668,"d":"1255.37"},{"v":1266.1833333333334,"d":"1266.18"},{"v":1281.3666666666668,"d":"1281.37"},1251,1225,1.69943]
[6,"ABCAPITAL",99.8,{"v":100.2,"d":"100.20"},{"v":98.9,"d":"98.90"},{"v":98,"d":"98.00"},{"v":96.7,"d":"96.70"},{"v":101.10000000000001,"d":"101.10"},{"v":102.39999999999999,"d":"102.40"},{"v":103.30000000000001,"d":"103.30"},101.5,99.3,31.18084]
[7,"ABFRL",219.85,{"v":221.5666666666667,"d":"221.57"},{"v":217.0333333333334,"d":"217.03"},{"v":214.2166666666667,"d":"214.22"},{"v":209.6833333333334,"d":"209.68"},{"v":224.38333333333338,"d":"224.38"},{"v":228.91666666666669,"d":"228.92"},{"v":231.73333333333338,"d":"231.73"},226.1,218.75,6.12206]
[8,"ACC",1554.4,{"v":1549.7666666666667,"d":"1549.77"},{"v":1537.6333333333332,"d":"1537.63"},{"v":1520.8666666666666,"d":"1520.87"},{"v":1508.7333333333331,"d":"1508.73"},{"v":1566.5333333333333,"d":"1566.53"},{"v":1578.666666666667,"d":"1578.67"},{"v":1595.4333333333334,"d":"1595.43"},1561.9,1533,20.3588]
[9,"ADANIPORTS",337.05,{"v":340.09999999999997,"d":"340.10"},{"v":330.99999999999994,"d":"331.00"},324.95,{"v":315.84999999999997,"d":"315.85"},{"v":346.1499999999999,"d":"346.15"},{"v":355.24999999999994,"d":"355.25"},{"v":361.2999999999999,"d":"361.30"},349.2,334.05,79.49482]
[10,"ADANIPOWER",50.7,{"v":50.73333333333333,"d":"50.73"},{"v":49.76666666666665,"d":"49.77"},{"v":48.83333333333332,"d":"48.83"},{"v":47.866666666666646,"d":"47.87"},{"v":51.66666666666666,"d":"51.67"},{"v":52.63333333333334,"d":"52.63"},{"v":53.56666666666666,"d":"53.57"},51.7,49.8,178.76199]
{"$rows_left_out":491}
{"sheet":"Bulk Deals","index":4,"n_rows":82,"n_cols":8,"rows_kept":82,"merged":[[4,0,4,1],[4,2,4,3],[6,1,6,2]]}
[" "]
[]
[]
[]
[]
[{"$nulls":4},"Back To Main Page"]
["Subject :","BULK DEAL",null,{"$f":"Main!B10","v":"2019-03-07"}]
[]
["Date","Scrip code","Scrip Name","Client Name","Buy / Sell","Quantity Traded","Trade Price / Wt.Avg.trade price","Exchange  "]
["2019-03-06",540615,"7NR","RATHOD MANOJ CHHAGANLAL HUF","SELL",{"v":84000,"d":"84,000"},34.75,"BSE"]
["2019-03-06",542437,"ANMOL","SUNIL KUMAR GUPTA","SELL",{"v":64000,"d":"64,000"},32.9,"BSE"]
["2019-03-06",540024,"ASHARI","SWETA MAULIKKUMAR SHAH","BUY",113750,6.42,"BSE"]
["2019-03-06",540024,"ASHARI","VIJAY KUMAR AGGARWAL","SELL",184035,6.42,"BSE"]
["2019-03-06",537766,"BCP","ACHINTYA COMMODITIES PRIVATE LIMITED","BUY",496678,41.35,"BSE"]
["2019-03-06",537766,"BCP","ACHINTYA COMMODITIES PRIVATE LIMITED","SELL",398078,41.33,"BSE"]
["2019-03-06",537766,"BCP","DEEPEN BHARAT SHAH","SELL",325000,41.35,"BSE"]
["2019-03-06",540903,"CRPRISK","PINKI AGARWAL","BUY",106000,23.55,"BSE"]
["2019-03-06",540903,"CRPRISK","RAKESH HATHIBHAI PATEL","SELL",104000,22.71,"BSE"]
["2019-03-06",540903,"CRPRISK","JHAVERI TRADING & INVESTMENT PVT LTD","SELL",108000,23.55,"BSE"]
["2019-03-06",540938,"GUJHYSPIN","BHAVIN R SHAH","SELL",450000,6.15,"BSE"]
{"$rows_left_out":63}
{"sheet":"Call Tracker (Equity & F&O)","index":5,"n_rows":383,"n_cols":18,"rows_kept":383,"merged":[[22,0,23,0],[22,1,23,1],[22,2,23,2],[22,9,23,9],[22,11,23,11],[22,12,23,12],[22,13,23,13],[22,14,23,14],[38,0,39,0],[38,1,39,1],[38,2,39,2],[38,9,39,9],[38,11,39,11],[38,12,39,12],[38,13,39,13],[38,14,39,14]]}
[]
[]
[]
[]
[{"$nulls":12},"Back To Main Page"]
["Retail Research Technical Calls & Fundamental Performance Report for the month of March -2019 "]
[{"$nulls":12},{"$f":"Main!B10","v":"2019-03-07"}]
[null,"Positional  Call"]
["Sr.no","Date",null,"Company","Rec","Rec Price","Stop Loss***","Call Closed At","Target","Remark","Profit / Loss per Share","Gain / Loss  %","Status","Closed Date","NSE Closed Price"]
[1,"2019-01-24",null,"ITC","Buy","279-281",268,null,305,"Open",{"$nulls":4},{"$f":"VLOOKUP(D10,Sheet2!A10:M1505,6,0)","v":285.75},null,null,"R"]
[2,"2019-03-01",null,"UPL","Sell","879-884",922.2,null,800,"Open",{"$nulls":4},{"$f":"VLOOKUP(D11,Sheet2!A11:M1806,6,0)","v":877.35},null,null,"R"]
[3,"2019-03-01",null,"BEL","Buy",83,78.5,86.25,92,"Profit of Rs.3.25/-",{"$f":"H12-F12","v":3.25},{"$f":"K12/F12","v":{"v":0.0391566265060241,"d":"3.92%"}},"Successful","2019-03-05",{"$nulls":3},"H"]
[4,"2019-03-01",null,"ZEEL","Sell","477-480",507.3,null,"435-425","Open",{"$nulls":4},{"$f":"VLOOKUP(D13,Sheet2!A13:M1808,6,0)","v":470.9},null,null,"R"]
[5,"2019-03-06",null,"MARUTI","Buy","7010-7040",6700,null,"7500-7600","Open",{"$nulls":4},{"$f":"VLOOKUP(D14,Sheet2!A14:M1809,6,0)","v":7056.9},null,null,"H"]
[]
[]
[]
["CLBS = Closing Basis ***",{"$nulls":4},"Reinitiated $"]
["Dividend adjusted <>",{"$nulls":4},"Revised stoploss #"]
["Part book {}"]
{"$rows_left_out":217}
{"sheet":"Sheet2","index":6,"n_rows":1640,"n_cols":14,"rows_kept":1640,"hidden":true}
["SYMBOL","SERIES","OPEN","HIGH","LOW","CLOSE","LAST","PREVCLOSE","TOTTRDQTY","TOTTRDVAL","TIMESTAMP","TOTALTRADES","ISIN","ISIN"]
["20MICRONS","EQ",40.4,41.45,39.75,40.55,40.4,39.85,38445,1564699.7,"2019-03-06",401,"INE144J01027"]
["21STCENMGM","EQ",18.45,18.45,18.35,18.45,18.35,18.1,1871,34469.55,"2019-03-06",22,"INE253B01015"]
["3IINFOTECH","EQ",3.75,3.9,3.6,3.8,3.85,3.7,5807248,22099084.55,"2019-03-06",1444,"INE748C01020"]
["3MINDIA","EQ",23628,24000.05,22951,23252.1,22952,23450.65,6683,158291512.95,"2019-03-06",2514,"INE470A01017"]
["3PLAND","EQ",11,11.65,10.7,10.7,10.7,11.2,45,499.2,"2019-03-06",5,"INE105C01023"]
["5PAISA","EQ",245,247.05,226.05,229.2,235,234.6,14621,3446108.95,"2019-03-06",377,"INE618L01018"]
["63MOONS","EQ",86.2,87.1,84.65,85.25,85.3,85.5,198616,17010838.4,"2019-03-06",2931,"INE111B01023"]
["8KMILES","EQ",116,116,109,110,109.8,111.9,452309,50755105.1,"2019-03-06",5031,"INE650K01021"]
["A2ZINFRA","BE",19.1,19.35,18.6,19.2,19.35,18.45,715466,13738881.85,"2019-03-06",1107,"INE619I01012"]
["AARTIDRUGS","EQ",591,631.35,588.5,628.75,630,592.1,33275,20663278.25,"2019-03-06",1997,"INE767A01016"]
["AARTIIND","EQ",1487,1520,1478.05,1517.35,1518,1463.95,160500,241601748.05,"2019-03-06",9446,"INE769A01020"]
["AARVEEDEN","EQ",24,24,22.15,23.25,23.25,22.8,16400,376171.25,"2019-03-06",447,"INE273D01019"]
["AAVAS","EQ",1124.7,1190,1120,1166.2,1154.75,1113.85,203998,237375825.25,"2019-03-06",6255,"INE216P01012"]
["ABAN","EQ",60.95,72.1,60.3,72.1,72.1,60.1,3386567,228158514.9,"2019-03-06",20172,"INE421A01028"]
["ABB","EQ",1238,1251,1225,1244.55,1250,1233.7,169943,209557908.4,"2019-03-06",4274,"INE117A01022"]
["ABBOTINDIA","EQ",7320,7400,7310,7362.7,7370,7297.35,4894,36062450.9,"2019-03-06",783,"INE358A01014"]
["ABCAPITAL","EQ",100.6,101.5,99.3,99.8,99.95,99.5,3118084,312177741.3,"2019-03-06",35418,"INE674K01013"]
["ABFRL","EQ",226.1,226.1,218.75,219.85,219.25,225.55,612206,135673974.75,"2019-03-06",9425,"INE647O01011"]
["ABSLNN50ET","EQ",279.95,284,278,284,284,284,35,9838.96,"2019-03-06",5,"INF209KB1B87"]
{"$rows_left_out":1621}
{"sheet":"Sheet1","index":7,"n_rows":0,"n_cols":0,"rows_kept":0,"hidden":true}

{"sheet":"Sheet3","index":8,"n_rows":0,"n_cols":0,"rows_kept":0,"hidden":true}