{"text_format":"3","workbook":"xlsx","n_sheets":7,"sheets":["Main","Future Intra","Cash Intra","MidCap Intra","Bulk Deals","Call Tracker (Equity & F&O)","Sheet2"],"not_rendered":{"images":4,"defined_names":4},"read":"whole","date_system":"1900"}

{"sheet":"Main","index":0,"n_rows":17,"n_cols":4,"rows_kept":17}
[null,"                                                                                                 "]
{"$rows_empty":8}
[null,"2018-12-06"]
[]
[null,"Sheet No.","Template Name","Summary"]
[null,1,"Future Intra","For Intraday trading in F&O segment"]
[null,2,"Cash Intra","For Intraday trading in cash market segment"]
[null,3,"Mid-cap Intra","For Intraday trading in Mid-cap stocks"]
[null,4,"Bulk Deals","Reveals Bulk Deals carried on NSE & BSE"]
[null,5,"Call Tracker"]

{"sheet":"Future Intra","index":1,"n_rows":242,"n_cols":15,"rows_kept":242,"merged":[[8,0,9,0],[8,1,9,1],[8,2,9,2],[8,5,8,7],[8,8,8,10]]}
[]
[]
[]
[]
[{"$nulls":12},"Back to Main Page"]
["FOR INTRA DAY TRADING",{"$nulls":10},{"$f":"Main!B10","v":"2018-12-06"}]
[]
[]
["Sr.no","Sector","Scrip","CLOSE RATE","Pivot Point","Supports",null,null,"Resistances"]
[null,"Sector",null,"Point","Point","S1","S2","S3","R1","R2","R3","HIGH","LOW","OI","% Change in OI"]
[1,"Index","BANKNIFTY",{"v":26643.8,"d":"26643.80"},{"v":26650.033333333336,"d":"26650.03"},{"v":26555.066666666673,"d":"26555.07"},{"v":26466.333333333336,"d":"26466.33"},{"v":26371.366666666672,"d":"26371.37"},{"v":26738.766666666674,"d":"26738.77"},{"v":26833.73333333334,"d":"26833.73"},{"v":26922.466666666674,"d":"26922.47"},26745,26561.3,1712160,{"v":0.050765907305577375,"d":"5.08%"}]
[2,"Index","NIFTY",10827.65,{"v":10827.466666666667,"d":"10827.47"},{"v":10786.933333333334,"d":"10786.93"},{"v":10746.216666666667,"d":"10746.22"},{"v":10705.683333333334,"d":"10705.68"},{"v":10868.183333333334,"d":"10868.18"},{"v":10908.716666666667,"d":"10908.72"},{"v":10949.433333333334,"d":"10949.43"},10868,10786.75,20899500,{"v":0.016480510100604796,"d":"1.65%"}]
[3,"Index","NIFTYIT",{"v":15070,"d":"15070.00"},{"v":15011.333333333334,"d":"15011.33"},{"v":14899.666666666668,"d":"14899.67"},{"v":14729.333333333334,"d":"14729.33"},{"v":14617.666666666668,"d":"14617.67"},{"v":15181.666666666668,"d":"15181.67"},{"v":15293.333333333336,"d":"15293.33"},{"v":15463.666666666668,"d":"15463.67"},15123,14841,17100,{"v":0.14381270903010032,"d":"14.38%"}]
[4,"Index","NIFTYMID50",{"v":4848,"d":"4848.00"},{"v":4820.333333333333,"d":"4820.33"},{"v":4792.666666666666,"d":"4792.67"},{"v":4737.333333333333,"d":"4737.33"},{"v":4709.666666666666,"d":"4709.67"},{"v":4875.666666666666,"d":"4875.67"},{"v":4903.333333333332,"d":"4903.33"},{"v":4958.666666666666,"d":"4958.67"},4848,4765,591690,{"v":0,"d":"0.00%"}]
[5,"Cement","ACC",{"v":1477.7,"d":"1477.70"},{"v":1486.5999999999997,"d":"1486.60"},{"v":1463.1999999999994,"d":"1463.20"},{"v":1448.6999999999996,"d":"1448.70"},{"v":1425.2999999999993,"d":"1425.30"},{"v":1501.0999999999995,"d":"1501.10"},{"v":1524.4999999999995,"d":"1524.50"},{"v":1538.9999999999995,"d":"1539.00"},1510,1472.1,1390400,{"v":-0.004866876610363584,"d":"-0.49%"}]
[6,"Others","ADANIENT",{"v":157.9,"d":"157.90"},159.85,154.35,{"v":150.8,"d":"150.80"},{"v":145.3,"d":"145.30"},{"v":163.39999999999998,"d":"163.40"},{"v":168.89999999999998,"d":"168.90"},{"v":172.44999999999996,"d":"172.45"},165.35,156.3,44468000,{"v":0.12748478701825558,"d":"12.75%"}]
[7,"Others","ADANIPORTS",{"v":375.9,"d":"375.90"},375.95,373.95,{"v":372,"d":"372.00"},{"v":370,"d":"370.00"},{"v":377.9,"d":"377.90"},{"v":379.9,"d":"379.90"},{"v":381.84999999999997,"d":"381.85"},377.95,374,18677500,{"v":3.4922766957689723E-3,"d":"0.35%"}]
[8,"Power","ADANIPOWER",54.35,{"v":54.23333333333333,"d":"54.23"},{"v":53.16666666666666,"d":"53.17"},{"v":51.98333333333333,"d":"51.98"},{"v":50.91666666666666,"d":"50.92"},{"v":55.41666666666666,"d":"55.42"},{"v":56.483333333333334,"d":"56.48"},{"v":57.66666666666666,"d":"57.67"},55.3,53.05,166520000,{"v":0.013882123721383342,"d":"1.39%"}]
[9,"Pharma","AJANTPHARM",1098.55,{"v":1107.0166666666667,"d":"1107.02"},{"v":1069.0333333333333,"d":"1069.03"},{"v":1039.5166666666667,"d":"1039.52"},{"v":1001.5333333333333,"d":"1001.53"},{"v":1136.5333333333333,"d":"1136.53"},{"v":1174.5166666666664,"d":"1174.52"},{"v":1204.0333333333333,"d":"1204.03"},1145,1077.5,561500,{"v":0.014453477868112014,"d":"1.45%"}]
[10,"Banking","ALBK",{"v":45.9,"d":"45.90"},{"v":46.300000000000004,"d":"46.30"},{"v":45.10000000000001,"d":"45.10"},{"v":44.300000000000004,"d":"44.30"},{"v":43.10000000000001,"d":"43.10"},{"v":47.10000000000001,"d":"47.10"},{"v":48.30000000000001,"d":"48.30"},{"v":49.10000000000001,"d":"49.10"},47.5,45.5,16166000,{"v":-3.3906664200727453E-3,"d":"-0.34%"}]
{"$rows_left_out":213}
{"sheet":"Cash Intra","index":2,"n_rows":246,"n_cols":13,"rows_kept":246,"merged":[[7,0,8,0],[7,1,8,1],[7,2,8,2],[7,3,8,3],[7,4,7,6],[7,7,7,9]]}
[]
[]
[]
[]
[{"$nulls":12},"Back to Main Page"]
["FOR INTRA DAY TRADING",{"$nulls":9},{"$f":"Main!B10","v":"2018-12-06"}]
[]
["Sr.no","Scrip","CLOSE RATE","Pivot Point","Supports",null,null,"Resistances"]
[null,null,"Point",null,"S1","S2","S3","R1","R2","R3","HIGH","LOW","Total Trade Quanity in Lakhs"]
[1,"Nifty 50",10782.9,{"v":10783.966666666665,"d":"10783.97"},{"v":10746.883333333331,"d":"10746.88"},{"v":10710.866666666667,"d":"10710.87"},{"v":10673.783333333333,"d":"10673.78"},{"v":10819.98333333333,"d":"10819.98"},{"v":10857.066666666662,"d":"10857.07"},{"v":10893.083333333328,"d":"10893.08"},10821.05,10747.95]
[2,"Nifty Bank",26519.6,{"v":26530.2,"d":"26530.20"},{"v":26433.050000000003,"d":"26433.05"},{"v":26346.500000000004,"d":"26346.50"},{"v":26249.350000000006,"d":"26249.35"},26616.75,{"v":26713.9,"d":"26713.90"},{"v":26800.449999999997,"d":"26800.45"},26627.35,26443.65]
[3,"Nifty CPSE",1990.65,{"v":2002.7666666666667,"d":"2002.77"},{"v":1964.7833333333333,"d":"1964.78"},{"v":1938.9166666666667,"d":"1938.92"},{"v":1900.9333333333334,"d":"1900.93"},{"v":2028.6333333333332,"d":"2028.63"},{"v":2066.6166666666663,"d":"2066.62"},{"v":2092.483333333333,"d":"2092.48"},2040.75,1976.9]
[4,"Nifty Infra",3058.75,{"v":3071.8666666666663,"d":"3071.87"},{"v":3038.0833333333326,"d":"3038.08"},{"v":3017.416666666666,"d":"3017.42"},{"v":2983.6333333333323,"d":"2983.63"},{"v":3092.533333333333,"d":"3092.53"},{"v":3126.3166666666666,"d":"3126.32"},{"v":3146.983333333333,"d":"3146.98"},3105.65,3051.2]
[5,"Nifty IT",15012.95,{"v":14954.699999999999,"d":"14954.70"},{"v":14846.999999999998,"d":"14847.00"},14681.05,{"v":14573.349999999999,"d":"14573.35"},{"v":15120.649999999998,"d":"15120.65"},{"v":15228.349999999999,"d":"15228.35"},{"v":15394.299999999997,"d":"15394.30"},15062.4,14788.75]
[6,"Nifty PSE",3231.75,3252.35,{"v":3203.1499999999996,"d":"3203.15"},{"v":3174.5499999999997,"d":"3174.55"},{"v":3125.3499999999995,"d":"3125.35"},3280.95,{"v":3330.1499999999996,"d":"3330.15"},3358.75,3301.55,3223.75]
[7,"Nifty Midcap 50",4706.55,{"v":4720.816666666667,"d":"4720.82"},{"v":4667.133333333333,"d":"4667.13"},{"v":4627.716666666666,"d":"4627.72"},{"v":4574.033333333333,"d":"4574.03"},{"v":4760.233333333334,"d":"4760.23"},{"v":4813.916666666666,"d":"4813.92"},{"v":4853.333333333334,"d":"4853.33"},4774.5,4681.4]
[8,"ABB",1372.7,{"v":1372.466666666667,"d":"1372.47"},{"v":1362.7833333333338,"d":"1362.78"},{"v":1352.8666666666668,"d":"1352.87"},{"v":1343.1833333333336,"d":"1343.18"},{"v":1382.383333333334,"d":"1382.38"},{"v":1392.0666666666668,"d":"1392.07"},{"v":1401.983333333334,"d":"1401.98"},1382.15,1362.55,0.22409]
[9,"ACC",1471.15,{"v":1481.1666666666667,"d":"1481.17"},{"v":1455.8333333333335,"d":"1455.83"},{"v":1440.5166666666667,"d":"1440.52"},{"v":1415.1833333333334,"d":"1415.18"},{"v":1496.4833333333336,"d":"1496.48"},{"v":1521.816666666667,"d":"1521.82"},{"v":1537.1333333333337,"d":"1537.13"},1506.5,1465.85,5.14306]
[10,"AIAENG",1691.15,{"v":1703.6000000000001,"d":"1703.60"},{"v":1666.7000000000003,"d":"1666.70"},{"v":1642.2500000000002,"d":"1642.25"},{"v":1605.3500000000004,"d":"1605.35"},{"v":1728.0500000000002,"d":"1728.05"},{"v":1764.9500000000003,"d":"1764.95"},{"v":1789.4,"d":"1789.40"},1740.5,1679.15,0.1466]
[11,"AUBANK",612.05,{"v":610.0166666666667,"d":"610.02"},{"v":602.0333333333333,"d":"602.03"},{"v":592.0166666666667,"d":"592.02"},{"v":584.0333333333333,"d":"584.03"},{"v":620.0333333333333,"d":"620.03"},{"v":628.0166666666667,"d":"628.02"},{"v":638.0333333333333,"d":"638.03"},618,600,3.95189]
{"$rows_left_out":227}
{"sheet":"MidCap Intra","index":3,"n_rows":510,"n_cols":13,"rows_kept":510,"merged":[[0,0,0,1],[8,0,9,0],[8,1,9,1],[8,2,9,2],[8,3,9,3],[8,4,8,6],[8,7,8,9]]}
[]
[]
[]
[]
[{"$nulls":11},"Back To Main Page"]
["FOR INTRA DAY TRADING",{"$nulls":9},{"$f":"Main!B10","v":"2018-12-06"}]
[null,null," "]
[]
["Sr.no","Scrip","CLOSE RATE","Pivot Point","Supports",null,null,"Resistances"]
[null,null,"Point",null,"S1","S2","S3","R1","R2","R3","HIGH","LOW","Total Trade Quanity in Lakhs"]
[1,"3MINDIA",22167.05,{"v":22272.350000000002,"d":"22272.35"},{"v":21994.700000000004,"d":"21994.70"},{"v":21822.350000000002,"d":"21822.35"},{"v":21544.700000000004,"d":"21544.70"},{"v":22444.700000000004,"d":"22444.70"},{"v":22722.350000000006,"d":"22722.35"},{"v":22894.700000000004,"d":"22894.70"},22550,22100,0.01359]
[2,"8KMILES",192.55,{"v":197.03333333333333,"d":"197.03"},{"v":188.06666666666666,"d":"188.07"},{"v":183.58333333333334,"d":"183.58"},{"v":174.61666666666667,"d":"174.62"},{"v":201.51666666666665,"d":"201.52"},{"v":210.4833333333333,"d":"210.48"},{"v":214.96666666666664,"d":"214.97"},206,192.55,5.35995]
[3,"AARTIIND",1466,{"v":1463.2666666666667,"d":"1463.27"},{"v":1453.6333333333332,"d":"1453.63"},{"v":1441.2666666666667,"d":"1441.27"},{"v":1431.6333333333332,"d":"1431.63"},{"v":1475.6333333333332,"d":"1475.63"},{"v":1485.2666666666669,"d":"1485.27"},{"v":1497.6333333333332,"d":"1497.63"},1472.9,1450.9,1.0873]
[4,"ABAN",73.6,{"v":74.3,"d":"74.30"},{"v":71.89999999999999,"d":"71.90"},{"v":70.19999999999999,"d":"70.20"},{"v":67.79999999999998,"d":"67.80"},{"v":76,"d":"76.00"},{"v":78.4,"d":"78.40"},{"v":80.10000000000001,"d":"80.10"},76.7,72.6,2.95586]
[5,"ABB",1372.7,{"v":1372.466666666667,"d":"1372.47"},{"v":1362.7833333333338,"d":"1362.78"},{"v":1352.8666666666668,"d":"1352.87"},{"v":1343.1833333333336,"d":"1343.18"},{"v":1382.383333333334,"d":"1382.38"},{"v":1392.0666666666668,"d":"1392.07"},{"v":1401.983333333334,"d":"1401.98"},1382.15,1362.55,0.22409]
[6,"ABCAPITAL",99.85,{"v":100.53333333333335,"d":"100.53"},{"v":98.66666666666669,"d":"98.67"},{"v":97.48333333333333,"d":"97.48"},{"v":95.61666666666667,"d":"95.62"},{"v":101.7166666666667,"d":"101.72"},{"v":103.58333333333334,"d":"103.58"},{"v":104.76666666666671,"d":"104.77"},102.4,99.35,12.33831]
[7,"ABFRL",183.6,{"v":183.6833333333333,"d":"183.68"},{"v":181.36666666666662,"d":"181.37"},{"v":179.1333333333333,"d":"179.13"},{"v":176.8166666666666,"d":"176.82"},{"v":185.91666666666663,"d":"185.92"},{"v":188.2333333333333,"d":"188.23"},{"v":190.46666666666664,"d":"190.47"},186,181.45,1.98192]
[8,"ACC",1471.15,{"v":1481.1666666666667,"d":"1481.17"},{"v":1455.8333333333335,"d":"1455.83"},{"v":1440.5166666666667,"d":"1440.52"},{"v":1415.1833333333334,"d":"1415.18"},{"v":1496.4833333333336,"d":"1496.48"},{"v":1521.816666666667,"d":"1521.82"},{"v":1537.1333333333337,"d":"1537.13"},1506.5,1465.85,5.14306]
[9,"ADANIPORTS",374.75,{"v":374.73333333333335,"d":"374.73"},{"v":372.7166666666667,"d":"372.72"},{"v":370.68333333333334,"d":"370.68"},{"v":368.6666666666667,"d":"368.67"},{"v":376.7666666666667,"d":"376.77"},{"v":378.78333333333336,"d":"378.78"},{"v":380.8166666666667,"d":"380.82"},376.75,372.7,48.47267]
[10,"ADANIPOWER",54.05,54.25,{"v":53.3,"d":"53.30"},52.55,{"v":51.599999999999994,"d":"51.60"},{"v":55,"d":"55.00"},55.95,{"v":56.7,"d":"56.70"},55.2,53.5,179.05386]
{"$rows_left_out":491}
{"sheet":"Bulk Deals","index":4,"n_rows":77,"n_cols":8,"rows_kept":77,"merged":[[4,0,4,1],[4,2,4,3],[6,1,6,2]]}
[" "]
[]
[]
[]
[]
[{"$nulls":4},"Back To Main Page"]
["Subject :","BULK DEAL",null,{"$f":"Main!B10","v":"2018-12-06"}]
[]
["Date","Scrip code","Scrip Name","Client Name","Buy / Sell","Quantity Traded","Trade Price / Wt.Avg.trade price","Exchange  "]
["2018-12-05",539009,"GBLIL","ARPAN DAS","BUY",{"v":30000,"d":"30,000"},64.09,"BSE"]
["2018-12-05",539009,"GBLIL","BUDDHADEB LAHA","BUY",{"v":46500,"d":"46,500"},64.09,"BSE"]
["2018-12-05",539009,"GBLIL","KEVAL SAVANT","SELL",{"v":54221,"d":"54,221"},64.09,"BSE"]
["2018-12-05",530663,"GOYALASS","YOGESH DHARNIDHARKA","BUY",{"v":425000,"d":"425,000"},2.89,"BSE"]
["2018-12-05",530663,"GOYALASS","RITESH PRAFUL SHAH .","SELL",{"v":235000,"d":"235,000"},2.89,"BSE"]
["2018-12-05",540938,"GUJHYSPIN","DHANSUKHBHAI CHAMPAKLAL JADAV","SELL",{"v":120000,"d":"120,000"},6.04,"BSE"]
["2018-12-05",536709,"INDRENEW","JITENDRA KANTILAL VAKHARIA","SELL",{"v":122769,"d":"122,769"},18.01,"BSE"]
["2018-12-05",536709,"INDRENEW","HARSHADA MANOHAR BAING","BUY",{"v":122358,"d":"122,358"},18,"BSE"]
["2018-12-05",536709,"INDRENEW","SHALAKA SANTOSH GURAV","SELL",{"v":20000,"d":"20,000"},18,"BSE"]
["2018-12-05",536709,"INDRENEW","GANGARAM GOVIND WAINGANKAR","SELL",{"v":46000,"d":"46,000"},18.09,"BSE"]
["2018-12-05",536709,"INDRENEW","HARIT SHAH","BUY",{"v":20499,"d":"20,499"},18,"BSE"]
{"$rows_left_out":58}
{"sheet":"Call Tracker (Equity & F&O)","index":5,"n_rows":303,"n_cols":18,"rows_kept":303,"merged":[[38,0,39,0],[38,1,39,1],[38,2,39,2],[38,9,39,9],[38,11,39,11],[38,12,39,12],[38,13,39,13],[38,14,39,14],[40,0,41,0],[40,1,41,1],[40,2,41,2],[40,9,41,9],[40,11,41,11],[40,12,41,12],[40,13,41,13],[40,14,41,14],[51,0,52,0],[51,1,52,1],[51,2,52,2],[51,9,52,9],[51,11,52,11],[51,12,52,12],[51,13,52,13],[51,14,52,14],[53,0,54,0],[53,1,54,1],[53,2,54,2],[53,9,54,9],[53,11,54,11],[53,12,54,12],[53,13,54,13],[53,14,54,14]]}
[]
[]
[]
[]
[{"$nulls":12},"Back To Main Page"]
["Retail Research Technical Calls & Fundamental Performance Report for the month of December -2018 "]
[{"$nulls":12},{"$f":"Main!B10","v":"2018-12-06"}]
[null,"Positional  Call"]
["Sr.no","Date",null,"Company","Rec","Rec Price","Stop Loss***","Call Closed At","Target","Remark","Profit / Loss per Share","Gain / Loss  %","Status","Closed Date","NSE Closed Price"]
[1,"2018-11-14",null,"ASHOKLEY","Buy",108,100.7,111.25,"122-125","Part Profit of Rs.3.25/-",{"$f":"H10-F10","v":3.25},{"$f":"K10/F10","v":{"v":0.03009259259259259,"d":"3.01%"}},"Successful","2018-11-30",{"$nulls":3},"R"]
[2,"2018-11-21",null,"ADANIPORTS","Sell","358-361",377.7,null,"322-326","Open",{"$nulls":4},{"$f":"VLOOKUP(D11,Sheet2!A11:M1647,6,0)","v":374.75},null,null,"R"]
[3,"2018-11-29",null,"JSWSTEEL","Buy",312,297.7,322,"344-350","Part Profit of Rs.10/-",{"$f":"H12-F12","v":10},{"$f":"K12/F12","v":{"v":0.03205128205128205,"d":"3.21%"}},"Successful","2018-11-30",{"$nulls":3},"R"]
[4,"2018-11-30",null,"RAYMOND","Sell",820,861.6,793.5,"745-735","Part Profit of Rs.26.5/-",{"$f":"F13-H13","v":26.5},{"v":0.03231707317073171,"d":"3.23%"},"Successful","2018-12-03",{"$nulls":3},"R"]
[5,"2018-11-30",null,"INFY","Buy",665,628,685,725,"Part Profit of Rs.20/-",20,{"$f":"K14/F14","v":{"v":0.03007518796992481,"d":"3.01%"}},"Successful","2018-12-04",{"$nulls":3},"H"]
{"$rows_empty":19}
["CLBS = Closing Basis ***",{"$nulls":4},"Reinitiated $"]
["Dividend adjusted <>",{"$nulls":4},"Revised stoploss #"]
["Part book {}"]
["Master Trade High Risk"]
["Sr.no","Date",null,"Company","Rec","Rec Price","Stop Loss","Call Closed At","Target","Remark","Profit / Loss per share","Gain / Loss  per Lot","Lot","Status","Closed Date"]
{"$rows_left_out":210}
{"sheet":"Sheet2","index":6,"n_rows":1639,"n_cols":14,"rows_kept":1639,"hidden":true}
["SYMBOL","SERIES","OPEN","HIGH","LOW","CLOSE","LAST","PREVCLOSE","TOTTRDQTY","TOTTRDVAL","TIMESTAMP","TOTALTRADES","ISIN","ISIN"]
["20MICRONS","EQ",42.35,43.35,42,42.05,42,42.35,26485,1125627.6,"2018-12-05",359,"INE144J01027"]
["21STCENMGM","EQ",23.7,23.7,23.05,23.7,23.7,23.25,11442,270854.4,"2018-12-05",30,"INE253B01015"]
["3IINFOTECH","EQ",3.8,3.85,3.75,3.75,3.75,3.8,1509036,5699668.25,"2018-12-05",605,"INE748C01020"]
["3MINDIA","EQ",22463,22550,22100,22167.05,22100,22460.4,1359,30406523.75,"2018-12-05",515,"INE470A01017"]
["5PAISA","EQ",199.9,199.9,190,190.55,190,192,1302,250060.4,"2018-12-05",106,"INE618L01018"]
["63MOONS","EQ",95.25,101.7,95.25,97.15,96.95,97.7,485827,47940657.15,"2018-12-05",8730,"INE111B01023"]
["8KMILES","EQ",206,206,192.55,192.55,192.55,202.65,535995,106718101.4,"2018-12-05",5326,"INE650K01021"]
["A2ZINFRA","EQ",12.4,12.75,12.05,12.6,12.7,12.75,266701,3299696.45,"2018-12-05",768,"INE619I01012"]
["AARTIDRUGS","EQ",561.7,563.45,554.2,560.6,561,565.1,21949,12264553.7,"2018-12-05",1449,"INE767A01016"]
["AARTIIND","EQ",1454,1472.9,1450.9,1466,1470,1468.4,108730,158601130.9,"2018-12-05",5799,"INE769A01020"]
["AARVEEDEN","EQ",24.6,25.35,24.05,24.8,24.85,24.6,5443,133838.85,"2018-12-05",57,"INE273D01019"]
["AAVAS","EQ",764.05,799.8,761,776.05,777,771.2,14960,11723511.35,"2018-12-05",2295,"INE216P01012"]
["ABAN","EQ",75,76.7,72.6,73.6,74,75.75,295586,21913510,"2018-12-05",3666,"INE421A01028"]
["ABB","EQ",1381.95,1382.15,1362.55,1372.7,1372,1382.05,22409,30741884.5,"2018-12-05",2803,"INE117A01022"]
["ABBOTINDIA","EQ",7753,7755.05,7575.75,7656.95,7660,7752.4,3007,23049930.85,"2018-12-05",876,"INE358A01014"]
["ABCAPITAL","EQ",102,102.4,99.35,99.85,99.8,102.5,1233831,123767519.7,"2018-12-05",55559,"INE674K01013"]
["ABFRL","EQ",183,186,181.45,183.6,183.65,184.55,198192,36453596.8,"2018-12-05",3107,"INE647O01011"]
["ACC","EQ",1504,1506.5,1465.85,1471.15,1470,1508.95,514306,761222016.65,"2018-12-05",18984,"INE012A01025"]
["ACCELYA","EQ",983.75,1011.35,983.75,992.3,998,998.65,1801,1793111.5,"2018-12-05",327,"INE793A01012"]
{"$rows_left_out":1619}