{"text_format":"3","workbook":"xlsx","n_sheets":8,"sheets":["Main","Future Intra","Cash Intra","MidCap Intra","Bulk Deals","Call Tracker (Equity & F&O)","Call Tracker (Currency)","Sheet2"],"not_rendered":{"images":4,"defined_names":4},"read":"whole","date_system":"1900"}

{"sheet":"Main","index":0,"n_rows":17,"n_cols":4,"rows_kept":17}
[null,"                                                                                                 "]
{"$rows_empty":8}
[null,"2018-04-06"]
[]
[null,"Sheet No.","Template Name","Summary"]
[null,1,"Future Intra","For Intraday trading in F&O segment"]
[null,2,"Cash Intra","For Intraday trading in cash market segment"]
[null,3,"Mid-cap Intra","For Intraday trading in Mid-cap stocks"]
[null,4,"Bulk Deals","Reveals Bulk Deals carried on NSE & BSE"]
[null,5,"Call Tracker"]

{"sheet":"Future Intra","index":1,"n_rows":251,"n_cols":15,"rows_kept":251,"merged":[[8,0,9,0],[8,1,9,1],[8,2,9,2],[8,5,8,7],[8,8,8,10]]}
[]
[]
[]
[]
[{"$nulls":12},"Back to Main Page"]
["FOR INTRA DAY TRADING",{"$nulls":10},{"$f":"Main!B10","v":"2018-04-06"}]
[]
[]
["Sr.no","Sector","Scrip","CLOSE RATE","Pivot Point","Supports",null,null,"Resistances"]
[null,"Sector",null,"Point","Point","S1","S2","S3","R1","R2","R3","HIGH","LOW","OI","% Change in OI"]
[1,"Index","BANKNIFTY",{"v":24808.9,"d":"24808.90"},{"v":24699.100000000002,"d":"24699.10"},{"v":24519.800000000003,"d":"24519.80"},{"v":24230.7,"d":"24230.70"},{"v":24051.4,"d":"24051.40"},{"v":24988.200000000004,"d":"24988.20"},{"v":25167.5,"d":"25167.50"},{"v":25456.600000000006,"d":"25456.60"},24878.4,24410,1703400,{"v":-0.11323740707577619,"d":"-11.32%"}]
[2,"Index","NIFTY",{"v":10352.2,"d":"10352.20"},{"v":10321.533333333335,"d":"10321.53"},{"v":10283.716666666669,"d":"10283.72"},{"v":10215.233333333334,"d":"10215.23"},{"v":10177.416666666668,"d":"10177.42"},{"v":10390.01666666667,"d":"10390.02"},{"v":10427.833333333336,"d":"10427.83"},{"v":10496.316666666671,"d":"10496.32"},10359.35,10253.05,22958550,{"v":-0.024353396758617394,"d":"-2.44%"}]
[3,"Index","NIFTYCPSE",2827.05,942.35,{"v":1884.7,"d":"1884.70"},942.35,{"v":1884.7,"d":"1884.70"},{"v":1884.7,"d":"1884.70"},942.35,{"v":1884.7,"d":"1884.70"},0,0,0,{"v":0,"d":"0.00%"}]
[4,"Index","NIFTYINFRA",{"v":3716.6,"d":"3716.60"},{"v":1238.8666666666666,"d":"1238.87"},{"v":2477.733333333333,"d":"2477.73"},{"v":1238.8666666666666,"d":"1238.87"},{"v":2477.733333333333,"d":"2477.73"},{"v":2477.733333333333,"d":"2477.73"},{"v":1238.8666666666666,"d":"1238.87"},{"v":2477.733333333333,"d":"2477.73"},0,0,0,{"v":0,"d":"0.00%"}]
[5,"Index","NIFTYIT",{"v":12708,"d":"12708.00"},{"v":12687.333333333334,"d":"12687.33"},{"v":12645.666666666668,"d":"12645.67"},{"v":12583.333333333334,"d":"12583.33"},{"v":12541.666666666668,"d":"12541.67"},{"v":12749.666666666668,"d":"12749.67"},{"v":12791.333333333336,"d":"12791.33"},{"v":12853.666666666668,"d":"12853.67"},12729,12625,39550,{"v":-0.08660508083140878,"d":"-8.66%"}]
[6,"Index","NIFTYMID50",5007.45,{"v":1669.1499999999999,"d":"1669.15"},{"v":3338.2999999999997,"d":"3338.30"},{"v":1669.1499999999999,"d":"1669.15"},{"v":3338.2999999999997,"d":"3338.30"},{"v":3338.2999999999997,"d":"3338.30"},{"v":1669.1499999999999,"d":"1669.15"},{"v":3338.2999999999997,"d":"3338.30"},0,0,591400,{"v":0,"d":"0.00%"}]
[7,"Index","NIFTYPSE",{"v":4380.6,"d":"4380.60"},{"v":1460.2,"d":"1460.20"},{"v":2920.4,"d":"2920.40"},{"v":1460.2,"d":"1460.20"},{"v":2920.4,"d":"2920.40"},{"v":2920.4,"d":"2920.40"},{"v":1460.2,"d":"1460.20"},{"v":2920.4,"d":"2920.40"},0,0,0,{"v":0,"d":"0.00%"}]
[8,"Cement","ACC",{"v":1558,"d":"1558.00"},1555.25,1545.55,{"v":1533.1,"d":"1533.10"},{"v":1523.3999999999999,"d":"1523.40"},{"v":1567.7,"d":"1567.70"},{"v":1577.3999999999999,"d":"1577.40"},{"v":1589.8500000000001,"d":"1589.85"},1564.95,1542.8,1482000,{"v":0.04483925549915398,"d":"4.48%"}]
[9,"Others","ADANIENT",148.55,{"v":142.16666666666666,"d":"142.17"},{"v":133.98333333333332,"d":"133.98"},{"v":119.41666666666666,"d":"119.42"},{"v":111.23333333333332,"d":"111.23"},{"v":156.73333333333332,"d":"156.73"},{"v":164.91666666666666,"d":"164.92"},{"v":179.48333333333332,"d":"179.48"},150.35,127.6,7720000,{"v":-0.4336854460093897,"d":"-43.37%"}]
[10,"Others","ADANIPORTS",376.95,377.25,{"v":372.6,"d":"372.60"},368.25,{"v":363.6,"d":"363.60"},{"v":381.6,"d":"381.60"},386.25,{"v":390.6,"d":"390.60"},381.9,372.9,13675000,{"v":-0.044207583435261225,"d":"-4.42%"}]
{"$rows_left_out":225}
{"sheet":"Cash Intra","index":2,"n_rows":251,"n_cols":13,"rows_kept":251,"merged":[[7,0,8,0],[7,1,8,1],[7,2,8,2],[7,3,8,3],[7,4,7,6],[7,7,7,9]]}
[]
[]
[]
[]
[{"$nulls":12},"Back to Main Page"]
["FOR INTRA DAY TRADING",{"$nulls":9},{"$f":"Main!B10","v":"2018-04-06"}]
[]
["Sr.no","Scrip","CLOSE RATE","Pivot Point","Supports",null,null,"Resistances"]
[null,null,"Point",null,"S1","S2","S3","R1","R2","R3","HIGH","LOW","Total Trade Quanity in Lakhs"]
[1,"Nifty 50",10325.15,{"v":10294.8,"d":"10294.80"},{"v":10257.8,"d":"10257.80"},10190.45,10153.45,{"v":10362.149999999998,"d":"10362.15"},{"v":10399.149999999998,"d":"10399.15"},{"v":10466.499999999996,"d":"10466.50"},10331.8,10227.45]
[2,"Nifty Bank",24759.8,{"v":24655.18333333333,"d":"24655.18"},{"v":24485.46666666666,"d":"24485.47"},{"v":24211.133333333328,"d":"24211.13"},{"v":24041.416666666657,"d":"24041.42"},{"v":24929.516666666663,"d":"24929.52"},{"v":25099.23333333333,"d":"25099.23"},{"v":25373.566666666666,"d":"25373.57"},24824.9,24380.85]
[3,"Nifty CPSE",2420.25,{"v":2417.7166666666667,"d":"2417.72"},{"v":2411.4833333333336,"d":"2411.48"},{"v":2402.7166666666667,"d":"2402.72"},{"v":2396.4833333333336,"d":"2396.48"},{"v":2426.4833333333336,"d":"2426.48"},{"v":2432.7166666666662,"d":"2432.72"},{"v":2441.4833333333336,"d":"2441.48"},2423.95,2408.95]
[4,"Nifty Infra",3404.3,{"v":3398.4,"d":"3398.40"},{"v":3386.6000000000004,"d":"3386.60"},{"v":3368.9,"d":"3368.90"},{"v":3357.1000000000004,"d":"3357.10"},{"v":3416.1000000000004,"d":"3416.10"},{"v":3427.9000000000005,"d":"3427.90"},{"v":3445.6000000000004,"d":"3445.60"},3410.2,3380.7]
[5,"Nifty IT",12682.55,{"v":12652.433333333334,"d":"12652.43"},{"v":12609.06666666667,"d":"12609.07"},{"v":12535.583333333336,"d":"12535.58"},{"v":12492.21666666667,"d":"12492.22"},{"v":12725.916666666668,"d":"12725.92"},{"v":12769.283333333333,"d":"12769.28"},{"v":12842.766666666666,"d":"12842.77"},12695.8,12578.95]
[6,"Nifty PSE",3867.8,{"v":3863.5333333333333,"d":"3863.53"},{"v":3854.116666666667,"d":"3854.12"},{"v":3840.4333333333334,"d":"3840.43"},{"v":3831.016666666667,"d":"3831.02"},{"v":3877.2166666666667,"d":"3877.22"},{"v":3886.6333333333337,"d":"3886.63"},{"v":3900.3166666666666,"d":"3900.32"},3872.95,3849.85]
[7,"Nifty Midcap 50",5210.4,{"v":5191.316666666667,"d":"5191.32"},{"v":5166.533333333333,"d":"5166.53"},{"v":5122.666666666666,"d":"5122.67"},{"v":5097.883333333332,"d":"5097.88"},{"v":5235.183333333333,"d":"5235.18"},{"v":5259.966666666668,"d":"5259.97"},{"v":5303.833333333334,"d":"5303.83"},5216.1,5147.45]
[8,"ABB",1278.6,{"v":1284.5333333333333,"d":"1284.53"},{"v":1269.0666666666666,"d":"1269.07"},{"v":1259.5333333333333,"d":"1259.53"},{"v":1244.0666666666666,"d":"1244.07"},{"v":1294.0666666666666,"d":"1294.07"},{"v":1309.5333333333333,"d":"1309.53"},{"v":1319.0666666666666,"d":"1319.07"},1300,1275,1.00475]
[9,"ACC",1552.35,{"v":1549.6500000000003,"d":"1549.65"},{"v":1539.6000000000006,"d":"1539.60"},{"v":1526.8500000000004,"d":"1526.85"},{"v":1516.8000000000006,"d":"1516.80"},{"v":1562.4000000000005,"d":"1562.40"},{"v":1572.4500000000003,"d":"1572.45"},{"v":1585.2000000000005,"d":"1585.20"},1559.7,1536.9,1.98303]
[10,"AIAENG",1450,{"v":1446.5,"d":"1446.50"},{"v":1433.1,"d":"1433.10"},{"v":1416.1999999999998,"d":"1416.20"},{"v":1402.7999999999997,"d":"1402.80"},{"v":1463.4,"d":"1463.40"},{"v":1476.8000000000002,"d":"1476.80"},{"v":1493.7000000000003,"d":"1493.70"},1459.9,1429.6,0.1477]
[11,"AUBANK",652.85,{"v":649.1,"d":"649.10"},641.75,630.65,{"v":623.3,"d":"623.30"},{"v":660.2,"d":"660.20"},{"v":667.5500000000002,"d":"667.55"},{"v":678.6500000000001,"d":"678.65"},656.45,638,2.03016]
{"$rows_left_out":225}
{"sheet":"MidCap Intra","index":3,"n_rows":512,"n_cols":13,"rows_kept":512,"merged":[[0,0,0,1],[8,0,9,0],[8,1,9,1],[8,2,9,2],[8,3,9,3],[8,4,8,6],[8,7,8,9]]}
[]
[]
[]
[]
[{"$nulls":11},"Back To Main Page"]
["FOR INTRA DAY TRADING",{"$nulls":9},{"$f":"Main!B10","v":"2018-04-06"}]
[null,null," "]
[]
["Sr.no","Scrip","CLOSE RATE","Pivot Point","Supports",null,null,"Resistances"]
[null,null,"Point",null,"S1","S2","S3","R1","R2","R3","HIGH","LOW","Total Trade Quanity in Lakhs"]
[1,"3MINDIA",20638.7,{"v":20566.233333333334,"d":"20566.23"},{"v":20412.466666666667,"d":"20412.47"},{"v":20186.233333333334,"d":"20186.23"},{"v":20032.466666666667,"d":"20032.47"},{"v":20792.466666666667,"d":"20792.47"},{"v":20946.233333333337,"d":"20946.23"},{"v":21172.466666666667,"d":"21172.47"},20720,20340,0.00874]
[2,"8KMILES",694.45,{"v":697.4166666666666,"d":"697.42"},{"v":688.0333333333333,"d":"688.03"},{"v":681.6166666666667,"d":"681.62"},{"v":672.2333333333333,"d":"672.23"},{"v":703.8333333333333,"d":"703.83"},{"v":713.2166666666667,"d":"713.22"},{"v":719.6333333333332,"d":"719.63"},706.8,691,1.4363]
[3,"ABB",1278.6,{"v":1284.5333333333333,"d":"1284.53"},{"v":1269.0666666666666,"d":"1269.07"},{"v":1259.5333333333333,"d":"1259.53"},{"v":1244.0666666666666,"d":"1244.07"},{"v":1294.0666666666666,"d":"1294.07"},{"v":1309.5333333333333,"d":"1309.53"},{"v":1319.0666666666666,"d":"1319.07"},1300,1275,1.00475]
[4,"ACC",1552.35,{"v":1549.6500000000003,"d":"1549.65"},{"v":1539.6000000000006,"d":"1539.60"},{"v":1526.8500000000004,"d":"1526.85"},{"v":1516.8000000000006,"d":"1516.80"},{"v":1562.4000000000005,"d":"1562.40"},{"v":1572.4500000000003,"d":"1572.45"},{"v":1585.2000000000005,"d":"1585.20"},1559.7,1536.9,1.98303]
[5,"AIAENG",1450,{"v":1446.5,"d":"1446.50"},{"v":1433.1,"d":"1433.10"},{"v":1416.1999999999998,"d":"1416.20"},{"v":1402.7999999999997,"d":"1402.80"},{"v":1463.4,"d":"1463.40"},{"v":1476.8000000000002,"d":"1476.80"},{"v":1493.7000000000003,"d":"1493.70"},1459.9,1429.6,0.1477]
[6,"APLAPOLLO",2116.85,{"v":2108.9166666666665,"d":"2108.92"},{"v":2067.933333333333,"d":"2067.93"},{"v":2019.0166666666664,"d":"2019.02"},{"v":1978.0333333333328,"d":"1978.03"},{"v":2157.833333333333,"d":"2157.83"},{"v":2198.8166666666666,"d":"2198.82"},{"v":2247.733333333333,"d":"2247.73"},2149.9,2060,0.9261]
[7,"AUBANK",652.85,{"v":649.1,"d":"649.10"},641.75,630.65,{"v":623.3,"d":"623.30"},{"v":660.2,"d":"660.20"},{"v":667.5500000000002,"d":"667.55"},{"v":678.6500000000001,"d":"678.65"},656.45,638,2.03016]
[8,"AARTIIND",1186.6,{"v":1178.1833333333334,"d":"1178.18"},{"v":1163.4166666666667,"d":"1163.42"},{"v":1140.2333333333333,"d":"1140.23"},{"v":1125.4666666666667,"d":"1125.47"},{"v":1201.3666666666668,"d":"1201.37"},{"v":1216.1333333333332,"d":"1216.13"},{"v":1239.3166666666668,"d":"1239.32"},1192.95,1155,0.50692]
[9,"ABAN",162.15,{"v":162.11666666666667,"d":"162.12"},{"v":160.83333333333334,"d":"160.83"},{"v":159.51666666666668,"d":"159.52"},{"v":158.23333333333335,"d":"158.23"},{"v":163.43333333333334,"d":"163.43"},{"v":164.71666666666664,"d":"164.72"},{"v":166.03333333333333,"d":"166.03"},163.4,160.8,4.83386]
[10,"ADANIENT",147.85,142.35,131.75,115.65,{"v":105.05000000000001,"d":"105.05"},158.45,{"v":169.04999999999995,"d":"169.05"},{"v":185.14999999999998,"d":"185.15"},152.95,126.25,274.97507]
{"$rows_left_out":493}
{"sheet":"Bulk Deals","index":4,"n_rows":76,"n_cols":8,"rows_kept":76,"merged":[[4,0,4,1],[4,2,4,3],[6,1,6,2]]}
[" "]
[]
[]
[]
[]
[{"$nulls":4},"Back To Main Page"]
["Subject :","BULK DEAL",null,{"$f":"Main!B10","v":"2018-04-06"}]
[]
["Date","Scrip code","Scrip Name","Client Name","Buy / Sell","Quantity Traded","Trade Price / Wt.Avg.trade price","Exchange  "]
["2018-04-05",511064,"APLAYA","RDS CORPORATE SERVICES PRIVATE LIMITED","SELL",{"v":780000,"d":"780,000"},2.18,"BSE"]
["2018-04-05",523019,"BNRSEC","NISHA RATHI","BUY",{"v":31583,"d":"31,583"},42.85,"BSE"]
["2018-04-05",523019,"BNRSEC","PREM KUMAR BAJAJ","SELL",{"v":31200,"d":"31,200"},42.85,"BSE"]
["2018-04-05",533137,"DEN","GOVERNMENT PENSION FUND GLOBAL","BUY",{"v":1834784,"d":"1,834,784"},104,"BSE"]
["2018-04-05",532219,"ENERGYDEV","KANODIA STOCK BROKING PVT LTD","SELL",{"v":250000,"d":"250,000"},19.74,"BSE"]
["2018-04-05",532219,"ENERGYDEV","SURESH KANODIA","BUY",{"v":250000,"d":"250,000"},19.74,"BSE"]
["2018-04-05",532726,"GALLANTT","HIPOLINE COMMERCE PVT LTD","BUY",{"v":487771,"d":"487,771"},39.5,"BSE"]
["2018-04-05",532726,"GALLANTT","SANTOSH KUMAR AGARWAL","SELL",{"v":500000,"d":"500,000"},39.5,"BSE"]
["2018-04-05",540266,"GLCL","MAYUR MAHESHKUMAR PANCHAL","SELL",{"v":19150,"d":"19,150"},33,"BSE"]
["2018-04-05",526717,"GOPALA","BHARATKUMAR NIHALCHAND SHAH","SELL",{"v":50000,"d":"50,000"},137,"BSE"]
["2018-04-05",526717,"GOPALA","KPR FINANCE PRIVATE LIMITED","BUY",{"v":50000,"d":"50,000"},137,"BSE"]
{"$rows_left_out":57}
{"sheet":"Call Tracker (Equity & F&O)","index":5,"n_rows":230,"n_cols":19,"rows_kept":230,"merged":[[8,9,8,10],[9,9,9,10],[10,9,10,10],[11,9,11,10],[12,9,12,10],[13,9,13,10],[14,9,14,10],[15,9,15,10],[16,9,16,10],[17,9,17,10],[18,9,18,10],[19,9,19,10],[20,9,20,10],[21,9,21,10],[22,9,22,10],[23,9,23,10],[24,9,24,10],[25,9,25,10],[26,9,26,10],[27,9,27,10],[32,9,32,10],[33,9,33,10],[34,0,35,0],[34,1,35,1],[34,6,35,6],[34,8,35,8],[34,9,35,10],[34,13,35,13],[34,14,35,14],[34,15,35,15],[39,9,39,10],[40,0,41,0],[40,1,41,1],[40,6,41,6],[40,8,41,8],[40,9,41,10],[40,13,41,13],[40,14,41,14],[40,15,41,15],[42,9,42,10],[45,9,45,10],[46,9,46,10],[47,9,47,10],[48,9,48,10],[49,9,49,10],[50,9,50,10],[51,9,51,10],[52,9,52,10],[53,9,53,10],[54,9,54,10],[55,9,55,10],[56,9,56,10],[57,9,57,10],[58,9,58,10],[60,9,60,10],[66,9,66,10],[67,9,67,10],[74,9,74,10],[75,9,75,10],[76,9,76,10],[77,9,77,10],[78,9,78,10],[79,9,79,10],[80,9,80,10],[81,9,81,10],[82,9,82,10],[91,9,91,10],[92,9,92,10],[93,9,93,10],[94,9,94,10],[95,9,95,10],[96,9,96,10],[97,9,97,10],[99,9,99,10],[100,9,100,10],[101,9,101,10],[102,9,102,10],[103,9,103,10],[104,9,104,10],[105,9,105,10],[106,9,106,10],[107,9,107,10],[108,9,108,10],[109,9,109,10],[110,9,110,10],[111,9,111,10],[112,9,112,10],[113,9,113,10],[114,9,114,10],[115,9,115,10],[116,9,116,10],[117,9,117,10],[118,9,118,10],[119,9,119,10],[120,9,120,10],[121,9,121,10],[122,9,122,10],[123,9,123,10],[124,9,124,10],[125,9,125,10],[126,9,126,10],[127,9,127,10],[128,9,128,10],[129,9,129,10],[130,9,130,10],[131,9,131,10],[132,9,132,10],[133,9,133,10],[134,9,134,10],[135,9,135,10],[136,9,136,10],[137,9,137,10],[138,9,138,10],[139,9,139,10],[140,9,140,10],[141,9,141,10],[142,9,142,10],[143,9,143,10],[144,9,144,10],[145,9,145,10],[146,9,146,10],[147,9,147,10],[148,9,148,10],[149,9,149,10],[150,9,150,10],[151,9,151,10],[152,9,152,10],[153,9,153,10],[154,9,154,10],[155,9,155,10],[156,9,156,10],[157,9,157,10],[158,9,158,10],[159,9,159,10],[160,9,160,10],[161,9,161,10],[162,9,162,10],[163,9,163,10],[164,9,164,10],[165,9,165,10],[167,9,167,10],[168,9,168,10],[169,9,169,10],[170,9,170,10],[171,9,171,10],[172,9,172,10],[173,9,173,10],[174,9,174,10],[175,9,175,10],[176,9,176,10],[177,9,177,10],[178,9,178,10],[179,9,179,10],[180,9,180,10],[181,9,181,10],[182,9,182,10],[183,9,183,10],[184,9,184,10],[185,9,185,10],[186,9,186,10],[187,9,187,10],[188,9,188,10],[189,9,189,10],[190,9,190,10],[191,9,191,10],[192,9,192,10],[193,9,193,10],[194,9,194,10],[195,9,195,10],[196,9,196,10],[197,9,197,10],[198,9,198,10],[199,9,199,10],[200,9,200,10],[201,9,201,10],[202,9,202,10],[203,9,203,10],[204,9,204,10],[205,9,205,10],[206,9,206,10],[207,9,207,10],[208,9,208,10],[209,9,209,10],[210,9,210,10],[211,9,211,10],[212,9,212,10],[213,9,213,10],[214,9,214,10],[215,9,215,10],[217,10,217,11]]}
[]
[]
[]
[]
[{"$nulls":13},"Back To Main Page"]
["Retail Research Technical Calls & Fundamental Performance Report for the month of April -2018 "]
[{"$nulls":13},{"$f":"Main!B10","v":"2018-04-06"}]
[null,"Positional  Call"]
["Sr.no","Date",null,"Company","Rec","Rec Price","Stop Loss***","Call Closed At","Target","Remark",null,"Profit / Loss per Share","Gain / Loss  %","Status","Closed Date","NSE Closed Price"]
[1,"2018-02-09",null,"HINDUNILVR","Buy",1332,1275,1375,1450,"Profit of Rs.43/-",null,{"$f":"H10-F10-K10","v":43},{"$f":"L10/F10","v":{"v":0.03228228228228228,"d":"3.23%"}},"Successful","2018-04-05",{"$nulls":3},"A"]
[2,"2018-02-12",null,"ITC","Buy","271-272",250,null,310,"Open",{"$nulls":5},{"$f":"VLOOKUP(D11,Sheet2!$A$1:M2109,6,0)","v":259.65},null,null,"P"]
[3,"2018-03-08",null,"CADILAHC","Buy",385,367,397.5,420,"Profit of Rs.12.5/-",null,{"$f":"H12-F12-K12","v":12.5},{"$f":"L12/F12","v":{"v":0.032467532467532464,"d":"3.25%"}},"Successful","2018-04-04",{"$f":"VLOOKUP(D12,Sheet2!$A$1:M2132,6,0)","v":394.35},null,null,"R"]
[4,"2018-03-13",null,"LUPIN","Buy",772,732,796,850,"Part Profit of Rs.24/-",null,24,{"$f":"L13/F13","v":{"v":0.031088082901554404,"d":"3.11%"}},"Successful","2018-04-03",{"$f":"VLOOKUP(D13,Sheet2!$A$1:M2133,6,0)","v":786.7},null,null,"R"]
[5,"2018-03-16",null,"TATACHEM","Buy",686.5,658,714.5,"730-750","Profit of Rs.28/-",null,28,{"$f":"L14/F14","v":{"v":0.04078659868900218,"d":"4.08%"}},"Successful","2018-04-03",{"$f":"VLOOKUP(D14,Sheet2!$A$1:M2134,6,0)","v":715.6},null,null,"H"]
[6,"2018-03-19",null,"TCS","Buy",2842.5,2720,2937.5,3050,"Profit of Rs.95/-",null,95,{"v":0.03342128408091469,"d":"3.34%"},"Successful","2018-04-05",{"$nulls":3},"A"]
[7,"2018-03-27",null,"KPIT","Buy",219.5,210,226,240,"Part Profit of Rs.6.5/-",null,6.5,{"$f":"L16/F16","v":{"v":0.029612756264236904,"d":"2.96%"}},"Successful","2018-03-27",{"$nulls":3},"R"]
[8,"2018-03-27",null,"ICICIBANK","Buy",283,268,262.5,310,"Loss of Rs.20.5/-",null,-20.5,{"v":-0.07243816254416961,"d":"-7.24%"},"Unsuccessful","2018-04-02",{"$nulls":3},"R"]
[9,"2018-03-28",null,"LT","Buy",1292.5,1245,1334.5,"1375-1395","Profit of Rs.42/-",null,42,{"$f":"L18/F18","v":{"v":0.03249516441005803,"d":"3.25%"}},"Successful","2018-04-03",{"$nulls":3},"H"]
[10,"2018-04-02",null,"AMBUJACEM","Buy",232,219,239.75,"250-255","Profit of Rs.7.75/-",null,7.75,{"$f":"L19/F19","v":{"v":0.0334051724137931,"d":"3.34%"}},"Successful","2018-04-03",{"$nulls":3},"H"]
[11,"2018-04-02",null,"COLPAL","Buy",1050,998,1087,"1140-1160","Profit of Rs.37/-",null,37,{"v":0.035238095238095235,"d":"3.52%"},"Successful","2018-04-04",{"$nulls":3},"H"]
{"$rows_left_out":211}
{"sheet":"Call Tracker (Currency)","index":6,"n_rows":58,"n_cols":18,"rows_kept":58,"merged":[[1,8,1,9],[2,8,2,9],[3,8,3,9],[4,8,4,9],[5,8,5,9],[6,8,6,9],[7,8,7,9],[8,8,8,9],[9,8,9,9],[10,8,10,9],[11,8,11,9],[12,8,12,9],[13,8,13,9],[14,8,14,9],[15,8,15,9],[16,8,16,9],[17,8,17,9],[18,8,18,9],[19,8,19,9],[20,8,20,9],[21,8,21,9],[22,8,22,9],[23,8,23,9],[24,8,24,9],[25,8,25,9],[26,8,26,9],[27,8,27,9],[28,8,28,9],[29,8,29,9],[30,8,30,9],[31,8,31,9],[32,8,32,9],[33,8,33,9],[34,8,34,9],[35,8,35,9],[36,8,36,9],[37,8,37,9],[38,8,38,9],[39,8,39,9],[40,8,40,9],[41,8,41,9],[42,8,42,9],[43,8,43,9],[44,8,44,9],[45,8,45,9],[46,8,46,9],[47,8,47,9],[48,8,48,9],[49,8,49,9],[50,8,50,9],[51,8,51,9],[52,8,52,9],[53,8,53,9],[54,8,54,9],[55,8,55,9],[56,8,56,9],[57,8,57,9],[58,8,58,9],[59,8,59,9],[60,8,60,9],[61,8,61,9],[62,8,62,9],[63,8,63,9],[64,8,64,9],[65,8,65,9],[66,8,66,9],[67,8,67,9],[68,8,68,9],[69,8,69,9],[70,8,70,9],[71,8,71,9],[72,8,72,9],[73,8,73,9],[74,8,74,9],[75,8,75,9],[76,8,76,9],[77,8,77,9],[78,8,78,9],[79,8,79,9],[80,8,80,9],[81,8,81,9],[82,8,82,9],[83,8,83,9],[84,8,84,9],[85,8,85,9],[86,8,86,9],[87,8,87,9],[88,8,88,9],[89,8,89,9],[90,8,90,9],[91,8,91,9],[92,8,92,9],[93,8,93,9],[94,8,94,9],[95,8,95,9],[96,8,96,9],[97,8,97,9],[98,8,98,9],[99,8,99,9],[100,8,100,9],[101,8,101,9],[102,8,102,9],[103,8,103,9],[104,8,104,9],[105,8,105,9],[106,8,106,9],[107,8,107,9],[108,8,108,9],[109,8,109,9],[110,8,110,9],[111,8,111,9],[112,8,112,9],[113,8,113,9],[114,8,114,9],[115,8,115,9],[116,8,116,9],[117,8,117,9],[118,8,118,9],[119,8,119,9],[120,8,120,9],[121,8,121,9],[122,8,122,9],[123,8,123,9],[124,8,124,9]]}
["Master Trade High Risk"]
["Sr.no","Date","Company","Rec","Rec Price","Stop Loss","Call Closed At","Target","Remark",null,"Profit / Loss per share","Gain / Loss  per Lot","Lot","Status","Closed Date"]
[1,"2017-05-08","USDINR MAY FUT","Buy",64.3935,64.29,64.66,64.59,"Profit of Rs.0.27/-",null,{"v":0.2664999999999935,"d":"0.27"},266.4999999999935,1000,"Successful","2017-05-09",null,null,"P"]
[2,"2017-05-08","USDINR JUN FUT","Buy",64.6535,64.45,64.965,65.05,"Profit of Rs 0.31/-",null,{"v":0.31150000000000944,"d":"0.31"},311.50000000000944,1000,"Successful","2017-05-09",null,null,"P"]
[3,"2017-05-09","EUROINR MAY FUT","Sell",70.65,70.8,70.07,70.4,"Profit of Rs 0.58/-",null,{"v":0.580000000000013,"d":"0.58"},580.00000000001,1000,"Successful","2017-05-12",null,null,"P"]
[4,"2017-05-09","GBPINR MAY FUT","Buy",83.774,83.37,83.37,84.77,"Loss of Rs 0.40/-",null,{"v":-0.40399999999999636,"d":"-0.40"},-403.99999999999636,1000,"Unsuccessful","2017-05-11",null,null,"P"]
[5,"2017-05-11","USDINR MAY FUT","Buy",64.6555,64.55,64.55,64.86,"Loss of Rs.0.1055/-",null,-0.10550000000000637,{"$f":"K7*M7","v":{"v":-105.50000000000637,"d":"-105.50"}},1000,"Unsuccessful","2017-05-11",null,null,"P"]
[6,"2017-05-15","USDINR MAY FUT","Buy",64.2275,64.08,64.46,64.48,"Profit of Rs 0.23/-",null,{"v":0.2324999999999875,"d":"0.23"},232.4999999999875,1000,"Successful","2017-05-18",null,null,"P"]
[7,"2017-05-19","USDINR MAY FUT","Sell",64.83,65,65,64.5,"Loss of Rs.0.17/-",null,{"v":-0.1700000000000017,"d":"-0.17"},-170.0000000000017,1000,"Unsuccessful","2017-05-19",null,null,"P"]
[8,"2017-05-23","USDINR MAY FUT","Buy",64.83,64.62,64.95,65.2,"Profit of Rs 0.12/-",null,{"v":0.12000000000000455,"d":"0.12"},120.00000000000455,1000,"Successful","2017-05-24",null,null,"P"]
[9,"2017-05-25","USDINR MAY FUT","Buy",64.57,64.25,64.56,65,"Loss of Rs.0.01/-",null,-0.009999999999990905,-9.999999999990905,1000,"Neutral","2017-05-29",null,null,"P"]
[10,"2017-05-30","USDINR JUN FUT","Buy",64.9125,64.71,64.71,65.31,"Loss of Rs.0.20/-",null,{"v":-0.20250000000000057,"d":"-0.20"},-202.50000000000057,1000,"Unsuccessful","2017-05-31",null,null,"P"]
[11,"2017-06-01","USDINR JUN FUT","Buy",64.655,64.45,64.45,65.05,"Loss of Rs.0.20/-",null,{"$f":"G13-E13","v":{"v":-0.2049999999999983,"d":"-0.20"}},{"$f":"K13*M13","v":-204.9999999999983},{"v":1000,"d":"1000.00"},"Unsuccessful","2017-06-08",null,null,"P"]
[12,"2017-06-12","USDINR JUN FUT","Buy",64.45,64,64.7625,65.2,"Profit of Rs 0.31/-",null,{"v":0.3125,"d":"0.31"},312.5,1000,"Successful","2017-06-16"]
[13,"2017-06-16","USDINR JUN FUT","Buy",64.51,64.2,64.7,65.11,"Profit of Rs 0.19/-",null,{"v":0.18999999999999773,"d":"0.19"},189.99999999999773,1000,"Successful","2017-06-21"]
[14,"2017-06-22","USDINR JUN FUT","Buy",64.56,64.2,64.2,65.1,"Loss of Rs.0.36/-",null,{"v":-0.35999999999999943,"d":"-0.36"},-359.99999999999943,{"v":1000,"d":"1000.00"},"Unsuccessful","2017-06-30"]
[15,"2017-07-10","USDINR JUL FUT","Buy",64.67,64.4,64.4,65.15,"Loss of Rs.0.27/-",null,{"v":-0.269999999999996,"d":"-0.27"},-269.999999999996,{"v":1000,"d":"1000.00"},"Unsuccessful","2017-07-31"]
[16,"2017-08-02","USDINR AUG FUT","Buy",64.235,63.98,63.98,64.75,"Loss of Rs.0.26/-",null,{"v":-0.25500000000000256,"d":"-0.26"},-255.00000000000256,{"v":1000,"d":"1000.00"},"Unsuccessful","2017-08-02"]
[17,"2017-08-08","USDINR AUG FUT","Buy",63.9425,63.6,64.15,64.5,"Profit of Rs 0.21/-",null,{"v":0.20750000000000313,"d":"0.21"},207.50000000000313,1000,"Successful","2017-08-10"]
[18,"2017-08-22","USDINR AUG FUT","Buy",64.1175,63.9,64.01,64.5,"Loss of Rs.0.11/-",null,{"$f":"G20-E20","v":{"v":-0.1075000000000017,"d":"-0.11"}},{"$f":"K20*M20","v":-107.5000000000017},{"v":1000,"d":"1000.00"},"Unsuccessful","2017-08-29"]
{"$rows_left_out":39}
{"sheet":"Sheet2","index":7,"n_rows":1865,"n_cols":13,"rows_kept":1865,"hidden":true}
["SYMBOL","SERIES","OPEN","HIGH","LOW","CLOSE","LAST","PREVCLOSE","TOTTRDQTY","TOTTRDVAL","TIMESTAMP","TOTALTRADES","ISIN"]
["20MICRONS","EQ",50,51,49.55,49.95,50.3,49.3,79748,4000883.85,"2018-04-05",951,"INE144J01027"]
["3IINFOTECH","EQ",5.15,5.35,5.15,5.25,5.2,5.1,7341971,38647073.2,"2018-04-05",1620,"INE748C01020"]
["3MINDIA","EQ",20459,20720,20340,20638.7,20650,20105,874,18021450,"2018-04-05",451,"INE470A01017"]
["63MOONS","EQ",88,99.9,88,97.45,97,101.05,1711018,163687132.4,"2018-04-05",17599,"INE111B01023"]
["8KMILES","EQ",698.45,706.8,691,694.45,696,689.75,143630,99977911.25,"2018-04-05",4011,"INE650K01021"]
["A2ZINFRA","EQ",29,29.35,28.5,28.75,28.7,27.9,594444,17108913.9,"2018-04-05",2056,"INE619I01012"]
["AARTIDRUGS","EQ",544,565,544,563.1,565,543.8,5162,2883638.2,"2018-04-05",494,"INE767A01016"]
["AARTIIND","EQ",1160,1192.95,1155,1186.6,1185.7,1154.6,50692,59416976.85,"2018-04-05",4900,"INE769A01020"]
["AARVEEDEN","EQ",45.8,45.9,44.75,45.15,45.55,44.2,6747,306138.2,"2018-04-05",52,"INE273D01019"]
["ABAN","EQ",162.9,163.4,160.8,162.15,162.3,159.65,483386,78297429.7,"2018-04-05",6090,"INE421A01028"]
["ABB","EQ",1295,1300,1275,1278.6,1275,1271.35,100475,129186828,"2018-04-05",3531,"INE117A01022"]
["ABBOTINDIA","EQ",5600,5748,5600,5712.85,5721,5624.5,813,4643955.05,"2018-04-05",288,"INE358A01014"]
["ABCAPITAL","EQ",154,157.5,153.7,155.55,155.55,151.7,4590684,716111972,"2018-04-05",26313,"INE674K01013"]
["ABFRL","EQ",155.85,155.85,149.25,149.95,149.75,151,224163,34009025.35,"2018-04-05",2593,"INE647O01011"]
["ACC","EQ",1551.4,1559.7,1536.9,1552.35,1554.9,1530,198303,307466682.05,"2018-04-05",10546,"INE012A01025"]
["ACCELYA","EQ",1349.95,1370,1340.05,1352.95,1359,1341.9,2360,3200845.9,"2018-04-05",679,"INE793A01012"]
["ACE","EQ",176,178.7,174.3,176.3,176.75,172.55,365830,64480145.1,"2018-04-05",3774,"INE731H01025"]
["ADANIENT","EQ",133,152.95,126.25,147.85,147.8,151.45,27497507,3990980317.8,"2018-04-05",114527,"INE423A01024"]
["ADANIPORTS","EQ",372,379.8,371.5,375.95,377,367.8,3648555,1370210901.2,"2018-04-05",41802,"INE742F01042"]
{"$rows_left_out":1845}