{"text_format":"3","workbook":"xlsx","n_sheets":10,"sheets":["Main","Future Intra","Cash Intra","MidCap Intra","Bulk Deals","Call Tracker (Equity & F&O)","Call Tracker (Currency)","Sheet2","Sheet1","Sheet3"],"not_rendered":{"images":4,"defined_names":4},"read":"whole","date_system":"1900"}

{"sheet":"Main","index":0,"n_rows":17,"n_cols":4,"rows_kept":17}
[null,"                                                                                                 "]
{"$rows_empty":8}
[null,"2018-07-05"]
[]
[null,"Sheet No.","Template Name","Summary"]
[null,1,"Future Intra","For Intraday trading in F&O segment"]
[null,2,"Cash Intra","For Intraday trading in cash market segment"]
[null,3,"Mid-cap Intra","For Intraday trading in Mid-cap stocks"]
[null,4,"Bulk Deals","Reveals Bulk Deals carried on NSE & BSE"]
[null,5,"Call Tracker"]

{"sheet":"Future Intra","index":1,"n_rows":250,"n_cols":15,"rows_kept":250,"merged":[[8,0,9,0],[8,1,9,1],[8,2,9,2],[8,5,8,7],[8,8,8,10]]}
[]
[]
[]
[]
[{"$nulls":12},"Back to Main Page"]
["FOR INTRA DAY TRADING",{"$nulls":10},{"$f":"Main!B10","v":"2018-07-05"}]
[]
[]
["Sr.no","Sector","Scrip","CLOSE RATE","Pivot Point","Supports",null,null,"Resistances"]
[null,"Sector",null,"Point","Point","S1","S2","S3","R1","R2","R3","HIGH","LOW","OI","% Change in OI"]
[1,"Index","BANKNIFTY",{"v":26437.5,"d":"26437.50"},{"v":26341.833333333332,"d":"26341.83"},{"v":26216.666666666664,"d":"26216.67"},{"v":25995.833333333332,"d":"25995.83"},{"v":25870.666666666664,"d":"25870.67"},{"v":26562.666666666664,"d":"26562.67"},{"v":26687.83333333333,"d":"26687.83"},{"v":26908.666666666664,"d":"26908.67"},26467,26121,2286640,{"v":0.05729821705999852,"d":"5.73%"}]
[2,"Index","NIFTY",10771.35,10739.75,{"v":10702.6,"d":"10702.60"},10633.85,{"v":10596.7,"d":"10596.70"},{"v":10808.5,"d":"10808.50"},{"v":10845.650000000001,"d":"10845.65"},{"v":10914.4,"d":"10914.40"},10776.9,10671,21829650,{"v":0.0445658259284248,"d":"4.46%"}]
[3,"Index","NIFTYCPSE",2439.95,{"v":813.3166666666666,"d":"813.32"},{"v":1626.6333333333332,"d":"1626.63"},{"v":813.3166666666666,"d":"813.32"},{"v":1626.6333333333332,"d":"1626.63"},{"v":1626.6333333333332,"d":"1626.63"},{"v":813.3166666666666,"d":"813.32"},{"v":1626.6333333333332,"d":"1626.63"},0,0,0,{"v":0,"d":"0.00%"}]
[4,"Index","NIFTYINFRA",3500.75,{"v":1166.9166666666667,"d":"1166.92"},{"v":2333.8333333333335,"d":"2333.83"},{"v":1166.9166666666667,"d":"1166.92"},{"v":2333.8333333333335,"d":"2333.83"},{"v":2333.8333333333335,"d":"2333.83"},{"v":1166.9166666666667,"d":"1166.92"},{"v":2333.8333333333335,"d":"2333.83"},0,0,0,{"v":0,"d":"0.00%"}]
[5,"Index","NIFTYIT",{"v":14129,"d":"14129.00"},{"v":14139.333333333334,"d":"14139.33"},{"v":14087.666666666668,"d":"14087.67"},{"v":14046.333333333334,"d":"14046.33"},{"v":13994.666666666668,"d":"13994.67"},{"v":14180.666666666668,"d":"14180.67"},{"v":14232.333333333336,"d":"14232.33"},{"v":14273.666666666668,"d":"14273.67"},14191,14098,40700,{"v":-0.023980815347721823,"d":"-2.40%"}]
[6,"Index","NIFTYMID50",{"v":4850,"d":"4850.00"},{"v":4836.666666666667,"d":"4836.67"},{"v":4823.333333333334,"d":"4823.33"},{"v":4796.666666666667,"d":"4796.67"},{"v":4783.333333333334,"d":"4783.33"},{"v":4863.333333333334,"d":"4863.33"},{"v":4876.666666666668,"d":"4876.67"},{"v":4903.333333333334,"d":"4903.33"},4850,4810,591690,{"v":0,"d":"0.00%"}]
[7,"Index","NIFTYPSE",3893.55,{"v":1297.8500000000001,"d":"1297.85"},{"v":2595.7000000000003,"d":"2595.70"},{"v":1297.8500000000001,"d":"1297.85"},{"v":2595.7000000000003,"d":"2595.70"},{"v":2595.7000000000003,"d":"2595.70"},{"v":1297.8500000000001,"d":"1297.85"},{"v":2595.7000000000003,"d":"2595.70"},0,0,0,{"v":0,"d":"0.00%"}]
[8,"Cement","ACC",1350.45,{"v":1344.8166666666666,"d":"1344.82"},{"v":1334.3333333333333,"d":"1334.33"},{"v":1318.2166666666667,"d":"1318.22"},{"v":1307.7333333333333,"d":"1307.73"},{"v":1360.9333333333332,"d":"1360.93"},{"v":1371.4166666666667,"d":"1371.42"},{"v":1387.533333333333,"d":"1387.53"},1355.3,1328.7,1942800,{"v":-0.019382192610539067,"d":"-1.94%"}]
[9,"Others","ADANIENT",106.95,{"v":106.11666666666667,"d":"106.12"},{"v":103.98333333333335,"d":"103.98"},{"v":101.01666666666668,"d":"101.02"},{"v":98.88333333333335,"d":"98.88"},{"v":109.08333333333334,"d":"109.08"},{"v":111.21666666666667,"d":"111.22"},{"v":114.18333333333334,"d":"114.18"},108.25,103.15,15500000,{"v":-0.012738853503184714,"d":"-1.27%"}]
[10,"Others","ADANIPORTS",{"v":361.8,"d":"361.80"},{"v":361.3333333333333,"d":"361.33"},{"v":357.71666666666664,"d":"357.72"},{"v":353.6333333333333,"d":"353.63"},{"v":350.01666666666665,"d":"350.02"},{"v":365.41666666666663,"d":"365.42"},{"v":369.0333333333333,"d":"369.03"},{"v":373.1166666666666,"d":"373.12"},364.95,357.25,8375000,{"v":0.03203943314849045,"d":"3.20%"}]
{"$rows_left_out":224}
{"sheet":"Cash Intra","index":2,"n_rows":248,"n_cols":13,"rows_kept":248,"merged":[[7,0,8,0],[7,1,8,1],[7,2,8,2],[7,3,8,3],[7,4,7,6],[7,7,7,9]]}
[]
[]
[]
[]
[{"$nulls":12},"Back to Main Page"]
["FOR INTRA DAY TRADING",{"$nulls":9},{"$f":"Main!B10","v":"2018-07-05"}]
[]
["Sr.no","Scrip","CLOSE RATE","Pivot Point","Supports",null,null,"Resistances"]
[null,null,"Point",null,"S1","S2","S3","R1","R2","R3","HIGH","LOW","Total Trade Quanity in Lakhs"]
[1,"Nifty 50",10769.9,{"v":10741.6,"d":"10741.60"},{"v":10706.050000000001,"d":"10706.05"},{"v":10642.2,"d":"10642.20"},{"v":10606.650000000001,"d":"10606.65"},10805.45,{"v":10841,"d":"10841.00"},10904.85,10777.15,10677.75]
[2,"Nifty Bank",26433.95,{"v":26349.11666666667,"d":"26349.12"},{"v":26217.733333333337,"d":"26217.73"},{"v":26001.51666666667,"d":"26001.52"},{"v":25870.13333333334,"d":"25870.13"},{"v":26565.333333333336,"d":"26565.33"},{"v":26696.716666666667,"d":"26696.72"},{"v":26912.933333333334,"d":"26912.93"},26480.5,26132.9]
[3,"Nifty CPSE",2205.8,{"v":2202.2666666666664,"d":"2202.27"},{"v":2194.183333333333,"d":"2194.18"},{"v":2182.5666666666666,"d":"2182.57"},{"v":2174.483333333333,"d":"2174.48"},{"v":2213.8833333333328,"d":"2213.88"},{"v":2221.9666666666667,"d":"2221.97"},{"v":2233.5833333333326,"d":"2233.58"},2210.35,2190.65]
[4,"Nifty Infra",3060.6,3059.35,3047.35,{"v":3034.1,"d":"3034.10"},{"v":3022.1,"d":"3022.10"},{"v":3072.6,"d":"3072.60"},{"v":3084.6,"d":"3084.60"},3097.85,3071.35,3046.1]
[5,"Nifty IT",14126.15,{"v":14156.449999999999,"d":"14156.45"},{"v":14068.949999999997,"d":"14068.95"},{"v":14011.749999999998,"d":"14011.75"},{"v":13924.249999999996,"d":"13924.25"},{"v":14213.649999999998,"d":"14213.65"},{"v":14301.150000000001,"d":"14301.15"},{"v":14358.349999999999,"d":"14358.35"},14243.95,14099.25]
[6,"Nifty PSE",3465.05,{"v":3473.9833333333336,"d":"3473.98"},{"v":3451.2666666666673,"d":"3451.27"},{"v":3437.4833333333336,"d":"3437.48"},{"v":3414.7666666666673,"d":"3414.77"},{"v":3487.7666666666673,"d":"3487.77"},{"v":3510.4833333333336,"d":"3510.48"},{"v":3524.2666666666673,"d":"3524.27"},3496.7,3460.2]
[7,"Nifty Midcap 50",4899.05,{"v":4888.066666666667,"d":"4888.07"},{"v":4871.333333333333,"d":"4871.33"},{"v":4843.616666666667,"d":"4843.62"},{"v":4826.883333333333,"d":"4826.88"},{"v":4915.783333333333,"d":"4915.78"},{"v":4932.516666666666,"d":"4932.52"},{"v":4960.233333333333,"d":"4960.23"},4904.8,4860.35]
[8,"ABB",1179.35,{"v":1180.0833333333333,"d":"1180.08"},{"v":1170.3166666666666,"d":"1170.32"},{"v":1161.2833333333333,"d":"1161.28"},{"v":1151.5166666666667,"d":"1151.52"},{"v":1189.1166666666666,"d":"1189.12"},{"v":1198.8833333333334,"d":"1198.88"},{"v":1207.9166666666665,"d":"1207.92"},1189.85,1171.05,0.20762]
[9,"ACC",1350.85,{"v":1347.3666666666666,"d":"1347.37"},{"v":1335.2333333333331,"d":"1335.23"},{"v":1319.6166666666666,"d":"1319.62"},{"v":1307.4833333333331,"d":"1307.48"},{"v":1362.9833333333331,"d":"1362.98"},{"v":1375.1166666666668,"d":"1375.12"},{"v":1390.7333333333331,"d":"1390.73"},1359.5,1331.75,3.89155]
[10,"AIAENG",1549.45,{"v":1536.3333333333333,"d":"1536.33"},{"v":1502.6666666666665,"d":"1502.67"},{"v":1455.8833333333332,"d":"1455.88"},{"v":1422.2166666666665,"d":"1422.22"},{"v":1583.1166666666666,"d":"1583.12"},{"v":1616.783333333333,"d":"1616.78"},{"v":1663.5666666666666,"d":"1663.57"},1570,1489.55,1.34255]
[11,"AUBANK",680.2,{"v":679.1,"d":"679.10"},{"v":665.1,"d":"665.10"},{"v":650,"d":"650.00"},{"v":636,"d":"636.00"},{"v":694.2,"d":"694.20"},{"v":708.2,"d":"708.20"},{"v":723.3000000000001,"d":"723.30"},693.1,664,0.7688]
{"$rows_left_out":229}
{"sheet":"MidCap Intra","index":3,"n_rows":511,"n_cols":13,"rows_kept":511,"merged":[[0,0,0,1],[8,0,9,0],[8,1,9,1],[8,2,9,2],[8,3,9,3],[8,4,8,6],[8,7,8,9]]}
[]
[]
[]
[]
[{"$nulls":11},"Back To Main Page"]
["FOR INTRA DAY TRADING",{"$nulls":9},{"$f":"Main!B10","v":"2018-07-05"}]
[null,null," "]
[]
["Sr.no","Scrip","CLOSE RATE","Pivot Point","Supports",null,null,"Resistances"]
[null,null,"Point",null,"S1","S2","S3","R1","R2","R3","HIGH","LOW","Total Trade Quanity in Lakhs"]
[1,"3MINDIA",19561.25,{"v":19585.899999999998,"d":"19585.90"},{"v":19421.849999999995,"d":"19421.85"},{"v":19282.449999999997,"d":"19282.45"},{"v":19118.399999999994,"d":"19118.40"},{"v":19725.299999999996,"d":"19725.30"},19889.35,{"v":20028.749999999996,"d":"20028.75"},19749.95,19446.5,0.00446]
[2,"8KMILES",348,{"v":337.8,"d":"337.80"},{"v":327.6,"d":"327.60"},{"v":307.2,"d":"307.20"},{"v":297,"d":"297.00"},{"v":358.20000000000005,"d":"358.20"},{"v":368.4,"d":"368.40"},{"v":388.80000000000007,"d":"388.80"},348,317.4,28.60435]
[3,"AARTIIND",1198.7,{"v":1203.5666666666666,"d":"1203.57"},{"v":1185.1333333333332,"d":"1185.13"},{"v":1171.5666666666666,"d":"1171.57"},{"v":1153.1333333333332,"d":"1153.13"},{"v":1217.1333333333332,"d":"1217.13"},{"v":1235.5666666666666,"d":"1235.57"},{"v":1249.1333333333332,"d":"1249.13"},1222,1190,0.16236]
[4,"ABAN",113.75,{"v":113.39999999999999,"d":"113.40"},{"v":111.54999999999998,"d":"111.55"},109.35,{"v":107.49999999999999,"d":"107.50"},{"v":115.59999999999998,"d":"115.60"},{"v":117.44999999999997,"d":"117.45"},{"v":119.64999999999998,"d":"119.65"},115.25,111.2,8.44093]
[5,"ABB",1179.35,{"v":1180.0833333333333,"d":"1180.08"},{"v":1170.3166666666666,"d":"1170.32"},{"v":1161.2833333333333,"d":"1161.28"},{"v":1151.5166666666667,"d":"1151.52"},{"v":1189.1166666666666,"d":"1189.12"},{"v":1198.8833333333334,"d":"1198.88"},{"v":1207.9166666666665,"d":"1207.92"},1189.85,1171.05,0.20762]
[6,"ABCAPITAL",129.05,{"v":129.01666666666668,"d":"129.02"},{"v":128.03333333333336,"d":"128.03"},{"v":127.01666666666668,"d":"127.02"},{"v":126.03333333333336,"d":"126.03"},{"v":130.03333333333336,"d":"130.03"},{"v":131.01666666666665,"d":"131.02"},{"v":132.03333333333336,"d":"132.03"},130,128,8.36873]
[7,"ABFRL",137.9,{"v":138.48333333333332,"d":"138.48"},{"v":136.46666666666664,"d":"136.47"},{"v":135.03333333333333,"d":"135.03"},{"v":133.01666666666665,"d":"133.02"},{"v":139.91666666666663,"d":"139.92"},{"v":141.93333333333334,"d":"141.93"},{"v":143.36666666666662,"d":"143.37"},140.5,137.05,1.43894]
[8,"ACC",1350.85,{"v":1347.3666666666666,"d":"1347.37"},{"v":1335.2333333333331,"d":"1335.23"},{"v":1319.6166666666666,"d":"1319.62"},{"v":1307.4833333333331,"d":"1307.48"},{"v":1362.9833333333331,"d":"1362.98"},{"v":1375.1166666666668,"d":"1375.12"},{"v":1390.7333333333331,"d":"1390.73"},1359.5,1331.75,3.89155]
[9,"ADANIPORTS",359.95,{"v":359.8,"d":"359.80"},{"v":356.1,"d":"356.10"},352.25,348.55,{"v":363.65000000000003,"d":"363.65"},{"v":367.34999999999997,"d":"367.35"},{"v":371.20000000000005,"d":"371.20"},363.5,355.95,16.16705]
[10,"ADANIPOWER",16.1,{"v":16.033333333333335,"d":"16.03"},{"v":15.76666666666667,"d":"15.77"},{"v":15.433333333333334,"d":"15.43"},{"v":15.166666666666668,"d":"15.17"},{"v":16.36666666666667,"d":"16.37"},{"v":16.633333333333336,"d":"16.63"},{"v":16.966666666666672,"d":"16.97"},16.3,15.7,87.46331]
{"$rows_left_out":492}
{"sheet":"Bulk Deals","index":4,"n_rows":45,"n_cols":8,"rows_kept":45,"merged":[[4,0,4,1],[4,2,4,3],[6,1,6,2]]}
[" "]
[]
[]
[]
[]
[{"$nulls":4},"Back To Main Page"]
["Subject :","BULK DEAL",null,{"$f":"Main!B10","v":"2018-07-05"}]
[]
["Date","Scrip code","Scrip Name","Client Name","Buy / Sell","Quantity Traded","Trade Price / Wt.Avg.trade price","Exchange  "]
["2018-07-04",539131,"CLLIMITED","NAVEEN GUPTA","SELL",{"v":20967,"d":"20,967"},19.52,"BSE"]
["2018-07-04",539131,"CLLIMITED","NAVEEN GUPTA","BUY",{"v":15000,"d":"15,000"},19.27,"BSE"]
["2018-07-04",511451,"DHARFIN","VEERAN DEEPA","BUY",{"v":29600,"d":"29,600"},5.09,"BSE"]
["2018-07-04",511451,"DHARFIN","SURESH KUMAR GOPALAN NAIR","SELL",{"v":30328,"d":"30,328"},5.09,"BSE"]
["2018-07-04",539009,"GBLIL","PUNJABI MOHAN LAXMANDAS","SELL",{"v":50000,"d":"50,000"},22.6,"BSE"]
["2018-07-04",532960,"IBVENTURES","CINNAMON CAPITAL LIMITED","SELL",{"v":13834381,"d":"13,834,381"},471,"BSE"]
["2018-07-04",532960,"IBVENTURES","JASMINE CAPITAL INVESTMENTS PTE LTD","BUY",{"v":13834381,"d":"13,834,381"},471,"BSE"]
["2018-07-04",541347,"PARVATI","JAI NARAIN CHOUKSEY","BUY",{"v":819946,"d":"819,946"},3.56,"BSE"]
["2018-07-04",541347,"PARVATI","AKRAM KHAN","SELL",{"v":680000,"d":"680,000"},3.56,"BSE"]
["2018-07-04",541347,"PARVATI","MUBARIK KHAN","SELL",{"v":702001,"d":"702,001"},3.55,"BSE"]
["2018-07-04",531454,"POLYLINK","Spark Securities Private Limited","SELL",{"v":153708,"d":"153,708"},15.3,"BSE"]
{"$rows_left_out":26}
{"sheet":"Call Tracker (Equity & F&O)","index":5,"n_rows":253,"n_cols":18,"rows_kept":253,"merged":[[40,0,41,0],[40,1,41,1],[40,9,41,9],[40,10,41,10],[40,11,41,11],[40,12,41,12],[40,13,41,13],[40,14,41,14],[45,0,46,0],[45,1,46,1],[45,8,46,8],[45,9,46,9],[45,10,46,10],[45,11,46,11],[45,12,46,12],[45,13,46,13],[45,14,46,14]]}
[]
[]
[]
[]
[{"$nulls":12},"Back To Main Page"]
["Retail Research Technical Calls & Fundamental Performance Report for the month of July -2018 "]
[{"$nulls":12},{"$f":"Main!B10","v":"2018-07-05"}]
[null,"Positional  Call"]
["Sr.no","Date",null,"Company","Rec","Rec Price","Stop Loss***","Call Closed At","Target","Remark","Profit / Loss per Share","Gain / Loss  %","Status","Closed Date","NSE Closed Price"]
[1,"2018-06-18",null,"BIOCON","Buy",624,596,644.5,"675-685","Part Profit of Rs.20.5/-",{"$f":"H10-F10","v":20.5},{"$f":"K10/F10","v":{"v":0.032852564102564104,"d":"3.29%"}},"Successful","2018-06-25",{"$nulls":3},"R"]
[2,"2018-06-21",null,"CENTURYTEX","Buy",902.5,873,864.5,"955-965","Loss of Rs.38/-",{"$f":"H11-F11","v":{"v":-38,"d":"-38.00"}},{"v":-0.042105263157894736,"d":"-4.21%"},"Unsuccessful","2018-07-02",{"$nulls":3},"R"]
[3,"2018-06-27",null,"RAMCOCEM","Buy","703-707",675,null,"760-770","Open",{"$nulls":4},{"$f":"VLOOKUP(D12,Sheet2!$A$1:M2162,6,0)","v":701.9},null,null,"R"]
[4,"2018-06-29",null,"CANBK","Buy","251-254",241,null,"270-280","Open",{"$nulls":4},{"$f":"VLOOKUP(D13,Sheet2!$A$1:M2164,6,0)","v":244.65},null,null,"H"]
[5,"2018-07-03",null,"MCDOWELL-N","Buy","655-660",620,null,"715-725","Open",{"$nulls":4},{"$f":"VLOOKUP(D14,Sheet2!$A$1:M2165,6,0)","v":666.9},null,null,"R"]
[6,"2018-07-03",null,"NILKAMAL","Buy",1575,1498,1665,"1720-1740","Part Profit of Rs.90/-",{"$f":"H15-F15","v":90},{"$f":"K15/F15","v":{"v":0.05714285714285714,"d":"5.71%"}},"Successful","2018-07-04",{"$nulls":3},"R"]
[7,"2018-07-03",null,"ZEEL","Buy","537-541",518,null,"580-590","Open",{"$nulls":4},{"$f":"VLOOKUP(D16,Sheet2!$A$1:M2167,6,0)","v":542.2},null,null,"H"]
[]
[]
[]
["CLBS = Closing Basis ***",{"$nulls":4},"Reinitiated $"]
{"$rows_left_out":203}
{"sheet":"Call Tracker (Currency)","index":6,"n_rows":58,"n_cols":18,"rows_kept":58,"hidden":true,"merged":[[1,8,1,9],[2,8,2,9],[3,8,3,9],[4,8,4,9],[5,8,5,9],[6,8,6,9],[7,8,7,9],[8,8,8,9],[9,8,9,9],[10,8,10,9],[11,8,11,9],[12,8,12,9],[13,8,13,9],[14,8,14,9],[15,8,15,9],[16,8,16,9],[17,8,17,9],[18,8,18,9],[19,8,19,9],[20,8,20,9],[21,8,21,9],[22,8,22,9],[23,8,23,9],[24,8,24,9],[25,8,25,9],[26,8,26,9],[27,8,27,9],[28,8,28,9],[29,8,29,9],[30,8,30,9],[31,8,31,9],[32,8,32,9],[33,8,33,9],[34,8,34,9],[35,8,35,9],[36,8,36,9],[37,8,37,9],[38,8,38,9],[39,8,39,9],[40,8,40,9],[41,8,41,9],[42,8,42,9],[43,8,43,9],[44,8,44,9],[45,8,45,9],[46,8,46,9],[47,8,47,9],[48,8,48,9],[49,8,49,9],[50,8,50,9],[51,8,51,9],[52,8,52,9],[53,8,53,9],[54,8,54,9],[55,8,55,9],[56,8,56,9],[57,8,57,9],[58,8,58,9],[59,8,59,9],[60,8,60,9],[61,8,61,9],[62,8,62,9],[63,8,63,9],[64,8,64,9],[65,8,65,9],[66,8,66,9],[67,8,67,9],[68,8,68,9],[69,8,69,9],[70,8,70,9],[71,8,71,9],[72,8,72,9],[73,8,73,9],[74,8,74,9],[75,8,75,9],[76,8,76,9],[77,8,77,9],[78,8,78,9],[79,8,79,9],[80,8,80,9],[81,8,81,9],[82,8,82,9],[83,8,83,9],[84,8,84,9],[85,8,85,9],[86,8,86,9],[87,8,87,9],[88,8,88,9],[89,8,89,9],[90,8,90,9],[91,8,91,9],[92,8,92,9],[93,8,93,9],[94,8,94,9],[95,8,95,9],[96,8,96,9],[97,8,97,9],[98,8,98,9],[99,8,99,9],[100,8,100,9],[101,8,101,9],[102,8,102,9],[103,8,103,9],[104,8,104,9],[105,8,105,9],[106,8,106,9],[107,8,107,9],[108,8,108,9],[109,8,109,9],[110,8,110,9],[111,8,111,9],[112,8,112,9],[113,8,113,9],[114,8,114,9],[115,8,115,9],[116,8,116,9],[117,8,117,9],[118,8,118,9],[119,8,119,9],[120,8,120,9],[121,8,121,9],[122,8,122,9],[123,8,123,9],[124,8,124,9]]}
["Master Trade High Risk"]
["Sr.no","Date","Company","Rec","Rec Price","Stop Loss","Call Closed At","Target","Remark",null,"Profit / Loss per share","Gain / Loss  per Lot","Lot","Status","Closed Date"]
[1,"2017-05-08","USDINR MAY FUT","Buy",64.3935,64.29,64.66,64.59,"Profit of Rs.0.27/-",null,{"v":0.2664999999999935,"d":"0.27"},266.4999999999935,1000,"Successful","2017-05-09",null,null,"P"]
[2,"2017-05-08","USDINR JUN FUT","Buy",64.6535,64.45,64.965,65.05,"Profit of Rs 0.31/-",null,{"v":0.31150000000000944,"d":"0.31"},311.50000000000944,1000,"Successful","2017-05-09",null,null,"P"]
[3,"2017-05-09","EUROINR MAY FUT","Sell",70.65,70.8,70.07,70.4,"Profit of Rs 0.58/-",null,{"v":0.580000000000013,"d":"0.58"},580.00000000001,1000,"Successful","2017-05-12",null,null,"P"]
[4,"2017-05-09","GBPINR MAY FUT","Buy",83.774,83.37,83.37,84.77,"Loss of Rs 0.40/-",null,{"v":-0.40399999999999636,"d":"-0.40"},-403.99999999999636,1000,"Unsuccessful","2017-05-11",null,null,"P"]
[5,"2017-05-11","USDINR MAY FUT","Buy",64.6555,64.55,64.55,64.86,"Loss of Rs.0.1055/-",null,-0.10550000000000637,{"$f":"K7*M7","v":{"v":-105.50000000000637,"d":"-105.50"}},1000,"Unsuccessful","2017-05-11",null,null,"P"]
[6,"2017-05-15","USDINR MAY FUT","Buy",64.2275,64.08,64.46,64.48,"Profit of Rs 0.23/-",null,{"v":0.2324999999999875,"d":"0.23"},232.4999999999875,1000,"Successful","2017-05-18",null,null,"P"]
[7,"2017-05-19","USDINR MAY FUT","Sell",64.83,65,65,64.5,"Loss of Rs.0.17/-",null,{"v":-0.1700000000000017,"d":"-0.17"},-170.0000000000017,1000,"Unsuccessful","2017-05-19",null,null,"P"]
[8,"2017-05-23","USDINR MAY FUT","Buy",64.83,64.62,64.95,65.2,"Profit of Rs 0.12/-",null,{"v":0.12000000000000455,"d":"0.12"},120.00000000000455,1000,"Successful","2017-05-24",null,null,"P"]
[9,"2017-05-25","USDINR MAY FUT","Buy",64.57,64.25,64.56,65,"Loss of Rs.0.01/-",null,-0.009999999999990905,-9.999999999990905,1000,"Neutral","2017-05-29",null,null,"P"]
[10,"2017-05-30","USDINR JUN FUT","Buy",64.9125,64.71,64.71,65.31,"Loss of Rs.0.20/-",null,{"v":-0.20250000000000057,"d":"-0.20"},-202.50000000000057,1000,"Unsuccessful","2017-05-31",null,null,"P"]
[11,"2017-06-01","USDINR JUN FUT","Buy",64.655,64.45,64.45,65.05,"Loss of Rs.0.20/-",null,{"$f":"G13-E13","v":{"v":-0.2049999999999983,"d":"-0.20"}},{"$f":"K13*M13","v":-204.9999999999983},{"v":1000,"d":"1000.00"},"Unsuccessful","2017-06-08",null,null,"P"]
[12,"2017-06-12","USDINR JUN FUT","Buy",64.45,64,64.7625,65.2,"Profit of Rs 0.31/-",null,{"v":0.3125,"d":"0.31"},312.5,1000,"Successful","2017-06-16"]
[13,"2017-06-16","USDINR JUN FUT","Buy",64.51,64.2,64.7,65.11,"Profit of Rs 0.19/-",null,{"v":0.18999999999999773,"d":"0.19"},189.99999999999773,1000,"Successful","2017-06-21"]
[14,"2017-06-22","USDINR JUN FUT","Buy",64.56,64.2,64.2,65.1,"Loss of Rs.0.36/-",null,{"v":-0.35999999999999943,"d":"-0.36"},-359.99999999999943,{"v":1000,"d":"1000.00"},"Unsuccessful","2017-06-30"]
[15,"2017-07-10","USDINR JUL FUT","Buy",64.67,64.4,64.4,65.15,"Loss of Rs.0.27/-",null,{"v":-0.269999999999996,"d":"-0.27"},-269.999999999996,{"v":1000,"d":"1000.00"},"Unsuccessful","2017-07-31"]
[16,"2017-08-02","USDINR AUG FUT","Buy",64.235,63.98,63.98,64.75,"Loss of Rs.0.26/-",null,{"v":-0.25500000000000256,"d":"-0.26"},-255.00000000000256,{"v":1000,"d":"1000.00"},"Unsuccessful","2017-08-02"]
[17,"2017-08-08","USDINR AUG FUT","Buy",63.9425,63.6,64.15,64.5,"Profit of Rs 0.21/-",null,{"v":0.20750000000000313,"d":"0.21"},207.50000000000313,1000,"Successful","2017-08-10"]
[18,"2017-08-22","USDINR AUG FUT","Buy",64.1175,63.9,64.01,64.5,"Loss of Rs.0.11/-",null,{"$f":"G20-E20","v":{"v":-0.1075000000000017,"d":"-0.11"}},{"$f":"K20*M20","v":-107.5000000000017},{"v":1000,"d":"1000.00"},"Unsuccessful","2017-08-29"]
{"$rows_left_out":39}
{"sheet":"Sheet2","index":7,"n_rows":1644,"n_cols":14,"rows_kept":1644,"hidden":true}
["SYMBOL","SERIES","OPEN","HIGH","LOW","CLOSE","LAST","PREVCLOSE","TOTTRDQTY","TOTTRDVAL","TIMESTAMP","TOTALTRADES","ISIN","ISIN"]
["20MICRONS","EQ",36.85,36.85,34.95,35.55,35.4,35.8,23427,831022,"2018-07-04",328,"INE144J01027"]
["21STCENMGM","EQ",35,35.2,34.5,35.2,35.2,37.05,1504,52363.65,"2018-07-04",19,"INE253B01015"]
["3IINFOTECH","EQ",4.3,4.3,3.95,4,4.05,4.25,6770409,27582585.25,"2018-07-04",3576,"INE748C01020"]
["3MINDIA","EQ",19471,19749.95,19446.5,19561.25,19600,19553.75,446,8730645.7,"2018-07-04",170,"INE470A01017"]
["3PLAND","EQ",14.4,14.55,12.55,13.75,14.5,14,6954,99666.4,"2018-07-04",49,"INE105C01023"]
["5PAISA","EQ",307.15,316.9,299.8,301.6,301,315.55,9924,3020291.4,"2018-07-04",374,"INE618L01018"]
["63MOONS","EQ",76.8,78,75.05,75.85,75.9,76.95,152873,11687441.85,"2018-07-04",2444,"INE111B01023"]
["8KMILES","EQ",319,348,317.4,348,348,316.4,2860435,976014770.2,"2018-07-04",55697,"INE650K01021"]
["A2ZINFRA","EQ",19.8,20.25,19.6,19.75,19.75,19.85,239993,4769079.1,"2018-07-04",1000,"INE619I01012"]
["AARTIDRUGS","EQ",543,558.95,543,553.8,552.6,537.8,17179,9490584.7,"2018-07-04",1358,"INE767A01016"]
["AARTIIND","EQ",1215.65,1222,1190,1198.7,1194.3,1215.65,16236,19484301.8,"2018-07-04",1636,"INE769A01020"]
["AARVEEDEN","EQ",31,31.5,30.5,31.15,31.4,31.45,3599,111806.6,"2018-07-04",42,"INE273D01019"]
["ABAN","EQ",115.2,115.25,111.2,113.75,112.9,116.2,844093,95542859.05,"2018-07-04",9211,"INE421A01028"]
["ABB","EQ",1175.55,1189.85,1171.05,1179.35,1174.4,1173.55,20762,24501114.75,"2018-07-04",2200,"INE117A01022"]
["ABBOTINDIA","EQ",7147.75,7190,7104.8,7146.85,7150,7091.6,8039,57455318.8,"2018-07-04",1118,"INE358A01014"]
["ABCAPITAL","EQ",129.9,130,128,129.05,128.7,129.75,836873,107778672.5,"2018-07-04",14725,"INE674K01013"]
["ABFRL","EQ",138.2,140.5,137.05,137.9,138.05,139.55,143894,19916149.9,"2018-07-04",2657,"INE647O01011"]
["ACC","EQ",1334,1359.5,1331.75,1350.85,1350.9,1332.85,389155,525018886.4,"2018-07-04",13222,"INE012A01025"]
["ACCELYA","EQ",1172.9,1172.9,1159,1168,1167,1172.9,826,965184.8,"2018-07-04",68,"INE793A01012"]
{"$rows_left_out":1625}
{"sheet":"Sheet1","index":8,"n_rows":0,"n_cols":0,"rows_kept":0,"hidden":true}

{"sheet":"Sheet3","index":9,"n_rows":0,"n_cols":0,"rows_kept":0,"hidden":true}