{"text_format":"3","workbook":"xlsx","n_sheets":10,"sheets":["Main","Future Intra","Cash Intra","MidCap Intra","Bulk Deals","Call Tracker (Equity & F&O)","Call Tracker (Currency)","Sheet2","Sheet1","Sheet3"],"not_rendered":{"images":4,"defined_names":4},"read":"whole","date_system":"1900"}

{"sheet":"Main","index":0,"n_rows":17,"n_cols":4,"rows_kept":17}
[null,"                                                                                                 "]
{"$rows_empty":8}
[null,"2018-06-05"]
[]
[null,"Sheet No.","Template Name","Summary"]
[null,1,"Future Intra","For Intraday trading in F&O segment"]
[null,2,"Cash Intra","For Intraday trading in cash market segment"]
[null,3,"Mid-cap Intra","For Intraday trading in Mid-cap stocks"]
[null,4,"Bulk Deals","Reveals Bulk Deals carried on NSE & BSE"]
[null,5,"Call Tracker"]

{"sheet":"Future Intra","index":1,"n_rows":250,"n_cols":15,"rows_kept":250,"merged":[[8,0,9,0],[8,1,9,1],[8,2,9,2],[8,5,8,7],[8,8,8,10]]}
[]
[]
[]
[]
[{"$nulls":12},"Back to Main Page"]
["FOR INTRA DAY TRADING",{"$nulls":10},{"$f":"Main!B10","v":"2018-06-05"}]
[]
[]
["Sr.no","Sector","Scrip","CLOSE RATE","Pivot Point","Supports",null,null,"Resistances"]
[null,"Sector",null,"Point","Point","S1","S2","S3","R1","R2","R3","HIGH","LOW","OI","% Change in OI"]
[1,"Index","BANKNIFTY",{"v":26190.1,"d":"26190.10"},{"v":26408.399999999998,"d":"26408.40"},{"v":25917.799999999996,"d":"25917.80"},{"v":25645.499999999996,"d":"25645.50"},{"v":25154.899999999994,"d":"25154.90"},{"v":26680.699999999997,"d":"26680.70"},{"v":27171.299999999996,"d":"27171.30"},{"v":27443.6,"d":"27443.60"},26899,26136.1,2660720,{"v":-0.0343195609883569,"d":"-3.43%"}]
[2,"Index","NIFTY",{"v":10598.7,"d":"10598.70"},{"v":10639.516666666668,"d":"10639.52"},{"v":10546.833333333336,"d":"10546.83"},{"v":10494.966666666667,"d":"10494.97"},{"v":10402.283333333335,"d":"10402.28"},{"v":10691.383333333337,"d":"10691.38"},{"v":10784.066666666668,"d":"10784.07"},{"v":10835.933333333338,"d":"10835.93"},10732.2,10587.65,20969550,{"v":0.042389942734430926,"d":"4.24%"}]
[3,"Index","NIFTYCPSE",2463.55,{"v":821.1833333333334,"d":"821.18"},{"v":1642.3666666666668,"d":"1642.37"},{"v":821.1833333333334,"d":"821.18"},{"v":1642.3666666666668,"d":"1642.37"},{"v":1642.3666666666668,"d":"1642.37"},{"v":821.1833333333334,"d":"821.18"},{"v":1642.3666666666668,"d":"1642.37"},0,0,0,{"v":0,"d":"0.00%"}]
[4,"Index","NIFTYINFRA",{"v":3389.3,"d":"3389.30"},{"v":1129.7666666666667,"d":"1129.77"},{"v":2259.5333333333333,"d":"2259.53"},{"v":1129.7666666666667,"d":"1129.77"},{"v":2259.5333333333333,"d":"2259.53"},{"v":2259.5333333333333,"d":"2259.53"},{"v":1129.7666666666667,"d":"1129.77"},{"v":2259.5333333333333,"d":"2259.53"},0,0,0,{"v":0,"d":"0.00%"}]
[5,"Index","NIFTYIT",{"v":13517,"d":"13517.00"},{"v":13525.333333333334,"d":"13525.33"},{"v":13456.666666666668,"d":"13456.67"},{"v":13396.333333333334,"d":"13396.33"},{"v":13327.666666666668,"d":"13327.67"},{"v":13585.666666666668,"d":"13585.67"},{"v":13654.333333333336,"d":"13654.33"},{"v":13714.666666666668,"d":"13714.67"},13594,13465,47400,{"v":0.05921787709497207,"d":"5.92%"}]
[6,"Index","NIFTYMID50",5065.85,{"v":1688.6166666666668,"d":"1688.62"},{"v":3377.2333333333336,"d":"3377.23"},{"v":1688.6166666666668,"d":"1688.62"},{"v":3377.2333333333336,"d":"3377.23"},{"v":3377.2333333333336,"d":"3377.23"},{"v":1688.6166666666668,"d":"1688.62"},{"v":3377.2333333333336,"d":"3377.23"},0,0,591400,{"v":0,"d":"0.00%"}]
[7,"Index","NIFTYPSE",{"v":3915.3,"d":"3915.30"},{"v":1305.1000000000001,"d":"1305.10"},{"v":2610.2000000000003,"d":"2610.20"},{"v":1305.1000000000001,"d":"1305.10"},{"v":2610.2000000000003,"d":"2610.20"},{"v":2610.2000000000003,"d":"2610.20"},{"v":1305.1000000000001,"d":"1305.10"},{"v":2610.2000000000003,"d":"2610.20"},0,0,0,{"v":0,"d":"0.00%"}]
[8,"Cement","ACC",{"v":1309.6,"d":"1309.60"},{"v":1323.7333333333333,"d":"1323.73"},{"v":1291.4666666666667,"d":"1291.47"},{"v":1273.3333333333333,"d":"1273.33"},{"v":1241.0666666666666,"d":"1241.07"},{"v":1341.8666666666668,"d":"1341.87"},{"v":1374.1333333333337,"d":"1374.13"},{"v":1392.2666666666669,"d":"1392.27"},1356,1305.6,3473600,{"v":-0.024927015495171793,"d":"-2.49%"}]
[9,"Others","ADANIENT",115.95,{"v":117.08333333333333,"d":"117.08"},{"v":112.46666666666665,"d":"112.47"},{"v":108.98333333333332,"d":"108.98"},{"v":104.36666666666665,"d":"104.37"},{"v":120.56666666666666,"d":"120.57"},{"v":125.18333333333334,"d":"125.18"},{"v":128.66666666666669,"d":"128.67"},121.7,113.6,13044000,{"v":0.05397543632837751,"d":"5.40%"}]
[10,"Others","ADANIPORTS",378.75,{"v":382.01666666666665,"d":"382.02"},{"v":373.4833333333333,"d":"373.48"},{"v":368.21666666666664,"d":"368.22"},{"v":359.6833333333333,"d":"359.68"},{"v":387.2833333333333,"d":"387.28"},{"v":395.8166666666666,"d":"395.82"},{"v":401.0833333333333,"d":"401.08"},390.55,376.75,11822500,{"v":0.024702058504875408,"d":"2.47%"}]
{"$rows_left_out":224}
{"sheet":"Cash Intra","index":2,"n_rows":248,"n_cols":13,"rows_kept":248,"merged":[[7,0,8,0],[7,1,8,1],[7,2,8,2],[7,3,8,3],[7,4,7,6],[7,7,7,9]]}
[]
[]
[]
[]
[{"$nulls":12},"Back to Main Page"]
["FOR INTRA DAY TRADING",{"$nulls":9},{"$f":"Main!B10","v":"2018-06-05"}]
[]
["Sr.no","Scrip","CLOSE RATE","Pivot Point","Supports",null,null,"Resistances"]
[null,null,"Point",null,"S1","S2","S3","R1","R2","R3","HIGH","LOW","Total Trade Quanity in Lakhs"]
[1,"Nifty 50",10628.5,{"v":10672.383333333333,"d":"10672.38"},{"v":10574.466666666667,"d":"10574.47"},{"v":10520.433333333334,"d":"10520.43"},{"v":10422.516666666668,"d":"10422.52"},{"v":10726.416666666666,"d":"10726.42"},{"v":10824.333333333334,"d":"10824.33"},{"v":10878.366666666665,"d":"10878.37"},10770.3,10618.35]
[2,"Nifty Bank",26257.55,{"v":26503.666666666668,"d":"26503.67"},{"v":25959.783333333336,"d":"25959.78"},{"v":25662.01666666667,"d":"25662.02"},{"v":25118.13333333334,"d":"25118.13"},{"v":26801.433333333334,"d":"26801.43"},{"v":27345.316666666666,"d":"27345.32"},{"v":27643.083333333332,"d":"27643.08"},27047.55,26205.9]
[3,"Nifty CPSE",2369.6,{"v":2380.9,"d":"2380.90"},{"v":2352.9500000000003,"d":"2352.95"},{"v":2336.3,"d":"2336.30"},{"v":2308.3500000000004,"d":"2308.35"},2397.55,{"v":2425.5,"d":"2425.50"},2442.15,2408.85,2364.25]
[4,"Nifty Infra",3258.4,{"v":3280.9,"d":"3280.90"},{"v":3232.3,"d":"3232.30"},{"v":3206.2000000000003,"d":"3206.20"},{"v":3157.6000000000004,"d":"3157.60"},{"v":3307,"d":"3307.00"},{"v":3355.5999999999995,"d":"3355.60"},{"v":3381.7,"d":"3381.70"},3329.5,3254.8]
[5,"Nifty IT",13595.1,{"v":13588.950000000003,"d":"13588.95"},{"v":13531.350000000006,"d":"13531.35"},{"v":13467.600000000004,"d":"13467.60"},{"v":13410.000000000007,"d":"13410.00"},{"v":13652.700000000004,"d":"13652.70"},{"v":13710.3,"d":"13710.30"},{"v":13774.050000000003,"d":"13774.05"},13646.55,13525.2]
[6,"Nifty PSE",3757.15,{"v":3776.9499999999994,"d":"3776.95"},{"v":3729.6499999999987,"d":"3729.65"},{"v":3702.149999999999,"d":"3702.15"},{"v":3654.8499999999985,"d":"3654.85"},{"v":3804.449999999999,"d":"3804.45"},{"v":3851.749999999999,"d":"3851.75"},{"v":3879.249999999999,"d":"3879.25"},3824.25,3749.45]
[7,"Nifty Midcap 50",4907.05,{"v":4925.433333333333,"d":"4925.43"},{"v":4874.666666666667,"d":"4874.67"},{"v":4842.283333333334,"d":"4842.28"},{"v":4791.516666666667,"d":"4791.52"},{"v":4957.816666666667,"d":"4957.82"},{"v":5008.583333333333,"d":"5008.58"},{"v":5040.966666666666,"d":"5040.97"},4976.2,4893.05]
[8,"ABB",1185.25,{"v":1191.3666666666668,"d":"1191.37"},{"v":1167.8333333333335,"d":"1167.83"},{"v":1150.4166666666667,"d":"1150.42"},{"v":1126.8833333333334,"d":"1126.88"},{"v":1208.7833333333335,"d":"1208.78"},{"v":1232.3166666666668,"d":"1232.32"},{"v":1249.7333333333336,"d":"1249.73"},1214.9,1173.95,0.57698]
[9,"ACC",1308.05,{"v":1321.6000000000001,"d":"1321.60"},{"v":1289.7000000000003,"d":"1289.70"},{"v":1271.3500000000001,"d":"1271.35"},{"v":1239.4500000000003,"d":"1239.45"},{"v":1339.9500000000003,"d":"1339.95"},{"v":1371.8500000000004,"d":"1371.85"},{"v":1390.2000000000003,"d":"1390.20"},1353.5,1303.25,5.58346]
[10,"AIAENG",1555.4,1557.25,1536.15,{"v":1516.9,"d":"1516.90"},{"v":1495.8000000000002,"d":"1495.80"},{"v":1576.5,"d":"1576.50"},{"v":1597.6,"d":"1597.60"},1616.85,1578.35,1538,0.90218]
[11,"AUBANK",699.05,696.65,{"v":693.3,"d":"693.30"},687.55,{"v":684.1999999999999,"d":"684.20"},{"v":702.4,"d":"702.40"},{"v":705.7500000000001,"d":"705.75"},{"v":711.5,"d":"711.50"},700,690.9,0.61989]
{"$rows_left_out":229}
{"sheet":"MidCap Intra","index":3,"n_rows":511,"n_cols":13,"rows_kept":511,"merged":[[0,0,0,1],[8,0,9,0],[8,1,9,1],[8,2,9,2],[8,3,9,3],[8,4,8,6],[8,7,8,9]]}
[]
[]
[]
[]
[{"$nulls":11},"Back To Main Page"]
["FOR INTRA DAY TRADING",{"$nulls":9},{"$f":"Main!B10","v":"2018-06-05"}]
[null,null," "]
[]
["Sr.no","Scrip","CLOSE RATE","Pivot Point","Supports",null,null,"Resistances"]
[null,null,"Point",null,"S1","S2","S3","R1","R2","R3","HIGH","LOW","Total Trade Quanity in Lakhs"]
[1,"3MINDIA",18814.8,{"v":19032.316666666666,"d":"19032.32"},{"v":18564.68333333333,"d":"18564.68"},{"v":18314.566666666666,"d":"18314.57"},{"v":17846.93333333333,"d":"17846.93"},{"v":19282.43333333333,"d":"19282.43"},{"v":19750.066666666662,"d":"19750.07"},{"v":20000.18333333333,"d":"20000.18"},19499.95,18782.2,0.01986]
[2,"8KMILES",535,{"v":551.4333333333333,"d":"551.43"},{"v":515.3666666666666,"d":"515.37"},{"v":495.73333333333323,"d":"495.73"},{"v":459.6666666666665,"d":"459.67"},{"v":571.0666666666666,"d":"571.07"},{"v":607.1333333333334,"d":"607.13"},{"v":626.7666666666667,"d":"626.77"},587.5,531.8,2.3656]
[3,"AARTIIND",1198.85,{"v":1209.2666666666667,"d":"1209.27"},{"v":1179.5833333333333,"d":"1179.58"},{"v":1160.3166666666666,"d":"1160.32"},{"v":1130.6333333333332,"d":"1130.63"},{"v":1228.5333333333333,"d":"1228.53"},{"v":1258.2166666666667,"d":"1258.22"},{"v":1277.4833333333333,"d":"1277.48"},1238.95,1190,0.61376]
[4,"ABAN",128.95,{"v":131.21666666666667,"d":"131.22"},{"v":125.93333333333334,"d":"125.93"},{"v":122.91666666666666,"d":"122.92"},{"v":117.63333333333333,"d":"117.63"},{"v":134.23333333333335,"d":"134.23"},{"v":139.5166666666667,"d":"139.52"},{"v":142.53333333333336,"d":"142.53"},136.5,128.2,8.75085]
[5,"ABB",1185.25,{"v":1191.3666666666668,"d":"1191.37"},{"v":1167.8333333333335,"d":"1167.83"},{"v":1150.4166666666667,"d":"1150.42"},{"v":1126.8833333333334,"d":"1126.88"},{"v":1208.7833333333335,"d":"1208.78"},{"v":1232.3166666666668,"d":"1232.32"},{"v":1249.7333333333336,"d":"1249.73"},1214.9,1173.95,0.57698]
[6,"ABCAPITAL",141.65,{"v":142.98333333333335,"d":"142.98"},{"v":140.16666666666669,"d":"140.17"},{"v":138.68333333333334,"d":"138.68"},{"v":135.86666666666667,"d":"135.87"},{"v":144.4666666666667,"d":"144.47"},{"v":147.28333333333336,"d":"147.28"},{"v":148.7666666666667,"d":"148.77"},145.8,141.5,13.14196]
[7,"ABFRL",139.8,{"v":141.53333333333333,"d":"141.53"},{"v":136.96666666666667,"d":"136.97"},{"v":134.13333333333333,"d":"134.13"},{"v":129.56666666666666,"d":"129.57"},{"v":144.36666666666667,"d":"144.37"},{"v":148.93333333333334,"d":"148.93"},{"v":151.76666666666668,"d":"151.77"},146.1,138.7,1.99572]
[8,"ACC",1308.05,{"v":1321.6000000000001,"d":"1321.60"},{"v":1289.7000000000003,"d":"1289.70"},{"v":1271.3500000000001,"d":"1271.35"},{"v":1239.4500000000003,"d":"1239.45"},{"v":1339.9500000000003,"d":"1339.95"},{"v":1371.8500000000004,"d":"1371.85"},{"v":1390.2000000000003,"d":"1390.20"},1353.5,1303.25,5.58346]
[9,"ADANIPORTS",378.55,{"v":381.18333333333334,"d":"381.18"},{"v":373.4166666666667,"d":"373.42"},{"v":368.28333333333336,"d":"368.28"},{"v":360.5166666666667,"d":"360.52"},{"v":386.31666666666666,"d":"386.32"},{"v":394.0833333333333,"d":"394.08"},{"v":399.21666666666664,"d":"399.22"},388.95,376.05,24.81566]
[10,"ADANIPOWER",18.45,{"v":18.816666666666666,"d":"18.82"},{"v":17.883333333333333,"d":"17.88"},{"v":17.316666666666666,"d":"17.32"},{"v":16.383333333333333,"d":"16.38"},{"v":19.383333333333333,"d":"19.38"},{"v":20.316666666666663,"d":"20.32"},{"v":20.883333333333333,"d":"20.88"},19.75,18.25,158.17584]
{"$rows_left_out":492}
{"sheet":"Bulk Deals","index":4,"n_rows":90,"n_cols":8,"rows_kept":90,"merged":[[4,0,4,1],[4,2,4,3],[6,1,6,2]]}
[" "]
[]
[]
[]
[]
[{"$nulls":4},"Back To Main Page"]
["Subject :","BULK DEAL",null,{"$f":"Main!B10","v":"2018-06-05"}]
[]
["Date","Scrip code","Scrip Name","Client Name","Buy / Sell","Quantity Traded","Trade Price / Wt.Avg.trade price","Exchange  "]
["2018-06-04",541152,"ADVITIYA","FAST TRACK INVESTMENT SOLUTIONS","SELL",{"v":56000,"d":"56,000"},15.3,"BSE"]
["2018-06-04",541152,"ADVITIYA","SURENDER KUMAR GOYAL","BUY",{"v":56000,"d":"56,000"},15.3,"BSE"]
["2018-06-04",541402,"AFFORDABLE","ELARA INDIA OPPORTUNITIES FUND LIMITED","SELL",{"v":88000,"d":"88,000"},92.96,"BSE"]
["2018-06-04",541402,"AFFORDABLE","MEHER AND PHEROZ PUDUMJEE FAMILY DISCRETIONARY TRUST","BUY",{"v":201600,"d":"201,600"},89.35,"BSE"]
["2018-06-04",541402,"AFFORDABLE","ANU AGA FAMILY DISCRETIONARY TRUST","BUY",{"v":201600,"d":"201,600"},91.89,"BSE"]
["2018-06-04",541402,"AFFORDABLE","ELARA INDIA OPPORTUNITIES FUND LIMITED","SELL",{"v":124800,"d":"124,800"},92.95,"BSE"]
["2018-06-04",541402,"AFFORDABLE","SHETH BROTHER","SELL",{"v":12800,"d":"12,800"},88,"BSE"]
["2018-06-04",541402,"AFFORDABLE","SHETH BROTHER","BUY",{"v":99200,"d":"99,200"},90.05,"BSE"]
["2018-06-04",539042,"AGIIL","HAVELI INDIA LTD","BUY",{"v":67824,"d":"67,824"},112.11,"BSE"]
["2018-06-04",539042,"AGIIL","B M TRADERS","SELL",{"v":25938,"d":"25,938"},112.09,"BSE"]
["2018-06-04",539042,"AGIIL","B M TRADERS","BUY",{"v":51180,"d":"51,180"},106.58,"BSE"]
{"$rows_left_out":71}
{"sheet":"Call Tracker (Equity & F&O)","index":5,"n_rows":257,"n_cols":18,"rows_kept":257}
[]
[]
[]
[]
[{"$nulls":12},"Back To Main Page"]
["Retail Research Technical Calls & Fundamental Performance Report for the month of June -2018 "]
[{"$nulls":12},{"$f":"Main!B10","v":"2018-06-05"}]
[null,"Positional  Call"]
["Sr.no","Date",null,"Company","Rec","Rec Price","Stop Loss***","Call Closed At","Target","Remark","Profit / Loss per Share","Gain / Loss  %","Status","Closed Date","NSE Closed Price"]
[1,"2018-05-04",null,"HCLTECH","Buy","920-930",890,null,"980-990","Open",{"$nulls":4},{"$f":"VLOOKUP(D10,Sheet2!$A$1:M2159,6,0)","v":900.7},null,null,"H"]
[2,"2018-05-25",null,"MARUTI","Buy",8440,8190,{"$f":"(8640+8805)/2","v":8722.5},"8850-8900"," Profit of Rs.282.5/-",{"$f":"H11-F11","v":282.5},{"$f":"K11/F11","v":{"v":0.03347156398104265,"d":"3.35%"}},"Successful","2018-06-01",{"$nulls":3},"R"]
[3,"2018-05-29",null,"CHOLAFIN","Buy",1530,1460,1582.5,"1620-1640"," Profit of Rs.52.5/-",{"$f":"H12-F12","v":52.5},{"v":0.03431372549019608,"d":"3.43%"},"Successful","2018-06-01",{"$nulls":3},"R"]
[4,"2018-05-30",null,"HEXAWARE","Sell",447,465,434.5,"415-405"," Profit of Rs.12.5/-",{"$f":"F13-H13","v":12.5},{"v":0.02796420581655481,"d":"2.80%"},"Successful","2018-06-01",{"$nulls":3},"H"]
[5,"2018-05-30",null,"VEDL","Buy",248,237,258,"268-272"," Profit of Rs.10/-",{"$f":"H14-F14","v":10},{"$f":"K14/F14","v":{"v":0.04032258064516129,"d":"4.03%"}},"Successful","2018-06-01",{"$nulls":3},"R"]
[6,"2018-06-01",null,"ZEEL","Buy","555-560",539,null,"590-600","Open",{"$nulls":4},{"$f":"VLOOKUP(D15,Sheet2!$A$1:M2164,6,0)","v":560.25},null,null,"H"]
[7,"2018-06-01",null,"UPL","Buy","700-704",668,null,"750-760","Open",{"$nulls":4},{"$f":"VLOOKUP(D16,Sheet2!$A$1:M2165,6,0)","v":686.45},null,null,"H"]
[8,"2018-06-04",null,"CROMPTON","Buy","220-222",209,null,"235-240","Open",{"$nulls":4},{"$f":"VLOOKUP(D17,Sheet2!$A$1:M2166,6,0)","v":223.85},null,null,"R"]
{"$rows_empty":15}
["CLBS = Closing Basis ***",{"$nulls":4},"Reinitiated $"]
["Dividend adjusted <>",{"$nulls":4},"Revised stoploss #"]
{"$rows_left_out":177}
{"sheet":"Call Tracker (Currency)","index":6,"n_rows":58,"n_cols":18,"rows_kept":58,"hidden":true,"merged":[[1,8,1,9],[2,8,2,9],[3,8,3,9],[4,8,4,9],[5,8,5,9],[6,8,6,9],[7,8,7,9],[8,8,8,9],[9,8,9,9],[10,8,10,9],[11,8,11,9],[12,8,12,9],[13,8,13,9],[14,8,14,9],[15,8,15,9],[16,8,16,9],[17,8,17,9],[18,8,18,9],[19,8,19,9],[20,8,20,9],[21,8,21,9],[22,8,22,9],[23,8,23,9],[24,8,24,9],[25,8,25,9],[26,8,26,9],[27,8,27,9],[28,8,28,9],[29,8,29,9],[30,8,30,9],[31,8,31,9],[32,8,32,9],[33,8,33,9],[34,8,34,9],[35,8,35,9],[36,8,36,9],[37,8,37,9],[38,8,38,9],[39,8,39,9],[40,8,40,9],[41,8,41,9],[42,8,42,9],[43,8,43,9],[44,8,44,9],[45,8,45,9],[46,8,46,9],[47,8,47,9],[48,8,48,9],[49,8,49,9],[50,8,50,9],[51,8,51,9],[52,8,52,9],[53,8,53,9],[54,8,54,9],[55,8,55,9],[56,8,56,9],[57,8,57,9],[58,8,58,9],[59,8,59,9],[60,8,60,9],[61,8,61,9],[62,8,62,9],[63,8,63,9],[64,8,64,9],[65,8,65,9],[66,8,66,9],[67,8,67,9],[68,8,68,9],[69,8,69,9],[70,8,70,9],[71,8,71,9],[72,8,72,9],[73,8,73,9],[74,8,74,9],[75,8,75,9],[76,8,76,9],[77,8,77,9],[78,8,78,9],[79,8,79,9],[80,8,80,9],[81,8,81,9],[82,8,82,9],[83,8,83,9],[84,8,84,9],[85,8,85,9],[86,8,86,9],[87,8,87,9],[88,8,88,9],[89,8,89,9],[90,8,90,9],[91,8,91,9],[92,8,92,9],[93,8,93,9],[94,8,94,9],[95,8,95,9],[96,8,96,9],[97,8,97,9],[98,8,98,9],[99,8,99,9],[100,8,100,9],[101,8,101,9],[102,8,102,9],[103,8,103,9],[104,8,104,9],[105,8,105,9],[106,8,106,9],[107,8,107,9],[108,8,108,9],[109,8,109,9],[110,8,110,9],[111,8,111,9],[112,8,112,9],[113,8,113,9],[114,8,114,9],[115,8,115,9],[116,8,116,9],[117,8,117,9],[118,8,118,9],[119,8,119,9],[120,8,120,9],[121,8,121,9],[122,8,122,9],[123,8,123,9],[124,8,124,9]]}
["Master Trade High Risk"]
["Sr.no","Date","Company","Rec","Rec Price","Stop Loss","Call Closed At","Target","Remark",null,"Profit / Loss per share","Gain / Loss  per Lot","Lot","Status","Closed Date"]
[1,"2017-05-08","USDINR MAY FUT","Buy",64.3935,64.29,64.66,64.59,"Profit of Rs.0.27/-",null,{"v":0.2664999999999935,"d":"0.27"},266.4999999999935,1000,"Successful","2017-05-09",null,null,"P"]
[2,"2017-05-08","USDINR JUN FUT","Buy",64.6535,64.45,64.965,65.05,"Profit of Rs 0.31/-",null,{"v":0.31150000000000944,"d":"0.31"},311.50000000000944,1000,"Successful","2017-05-09",null,null,"P"]
[3,"2017-05-09","EUROINR MAY FUT","Sell",70.65,70.8,70.07,70.4,"Profit of Rs 0.58/-",null,{"v":0.580000000000013,"d":"0.58"},580.00000000001,1000,"Successful","2017-05-12",null,null,"P"]
[4,"2017-05-09","GBPINR MAY FUT","Buy",83.774,83.37,83.37,84.77,"Loss of Rs 0.40/-",null,{"v":-0.40399999999999636,"d":"-0.40"},-403.99999999999636,1000,"Unsuccessful","2017-05-11",null,null,"P"]
[5,"2017-05-11","USDINR MAY FUT","Buy",64.6555,64.55,64.55,64.86,"Loss of Rs.0.1055/-",null,-0.10550000000000637,{"$f":"K7*M7","v":{"v":-105.50000000000637,"d":"-105.50"}},1000,"Unsuccessful","2017-05-11",null,null,"P"]
[6,"2017-05-15","USDINR MAY FUT","Buy",64.2275,64.08,64.46,64.48,"Profit of Rs 0.23/-",null,{"v":0.2324999999999875,"d":"0.23"},232.4999999999875,1000,"Successful","2017-05-18",null,null,"P"]
[7,"2017-05-19","USDINR MAY FUT","Sell",64.83,65,65,64.5,"Loss of Rs.0.17/-",null,{"v":-0.1700000000000017,"d":"-0.17"},-170.0000000000017,1000,"Unsuccessful","2017-05-19",null,null,"P"]
[8,"2017-05-23","USDINR MAY FUT","Buy",64.83,64.62,64.95,65.2,"Profit of Rs 0.12/-",null,{"v":0.12000000000000455,"d":"0.12"},120.00000000000455,1000,"Successful","2017-05-24",null,null,"P"]
[9,"2017-05-25","USDINR MAY FUT","Buy",64.57,64.25,64.56,65,"Loss of Rs.0.01/-",null,-0.009999999999990905,-9.999999999990905,1000,"Neutral","2017-05-29",null,null,"P"]
[10,"2017-05-30","USDINR JUN FUT","Buy",64.9125,64.71,64.71,65.31,"Loss of Rs.0.20/-",null,{"v":-0.20250000000000057,"d":"-0.20"},-202.50000000000057,1000,"Unsuccessful","2017-05-31",null,null,"P"]
[11,"2017-06-01","USDINR JUN FUT","Buy",64.655,64.45,64.45,65.05,"Loss of Rs.0.20/-",null,{"$f":"G13-E13","v":{"v":-0.2049999999999983,"d":"-0.20"}},{"$f":"K13*M13","v":-204.9999999999983},{"v":1000,"d":"1000.00"},"Unsuccessful","2017-06-08",null,null,"P"]
[12,"2017-06-12","USDINR JUN FUT","Buy",64.45,64,64.7625,65.2,"Profit of Rs 0.31/-",null,{"v":0.3125,"d":"0.31"},312.5,1000,"Successful","2017-06-16"]
[13,"2017-06-16","USDINR JUN FUT","Buy",64.51,64.2,64.7,65.11,"Profit of Rs 0.19/-",null,{"v":0.18999999999999773,"d":"0.19"},189.99999999999773,1000,"Successful","2017-06-21"]
[14,"2017-06-22","USDINR JUN FUT","Buy",64.56,64.2,64.2,65.1,"Loss of Rs.0.36/-",null,{"v":-0.35999999999999943,"d":"-0.36"},-359.99999999999943,{"v":1000,"d":"1000.00"},"Unsuccessful","2017-06-30"]
[15,"2017-07-10","USDINR JUL FUT","Buy",64.67,64.4,64.4,65.15,"Loss of Rs.0.27/-",null,{"v":-0.269999999999996,"d":"-0.27"},-269.999999999996,{"v":1000,"d":"1000.00"},"Unsuccessful","2017-07-31"]
[16,"2017-08-02","USDINR AUG FUT","Buy",64.235,63.98,63.98,64.75,"Loss of Rs.0.26/-",null,{"v":-0.25500000000000256,"d":"-0.26"},-255.00000000000256,{"v":1000,"d":"1000.00"},"Unsuccessful","2017-08-02"]
[17,"2017-08-08","USDINR AUG FUT","Buy",63.9425,63.6,64.15,64.5,"Profit of Rs 0.21/-",null,{"v":0.20750000000000313,"d":"0.21"},207.50000000000313,1000,"Successful","2017-08-10"]
[18,"2017-08-22","USDINR AUG FUT","Buy",64.1175,63.9,64.01,64.5,"Loss of Rs.0.11/-",null,{"$f":"G20-E20","v":{"v":-0.1075000000000017,"d":"-0.11"}},{"$f":"K20*M20","v":-107.5000000000017},{"v":1000,"d":"1000.00"},"Unsuccessful","2017-08-29"]
{"$rows_left_out":39}
{"sheet":"Sheet2","index":7,"n_rows":1646,"n_cols":14,"rows_kept":1646,"hidden":true}
["SYMBOL","SERIES","OPEN","HIGH","LOW","CLOSE","LAST","PREVCLOSE","TOTTRDQTY","TOTTRDVAL","TIMESTAMP","TOTALTRADES","ISIN","ISIN"]
["20MICRONS","EQ",41.8,42.45,39.3,39.55,39.35,41.3,71268,2865167.8,"2018-06-04",761,"INE144J01027"]
["21STCENMGM","EQ",37,37,37,37,37,37.75,200,7400,"2018-06-04",3,"INE253B01015"]
["3IINFOTECH","EQ",4.8,4.85,4.6,4.65,4.7,4.65,1404935,6595252.15,"2018-06-04",627,"INE748C01020"]
["3MINDIA","EQ",19499.95,19499.95,18782.2,18814.8,18800,19353.55,1986,37744825.05,"2018-06-04",474,"INE470A01017"]
["3PLAND","EQ",14.05,14.05,12.3,13.15,12.5,14.05,861,11378.85,"2018-06-04",13,"INE105C01023"]
["5PAISA","EQ",388.3,390,368.9,368.9,368.9,388.3,8114,3005762.4,"2018-06-04",232,"INE618L01018"]
["63MOONS","EQ",77,77,70.1,71.4,71.7,75.95,143750,10497352.45,"2018-06-04",2269,"INE111B01023"]
["8KMILES","EQ",584.15,587.5,531.8,535,534,581,236560,129777301.8,"2018-06-04",10155,"INE650K01021"]
["A2ZINFRA","EQ",24,24.5,23.2,23.45,23.25,23.9,412810,9814447.9,"2018-06-04",2389,"INE619I01012"]
["AARTIDRUGS","EQ",526.45,537,511,530,530,527,7628,4016145.75,"2018-06-04",518,"INE767A01016"]
["AARTIIND","EQ",1235,1238.95,1190,1198.85,1199,1227.6,61376,74098011.25,"2018-06-04",3356,"INE769A01020"]
["AARVEEDEN","EQ",37.5,37.5,33.75,33.8,33.75,36.05,15240,525073.9,"2018-06-04",183,"INE273D01019"]
["ABAN","EQ",136.05,136.5,128.2,128.95,128.6,136.05,875085,114352515.85,"2018-06-04",10659,"INE421A01028"]
["ABB","EQ",1214.9,1214.9,1173.95,1185.25,1180,1203.85,57698,68213056.85,"2018-06-04",5213,"INE117A01022"]
["ABBOTINDIA","EQ",6729,6799,6500,6521.7,6510,6664.2,2563,16858940.55,"2018-06-04",992,"INE358A01014"]
["ABCAPITAL","EQ",145.8,145.8,141.5,141.65,141.65,144.4,1314196,187142507.25,"2018-06-04",17164,"INE674K01013"]
["ABFRL","EQ",144.5,146.1,138.7,139.8,140.2,145.5,199572,28461192.75,"2018-06-04",3675,"INE647O01011"]
["ABMINTLTD","BE",21.6,21.6,21.6,21.6,21.6,21.6,214,4622.4,"2018-06-04",7,"INE251C01017"]
["ACC","EQ",1343,1353.5,1303.25,1308.05,1308,1326.7,558346,738708667.75,"2018-06-04",21895,"INE012A01025"]
{"$rows_left_out":1627}
{"sheet":"Sheet1","index":8,"n_rows":0,"n_cols":0,"rows_kept":0,"hidden":true}

{"sheet":"Sheet3","index":9,"n_rows":0,"n_cols":0,"rows_kept":0,"hidden":true}