{"text_format":"3","workbook":"xlsx","n_sheets":10,"sheets":["Main","Future Intra","Cash Intra","MidCap Intra","Bulk Deals","Call Tracker (Equity & F&O)","Sheet2","Sheet1","Sheet3","Sheet4"],"not_rendered":{"images":4,"defined_names":4},"read":"whole","date_system":"1900"}

{"sheet":"Main","index":0,"n_rows":17,"n_cols":4,"rows_kept":17}
[null,"                                                                                                 "]
{"$rows_empty":8}
[null,"2019-04-05"]
[]
[null,"Sheet No.","Template Name","Summary"]
[null,1,"Future Intra","For Intraday trading in F&O segment"]
[null,2,"Cash Intra","For Intraday trading in cash market segment"]
[null,3,"Mid-cap Intra","For Intraday trading in Mid-cap stocks"]
[null,4,"Bulk Deals","Reveals Bulk Deals carried on NSE & BSE"]
[null,5,"Call Tracker"]

{"sheet":"Future Intra","index":1,"n_rows":236,"n_cols":15,"rows_kept":236,"merged":[[8,0,9,0],[8,1,9,1],[8,2,9,2],[8,5,8,7],[8,8,8,10]]}
[]
[]
[]
[]
[{"$nulls":12},"Back to Main Page"]
["FOR INTRA DAY TRADING",{"$nulls":10},{"$f":"Main!B10","v":"2019-04-05"}]
[]
[]
["Sr.no","Sector","Scrip","CLOSE RATE","Pivot Point","Supports",null,null,"Resistances"]
[null,"Sector",null,"Point","Point","S1","S2","S3","R1","R2","R3","HIGH","LOW","OI","% Change in OI"]
[1,"Index","BANKNIFTY",{"v":30155,"d":"30155.00"},{"v":30225.966666666664,"d":"30225.97"},{"v":29957.933333333327,"d":"29957.93"},{"v":29760.866666666665,"d":"29760.87"},{"v":29492.83333333333,"d":"29492.83"},{"v":30423.033333333326,"d":"30423.03"},{"v":30691.06666666666,"d":"30691.07"},{"v":30888.133333333324,"d":"30888.13"},30494,30028.9,2036040,{"v":-0.014739898378901524,"d":"-1.47%"}]
[2,"Index","NIFTY",11679.55,{"v":11691.666666666666,"d":"11691.67"},{"v":11629.333333333332,"d":"11629.33"},{"v":11579.116666666667,"d":"11579.12"},{"v":11516.783333333333,"d":"11516.78"},{"v":11741.883333333331,"d":"11741.88"},{"v":11804.216666666664,"d":"11804.22"},{"v":11854.43333333333,"d":"11854.43"},11754,11641.45,16773075,{"v":-1.8433056316780776E-3,"d":"-0.18%"}]
[3,"Index","NIFTYIT",{"v":15870,"d":"15870.00"},{"v":15899,"d":"15899.00"},{"v":15787,"d":"15787.00"},{"v":15704,"d":"15704.00"},{"v":15592,"d":"15592.00"},{"v":15982,"d":"15982.00"},{"v":16094,"d":"16094.00"},{"v":16177,"d":"16177.00"},16011,15816,16750,{"v":0.033950617283950615,"d":"3.40%"}]
[4,"Cement","ACC",1637.95,{"v":1641.8,"d":"1641.80"},{"v":1621.1499999999999,"d":"1621.15"},1604.35,{"v":1583.6999999999998,"d":"1583.70"},{"v":1658.6,"d":"1658.60"},1679.25,1696.05,1662.45,1625,2603200,{"v":0.028607554923344398,"d":"2.86%"}]
[5,"Others","ADANIENT",148.65,{"v":148.6,"d":"148.60"},{"v":146.2,"d":"146.20"},143.75,141.35,{"v":151.04999999999998,"d":"151.05"},{"v":153.45000000000002,"d":"153.45"},{"v":155.89999999999998,"d":"155.90"},151,146.15,40200000,{"v":-0.022753792298716453,"d":"-2.28%"}]
[6,"Others","ADANIPORTS",{"v":382.3,"d":"382.30"},381.05,{"v":378.3,"d":"378.30"},{"v":374.3,"d":"374.30"},371.55,385.05,{"v":387.8,"d":"387.80"},{"v":391.8,"d":"391.80"},383.8,377.05,20912500,{"v":-0.01680771039022097,"d":"-1.68%"}]
[7,"Power","ADANIPOWER",48.45,{"v":48.76666666666667,"d":"48.77"},{"v":47.63333333333335,"d":"47.63"},{"v":46.81666666666668,"d":"46.82"},{"v":45.68333333333335,"d":"45.68"},{"v":49.58333333333334,"d":"49.58"},{"v":50.71666666666667,"d":"50.72"},{"v":51.53333333333334,"d":"51.53"},49.9,47.95,154840000,{"v":-2.5826446280991736E-4,"d":"-0.03%"}]
[8,"Pharma","AJANTPHARM",1022.35,{"v":1017.3833333333333,"d":"1017.38"},{"v":1008.9666666666667,"d":"1008.97"},{"v":995.5833333333334,"d":"995.58"},{"v":987.1666666666667,"d":"987.17"},{"v":1030.7666666666667,"d":"1030.77"},{"v":1039.1833333333334,"d":"1039.18"},{"v":1052.5666666666666,"d":"1052.57"},1025.8,1004,740000,{"v":0.010238907849829351,"d":"1.02%"}]
[9,"Banking","ALBK",{"v":52.9,"d":"52.90"},{"v":53.21666666666666,"d":"53.22"},{"v":51.98333333333332,"d":"51.98"},{"v":51.066666666666656,"d":"51.07"},{"v":49.833333333333314,"d":"49.83"},{"v":54.133333333333326,"d":"54.13"},{"v":55.36666666666666,"d":"55.37"},{"v":56.28333333333333,"d":"56.28"},54.45,52.3,26156000,{"v":2.9910269192422734E-3,"d":"0.30%"}]
[10,"Automobile","AMARAJABAT",681.35,{"v":681.5666666666667,"d":"681.57"},{"v":662.8333333333335,"d":"662.83"},{"v":644.3166666666667,"d":"644.32"},{"v":625.5833333333335,"d":"625.58"},{"v":700.0833333333335,"d":"700.08"},{"v":718.8166666666668,"d":"718.82"},{"v":737.3333333333335,"d":"737.33"},700.3,663.05,2228800,{"v":0.17751479289940827,"d":"17.75%"}]
{"$rows_left_out":207}
{"sheet":"Cash Intra","index":2,"n_rows":247,"n_cols":13,"rows_kept":247,"merged":[[7,0,8,0],[7,1,8,1],[7,2,8,2],[7,3,8,3],[7,4,7,6],[7,7,7,9]]}
[]
[]
[]
[]
[{"$nulls":12},"Back to Main Page"]
["FOR INTRA DAY TRADING",{"$nulls":9},{"$f":"Main!B10","v":"2019-04-05"}]
[]
["Sr.no","Scrip","CLOSE RATE","Pivot Point","Supports",null,null,"Resistances"]
[null,null,"Point",null,"S1","S2","S3","R1","R2","R3","HIGH","LOW","Total Trade Quanity in Lakhs"]
[1,"Nifty 50",11598,{"v":11606.583333333334,"d":"11606.58"},{"v":11550.616666666669,"d":"11550.62"},{"v":11503.233333333335,"d":"11503.23"},{"v":11447.26666666667,"d":"11447.27"},{"v":11653.966666666667,"d":"11653.97"},{"v":11709.93333333333,"d":"11709.93"},{"v":11757.316666666666,"d":"11757.32"},11662.55,11559.2]
[2,"Nifty Bank",29904.9,{"v":29986.833333333332,"d":"29986.83"},{"v":29727.966666666664,"d":"29727.97"},{"v":29551.033333333333,"d":"29551.03"},{"v":29292.166666666664,"d":"29292.17"},{"v":30163.766666666663,"d":"30163.77"},{"v":30422.63333333333,"d":"30422.63"},{"v":30599.566666666662,"d":"30599.57"},30245.7,29809.9]
[3,"Nifty CPSE",2228.7,{"v":2224.2000000000003,"d":"2224.20"},{"v":2214.6000000000004,"d":"2214.60"},{"v":2200.5,"d":"2200.50"},{"v":2190.9,"d":"2190.90"},{"v":2238.3000000000006,"d":"2238.30"},{"v":2247.9,"d":"2247.90"},{"v":2262.000000000001,"d":"2262.00"},2233.8,2210.1]
[4,"Nifty Infra",3202.15,{"v":3206.4833333333336,"d":"3206.48"},{"v":3186.1166666666672,"d":"3186.12"},{"v":3170.0833333333335,"d":"3170.08"},{"v":3149.716666666667,"d":"3149.72"},{"v":3222.5166666666673,"d":"3222.52"},{"v":3242.883333333334,"d":"3242.88"},{"v":3258.9166666666674,"d":"3258.92"},3226.85,3190.45]
[5,"Nifty IT",15744.8,15796.65,15639.15,{"v":15533.5,"d":"15533.50"},{"v":15376,"d":"15376.00"},{"v":15902.3,"d":"15902.30"},{"v":16059.8,"d":"16059.80"},{"v":16165.449999999999,"d":"16165.45"},15954.15,15691]
[6,"Nifty PSE",3517.45,{"v":3518.616666666667,"d":"3518.62"},{"v":3497.2333333333336,"d":"3497.23"},{"v":3477.016666666667,"d":"3477.02"},{"v":3455.6333333333337,"d":"3455.63"},{"v":3538.8333333333335,"d":"3538.83"},{"v":3560.2166666666667,"d":"3560.22"},{"v":3580.4333333333334,"d":"3580.43"},3540,3498.4]
[7,"Nifty Midcap 50",5026.5,5031.75,{"v":5002.2,"d":"5002.20"},{"v":4977.9,"d":"4977.90"},{"v":4948.349999999999,"d":"4948.35"},5056.05,{"v":5085.599999999999,"d":"5085.60"},{"v":5109.900000000001,"d":"5109.90"},5061.3,5007.45]
[8,"ABB",1325.45,{"v":1324.4666666666667,"d":"1324.47"},{"v":1310.9833333333333,"d":"1310.98"},{"v":1296.5166666666667,"d":"1296.52"},{"v":1283.0333333333333,"d":"1283.03"},{"v":1338.9333333333334,"d":"1338.93"},{"v":1352.416666666667,"d":"1352.42"},{"v":1366.8833333333334,"d":"1366.88"},1337.95,1310,0.40925]
[9,"ACC",1628.85,{"v":1632.5833333333333,"d":"1632.58"},{"v":1613.0166666666664,"d":"1613.02"},{"v":1597.1833333333332,"d":"1597.18"},{"v":1577.6166666666663,"d":"1577.62"},{"v":1648.4166666666665,"d":"1648.42"},{"v":1667.9833333333336,"d":"1667.98"},{"v":1683.8166666666666,"d":"1683.82"},1652.15,1616.75,12.82592]
[10,"AIAENG",1706.3,{"v":1711.2333333333333,"d":"1711.23"},{"v":1696.1166666666668,"d":"1696.12"},{"v":1685.9333333333334,"d":"1685.93"},{"v":1670.8166666666668,"d":"1670.82"},{"v":1721.4166666666667,"d":"1721.42"},{"v":1736.533333333333,"d":"1736.53"},{"v":1746.7166666666667,"d":"1746.72"},1726.35,1701.05,0.11091]
[11,"AUBANK",601.2,{"v":597.9333333333333,"d":"597.93"},{"v":588.4666666666666,"d":"588.47"},{"v":575.7333333333333,"d":"575.73"},{"v":566.2666666666667,"d":"566.27"},{"v":610.6666666666665,"d":"610.67"},{"v":620.1333333333332,"d":"620.13"},{"v":632.8666666666664,"d":"632.87"},607.4,585.2,1.47728]
{"$rows_left_out":228}
{"sheet":"MidCap Intra","index":3,"n_rows":510,"n_cols":13,"rows_kept":510,"merged":[[0,0,0,1],[8,0,9,0],[8,1,9,1],[8,2,9,2],[8,3,9,3],[8,4,8,6],[8,7,8,9]]}
[]
[]
[]
[]
[{"$nulls":11},"Back To Main Page"]
["FOR INTRA DAY TRADING",{"$nulls":9},{"$f":"Main!B10","v":"2019-04-05"}]
[null,null," "]
[]
["Sr.no","Scrip","CLOSE RATE","Pivot Point","Supports",null,null,"Resistances"]
[null,null,"Point",null,"S1","S2","S3","R1","R2","R3","HIGH","LOW","Total Trade Quanity in Lakhs"]
[1,"3MINDIA",23654.9,{"v":23831.63333333333,"d":"23831.63"},{"v":23423.266666666663,"d":"23423.27"},{"v":23191.63333333333,"d":"23191.63"},{"v":22783.266666666663,"d":"22783.27"},{"v":24063.266666666663,"d":"24063.27"},{"v":24471.63333333333,"d":"24471.63"},{"v":24703.266666666663,"d":"24703.27"},24240,23600,0.01008]
[2,"8KMILES",105.3,{"v":103.63333333333333,"d":"103.63"},{"v":101.96666666666665,"d":"101.97"},{"v":98.63333333333333,"d":"98.63"},{"v":96.96666666666665,"d":"96.97"},{"v":106.96666666666665,"d":"106.97"},{"v":108.63333333333334,"d":"108.63"},{"v":111.96666666666665,"d":"111.97"},105.3,100.3,7.79395]
[3,"AARTIIND",1586.2,{"v":1580.3999999999999,"d":"1580.40"},{"v":1570.7999999999997,"d":"1570.80"},{"v":1555.3999999999999,"d":"1555.40"},{"v":1545.7999999999997,"d":"1545.80"},{"v":1595.7999999999997,"d":"1595.80"},{"v":1605.3999999999996,"d":"1605.40"},{"v":1620.7999999999997,"d":"1620.80"},1590,1565,0.55925]
[4,"ABAN",58.9,{"v":59.20000000000001,"d":"59.20"},{"v":57.90000000000002,"d":"57.90"},{"v":56.90000000000001,"d":"56.90"},{"v":55.60000000000002,"d":"55.60"},{"v":60.20000000000002,"d":"60.20"},{"v":61.500000000000014,"d":"61.50"},{"v":62.500000000000014,"d":"62.50"},60.5,58.2,0.54358]
[5,"ABB",1325.45,{"v":1324.4666666666667,"d":"1324.47"},{"v":1310.9833333333333,"d":"1310.98"},{"v":1296.5166666666667,"d":"1296.52"},{"v":1283.0333333333333,"d":"1283.03"},{"v":1338.9333333333334,"d":"1338.93"},{"v":1352.416666666667,"d":"1352.42"},{"v":1366.8833333333334,"d":"1366.88"},1337.95,1310,0.40925]
[6,"ABCAPITAL",98.35,{"v":99.11666666666667,"d":"99.12"},{"v":97.23333333333335,"d":"97.23"},{"v":96.11666666666667,"d":"96.12"},{"v":94.23333333333335,"d":"94.23"},{"v":100.23333333333335,"d":"100.23"},{"v":102.11666666666667,"d":"102.12"},{"v":103.23333333333335,"d":"103.23"},101,98,28.77367]
[7,"ABFRL",220.05,{"v":219.88333333333333,"d":"219.88"},{"v":218.26666666666665,"d":"218.27"},{"v":216.48333333333332,"d":"216.48"},{"v":214.86666666666665,"d":"214.87"},{"v":221.66666666666666,"d":"221.67"},{"v":223.28333333333333,"d":"223.28"},{"v":225.06666666666666,"d":"225.07"},221.5,218.1,4.80266]
[8,"ACC",1628.85,{"v":1632.5833333333333,"d":"1632.58"},{"v":1613.0166666666664,"d":"1613.02"},{"v":1597.1833333333332,"d":"1597.18"},{"v":1577.6166666666663,"d":"1577.62"},{"v":1648.4166666666665,"d":"1648.42"},{"v":1667.9833333333336,"d":"1667.98"},{"v":1683.8166666666666,"d":"1683.82"},1652.15,1616.75,12.82592]
[9,"ADANIPORTS",380.2,{"v":378.98333333333335,"d":"378.98"},{"v":375.9166666666667,"d":"375.92"},{"v":371.6333333333333,"d":"371.63"},{"v":368.56666666666666,"d":"368.57"},{"v":383.2666666666667,"d":"383.27"},{"v":386.3333333333333,"d":"386.33"},{"v":390.61666666666673,"d":"390.62"},382.05,374.7,19.09852]
[10,"ADANIPOWER",47.95,{"v":48.43333333333334,"d":"48.43"},{"v":47.26666666666667,"d":"47.27"},{"v":46.583333333333336,"d":"46.58"},{"v":45.41666666666667,"d":"45.42"},{"v":49.116666666666674,"d":"49.12"},{"v":50.28333333333333,"d":"50.28"},{"v":50.966666666666676,"d":"50.97"},49.6,47.75,122.99012]
{"$rows_left_out":491}
{"sheet":"Bulk Deals","index":4,"n_rows":68,"n_cols":8,"rows_kept":68,"merged":[[4,0,4,1],[4,2,4,3],[6,1,6,2]]}
[" "]
[]
[]
[]
[]
[{"$nulls":4},"Back To Main Page"]
["Subject :","BULK DEAL",null,{"$f":"Main!B10","v":"2019-04-05"}]
[]
["Date","Scrip code","Scrip Name","Client Name","Buy / Sell","Quantity Traded","Trade Price / Wt.Avg.trade price","Exchange  "]
["2019-04-04",542012,"AAL","SUFAL INVESTMENT","BUY",{"v":100000,"d":"100,000"},59.13,"BSE"]
["2019-04-04",537766,"BCP","ACHINTYA SECURITIES PVT. LTD.","BUY",{"v":340154,"d":"340,154"},38.7,"BSE"]
["2019-04-04",537766,"BCP","ACHINTYA SECURITIES PVT. LTD.","SELL",316905,38.67,"BSE"]
["2019-04-04",539770,"DARJEELING","HIMANSHU SHAH","SELL",94620,93.51,"BSE"]
["2019-04-04",539770,"DARJEELING","BRAJA GOPAL PAL","BUY",21000,93.46,"BSE"]
["2019-04-04",539770,"DARJEELING","GOENKA BUSINESS & FINANCE LIMITED","BUY",20000,93.4,"BSE"]
["2019-04-04",539770,"DARJEELING","PURAN CHAND CHOUDHARY","BUY",40000,93.62,"BSE"]
["2019-04-04",539224,"HCKKVENTURE","HARISH VEERAPPA KANCHAN","BUY",94000,43.2,"BSE"]
["2019-04-04",539224,"HCKKVENTURE","GOLDIE ANAND","SELL",94000,43.2,"BSE"]
["2019-04-04",540750,"IEX","SIGULER GUFF NJDM INVESTMENT HOLDINGS LTD","SELL",3125000,163,"BSE"]
["2019-04-04",539225,"JIYAECO","RAHUL SHARMA","BUY",254119,61.15,"BSE"]
{"$rows_left_out":49}
{"sheet":"Call Tracker (Equity & F&O)","index":5,"n_rows":276,"n_cols":18,"rows_kept":276,"merged":[[28,0,29,0],[28,1,29,1],[28,2,29,2],[28,9,29,9],[28,11,29,11],[28,12,29,12],[28,13,29,13],[28,14,29,14],[30,0,31,0],[30,1,31,1],[30,2,31,2],[30,9,31,9],[30,11,31,11],[30,12,31,12],[30,13,31,13],[30,14,31,14],[42,0,43,0],[42,1,43,1],[42,2,43,2],[42,9,43,9],[42,11,43,11],[42,12,43,12],[42,13,43,13],[42,14,43,14]]}
[]
[]
[]
[]
[{"$nulls":12},"Back To Main Page"]
["Retail Research Technical Calls & Fundamental Performance Report for the month of April -2019 "]
[{"$nulls":12},{"$f":"Main!B10","v":"2019-04-05"}]
[null,"Positional  Call"]
["Sr.no","Date",null,"Company","Rec","Rec Price","Stop Loss***","Call Closed At","Target","Remark","Profit / Loss per Share","Gain / Loss  %","Status","Closed Date","NSE Closed Price"]
[1,"2019-03-07",null,"RAYMOND","Sell","825-830",888.8,null,"720-730","Open",{"$nulls":4},{"$f":"VLOOKUP(D10,Sheet2!A16:M1811,6,0)","v":801.2},null,null,"R"]
[2,"2019-03-13",null,"DLF","Sell",193,206.6,206.6,"164-168 ","Loss of Rs.13.6/-",{"$f":"F11-G11","v":-13.599999999999994},{"$f":"K11/F11","v":{"v":-0.07046632124352328,"d":"-7.05%"}},"Unsuccessful","2019-04-03",{"$nulls":3},"R"]
[3,"2019-03-15",null,"OFSS","Buy",3395,3250,3497,"3650-3700"," Profit of Rs.102/-",{"$f":"H12-F12","v":102},{"$f":"K12/F12","v":{"v":0.03004418262150221,"d":"3.00%"}},"Successful","2019-04-03",{"$nulls":3},"H"]
[4,"2019-03-20",null,"HEROMOTOCO","Buy","2610-2630",2490,null,"2850-2900","Open",{"$nulls":4},{"$f":"VLOOKUP(D13,Sheet2!A19:M1814,6,0)","v":2637.2},null,null,"H"]
[5,"2019-03-25",null,"MARUTI","Buy",6600,6290,6940,"7000-7100"," Profit of Rs.340/-",{"$f":"H14-F14","v":340},{"$f":"K14/F14","v":{"v":0.051515151515151514,"d":"5.15%"}},"Successful","2019-04-03",{"$nulls":3},"R"]
[6,"2019-04-01",null,"WIPRO","Buy","257-259",248,null,280,"Open",{"$nulls":4},{"$f":"VLOOKUP(D15,Sheet2!A21:M1816,6,0)","v":259.05},null,null,"H"]
[7,"2019-04-03",null,"BOSCHLTD","Buy","17950-18000",16850,null,"19500-20000","Open",{"$nulls":4},{"$f":"VLOOKUP(D16,Sheet2!A22:M1817,6,0)","v":17832.3},null,null,"R"]
[]
[]
[]
[]
{"$rows_left_out":234}
{"sheet":"Sheet2","index":6,"n_rows":1641,"n_cols":14,"rows_kept":1641,"hidden":true}
["SYMBOL","SERIES","OPEN","HIGH","LOW","CLOSE","LAST","PREVCLOSE","TOTTRDQTY","TOTTRDVAL","TIMESTAMP","TOTALTRADES","ISIN","ISIN"]
["20MICRONS","EQ",39.95,39.95,38.25,38.5,38.5,39.2,9764,377631.2,"2019-04-04",172,"INE144J01027"]
["21STCENMGM","EQ",20.7,20.7,20.7,20.7,20.7,20.3,1090,22563,"2019-04-04",8,"INE253B01015"]
["3IINFOTECH","EQ",3.7,3.75,3.65,3.7,3.7,3.7,774268,2866577.75,"2019-04-04",1007,"INE748C01020"]
["3MINDIA","EQ",23760.5,24240,23600,23654.9,23800,23983.5,1008,23946898.55,"2019-04-04",555,"INE470A01017"]
["3PLAND","EQ",10.7,11.6,10.7,11.55,11.55,11.1,229,2650.9,"2019-04-04",8,"INE105C01023"]
["5PAISA","EQ",230.1,233.85,229.85,230.25,229.85,233.1,1678,387638.65,"2019-04-04",100,"INE618L01018"]
["63MOONS","EQ",81.15,81.3,79.9,80.35,80.4,80.8,74702,6025484.9,"2019-04-04",1121,"INE111B01023"]
["8KMILES","EQ",102.3,105.3,100.3,105.3,105.3,100.3,779395,81661052.7,"2019-04-04",4845,"INE650K01021"]
["A2ZINFRA","EQ",17.5,17.55,17,17.3,17.5,17.25,708142,12221077.85,"2019-04-04",354,"INE619I01012"]
["AARTIDRUGS","EQ",626,628.95,616,621.5,625.5,621.5,9766,6051124.6,"2019-04-04",470,"INE767A01016"]
["AARTIIND","EQ",1579.6,1590,1565,1586.2,1581,1579.6,55925,88122047.2,"2019-04-04",5978,"INE769A01020"]
["AARVEEDEN","EQ",23.45,23.8,23.05,23.15,23.15,23.45,679,15728.15,"2019-04-04",39,"INE273D01019"]
["AAVAS","EQ",1159.6,1170,1144,1146.3,1145,1159.6,7949,9197366.4,"2019-04-04",1305,"INE216P01012"]
["ABAN","BE",59.5,60.5,58.2,58.9,58.95,58.45,54358,3228928.25,"2019-04-04",554,"INE421A01028"]
["ABB","EQ",1335,1337.95,1310,1325.45,1326,1332.15,40925,54136417.05,"2019-04-04",3048,"INE117A01022"]
["ABBOTINDIA","EQ",7321.25,7330,7236.05,7260.4,7245,7329,3341,24318020.25,"2019-04-04",612,"INE358A01014"]
["ABCAPITAL","EQ",100.65,101,98,98.35,98.45,100.3,2877367,284759241.25,"2019-04-04",20418,"INE674K01013"]
["ABFRL","EQ",219.7,221.5,218.1,220.05,220,219.7,480266,105563244.8,"2019-04-04",10063,"INE647O01011"]
["ABSLNN50ET","EQ",335,335,303,310,310,314.1,33,10704.2,"2019-04-04",10,"INF209KB1B87"]
{"$rows_left_out":1622}
{"sheet":"Sheet1","index":7,"n_rows":0,"n_cols":0,"rows_kept":0,"hidden":true}

{"sheet":"Sheet3","index":8,"n_rows":0,"n_cols":0,"rows_kept":0,"hidden":true}

{"sheet":"Sheet4","index":9,"n_rows":0,"n_cols":0,"rows_kept":0,"hidden":true}