{"text_format":"3","workbook":"xlsx","n_sheets":8,"sheets":["Main","Future Intra","Cash Intra","MidCap Intra","Bulk Deals","Call Tracker (Equity & F&O)","Call Tracker (Currency)","Sheet2"],"not_rendered":{"images":4,"defined_names":4},"read":"whole","date_system":"1900"}

{"sheet":"Main","index":0,"n_rows":17,"n_cols":4,"rows_kept":17}
[null,"                                                                                                 "]
{"$rows_empty":8}
[null,"2018-04-05"]
[]
[null,"Sheet No.","Template Name","Summary"]
[null,1,"Future Intra","For Intraday trading in F&O segment"]
[null,2,"Cash Intra","For Intraday trading in cash market segment"]
[null,3,"Mid-cap Intra","For Intraday trading in Mid-cap stocks"]
[null,4,"Bulk Deals","Reveals Bulk Deals carried on NSE & BSE"]
[null,5,"Call Tracker"]

{"sheet":"Future Intra","index":1,"n_rows":251,"n_cols":15,"rows_kept":251,"merged":[[8,0,9,0],[8,1,9,1],[8,2,9,2],[8,5,8,7],[8,8,8,10]]}
[]
[]
[]
[]
[{"$nulls":12},"Back to Main Page"]
["FOR INTRA DAY TRADING",{"$nulls":10},{"$f":"Main!B10","v":"2018-04-05"}]
[]
[]
["Sr.no","Sector","Scrip","CLOSE RATE","Pivot Point","Supports",null,null,"Resistances"]
[null,"Sector",null,"Point","Point","S1","S2","S3","R1","R2","R3","HIGH","LOW","OI","% Change in OI"]
[1,"Index","BANKNIFTY",{"v":24148.6,"d":"24148.60"},{"v":24321.11666666667,"d":"24321.12"},{"v":23943.233333333337,"d":"23943.23"},{"v":23737.86666666667,"d":"23737.87"},{"v":23359.983333333337,"d":"23359.98"},{"v":24526.483333333337,"d":"24526.48"},{"v":24904.36666666667,"d":"24904.37"},{"v":25109.733333333337,"d":"25109.73"},24699,24115.75,1920920,{"v":0.15094068304373875,"d":"15.09%"}]
[2,"Index","NIFTY",{"v":10146.6,"d":"10146.60"},{"v":10190.533333333333,"d":"10190.53"},{"v":10077.066666666666,"d":"10077.07"},{"v":10007.533333333333,"d":"10007.53"},{"v":9894.066666666666,"d":"9894.07"},{"v":10260.066666666666,"d":"10260.07"},{"v":10373.533333333333,"d":"10373.53"},{"v":10443.066666666666,"d":"10443.07"},10304,10121,23531625,{"v":0.12210448012073831,"d":"12.21%"}]
[3,"Index","NIFTYCPSE",2827.05,942.35,{"v":1884.7,"d":"1884.70"},942.35,{"v":1884.7,"d":"1884.70"},{"v":1884.7,"d":"1884.70"},942.35,{"v":1884.7,"d":"1884.70"},0,0,0,{"v":0,"d":"0.00%"}]
[4,"Index","NIFTYINFRA",{"v":3716.6,"d":"3716.60"},{"v":1238.8666666666666,"d":"1238.87"},{"v":2477.733333333333,"d":"2477.73"},{"v":1238.8666666666666,"d":"1238.87"},{"v":2477.733333333333,"d":"2477.73"},{"v":2477.733333333333,"d":"2477.73"},{"v":1238.8666666666666,"d":"1238.87"},{"v":2477.733333333333,"d":"2477.73"},0,0,0,{"v":0,"d":"0.00%"}]
[5,"Index","NIFTYIT",{"v":12528,"d":"12528.00"},{"v":12590.333333333334,"d":"12590.33"},{"v":12420.666666666668,"d":"12420.67"},{"v":12313.333333333334,"d":"12313.33"},{"v":12143.666666666668,"d":"12143.67"},{"v":12697.666666666668,"d":"12697.67"},{"v":12867.333333333336,"d":"12867.33"},{"v":12974.666666666668,"d":"12974.67"},12760,12483,43300,{"v":0.5354609929078015,"d":"53.55%"}]
{"$rows_left_out":230}
{"sheet":"Cash Intra","index":2,"n_rows":251,"n_cols":13,"rows_kept":251,"merged":[[7,0,8,0],[7,1,8,1],[7,2,8,2],[7,3,8,3],[7,4,7,6],[7,7,7,9]]}
[]
[]
[]
[]
[{"$nulls":12},"Back to Main Page"]
["FOR INTRA DAY TRADING",{"$nulls":9},{"$f":"Main!B10","v":"2018-04-05"}]
[]
["Sr.no","Scrip","CLOSE RATE","Pivot Point","Supports",null,null,"Resistances"]
[null,null,"Point",null,"S1","S2","S3","R1","R2","R3","HIGH","LOW","Total Trade Quanity in Lakhs"]
[1,"Nifty 50",10128.4,{"v":10173.183333333332,"d":"10173.18"},{"v":10066.516666666665,"d":"10066.52"},{"v":10004.633333333331,"d":"10004.63"},{"v":9897.966666666664,"d":"9897.97"},{"v":10235.066666666666,"d":"10235.07"},{"v":10341.733333333334,"d":"10341.73"},{"v":10403.616666666667,"d":"10403.62"},10279.85,10111.3]
[2,"Nifty Bank",24129.5,{"v":24294.533333333336,"d":"24294.53"},{"v":23922.766666666674,"d":"23922.77"},{"v":23716.033333333336,"d":"23716.03"},{"v":23344.266666666674,"d":"23344.27"},{"v":24501.266666666674,"d":"24501.27"},{"v":24873.033333333336,"d":"24873.03"},{"v":25079.766666666674,"d":"25079.77"},24666.3,24087.8]
[3,"Nifty CPSE",2391.45,{"v":2401.983333333333,"d":"2401.98"},{"v":2372.7166666666662,"d":"2372.72"},{"v":2353.983333333333,"d":"2353.98"},{"v":2324.7166666666662,"d":"2324.72"},{"v":2420.7166666666662,"d":"2420.72"},{"v":2449.9833333333336,"d":"2449.98"},{"v":2468.7166666666662,"d":"2468.72"},2431.25,2383.25]
[4,"Nifty Infra",3352.45,{"v":3371.983333333333,"d":"3371.98"},{"v":3327.3666666666663,"d":"3327.37"},{"v":3302.2833333333333,"d":"3302.28"},{"v":3257.6666666666665,"d":"3257.67"},{"v":3397.066666666666,"d":"3397.07"},{"v":3441.683333333333,"d":"3441.68"},{"v":3466.766666666666,"d":"3466.77"},3416.6,3346.9]
[5,"Nifty IT",12490.85,{"v":12540.966666666667,"d":"12540.97"},{"v":12392.033333333335,"d":"12392.03"},{"v":12293.216666666667,"d":"12293.22"},{"v":12144.283333333335,"d":"12144.28"},{"v":12639.783333333335,"d":"12639.78"},{"v":12788.716666666669,"d":"12788.72"},{"v":12887.533333333335,"d":"12887.53"},12689.9,12442.15]
[6,"Nifty PSE",3820.8,{"v":3842.9166666666665,"d":"3842.92"},{"v":3792.633333333333,"d":"3792.63"},{"v":3764.4666666666667,"d":"3764.47"},{"v":3714.1833333333334,"d":"3714.18"},{"v":3871.083333333333,"d":"3871.08"},{"v":3921.366666666667,"d":"3921.37"},{"v":3949.533333333333,"d":"3949.53"},3893.2,3814.75]
{"$rows_left_out":230}
{"sheet":"MidCap Intra","index":3,"n_rows":512,"n_cols":13,"rows_kept":512,"merged":[[0,0,0,1],[8,0,9,0],[8,1,9,1],[8,2,9,2],[8,3,9,3],[8,4,8,6],[8,7,8,9]]}
[]
[]
[]
[]
[{"$nulls":11},"Back To Main Page"]
["FOR INTRA DAY TRADING",{"$nulls":9},{"$f":"Main!B10","v":"2018-04-05"}]
[null,null," "]
[]
["Sr.no","Scrip","CLOSE RATE","Pivot Point","Supports",null,null,"Resistances"]
[null,null,"Point",null,"S1","S2","S3","R1","R2","R3","HIGH","LOW","Total Trade Quanity in Lakhs"]
[1,"3MINDIA",20105,{"v":20318.683333333334,"d":"20318.68"},{"v":19637.31666666667,"d":"19637.32"},{"v":19169.633333333335,"d":"19169.63"},{"v":18488.26666666667,"d":"18488.27"},{"v":20786.36666666667,"d":"20786.37"},{"v":21467.733333333337,"d":"21467.73"},{"v":21935.416666666668,"d":"21935.42"},21000.05,19851,0.03744]
[2,"8KMILES",689.75,{"v":696.8166666666666,"d":"696.82"},{"v":677.6333333333332,"d":"677.63"},{"v":665.5166666666667,"d":"665.52"},{"v":646.3333333333333,"d":"646.33"},{"v":708.9333333333332,"d":"708.93"},{"v":728.1166666666666,"d":"728.12"},{"v":740.2333333333331,"d":"740.23"},716,684.7,1.82882]
[3,"ABB",1271.35,{"v":1279.6333333333332,"d":"1279.63"},{"v":1259.2666666666664,"d":"1259.27"},{"v":1247.1833333333332,"d":"1247.18"},{"v":1226.8166666666664,"d":"1226.82"},{"v":1291.7166666666665,"d":"1291.72"},{"v":1312.0833333333333,"d":"1312.08"},{"v":1324.1666666666665,"d":"1324.17"},1300,1267.55,0.44414]
[4,"ACC",1530,{"v":1544.2333333333333,"d":"1544.23"},{"v":1511.6166666666668,"d":"1511.62"},{"v":1493.2333333333333,"d":"1493.23"},{"v":1460.6166666666668,"d":"1460.62"},{"v":1562.6166666666668,"d":"1562.62"},{"v":1595.2333333333331,"d":"1595.23"},{"v":1613.6166666666668,"d":"1613.62"},1576.85,1525.85,1.71614]
[5,"AIAENG",1439.85,{"v":1433.3500000000001,"d":"1433.35"},{"v":1420.7000000000003,"d":"1420.70"},{"v":1401.5500000000002,"d":"1401.55"},{"v":1388.9000000000003,"d":"1388.90"},{"v":1452.5000000000002,"d":"1452.50"},{"v":1465.1500000000003,"d":"1465.15"},{"v":1484.3000000000002,"d":"1484.30"},1446,1414.2,0.07933]
{"$rows_left_out":498}
{"sheet":"Bulk Deals","index":4,"n_rows":91,"n_cols":8,"rows_kept":91,"merged":[[4,0,4,1],[4,2,4,3],[6,1,6,2]]}
[" "]
[]
[]
[]
[]
[{"$nulls":4},"Back To Main Page"]
["Subject :","BULK DEAL",null,{"$f":"Main!B10","v":"2018-04-05"}]
[]
["Date","Scrip code","Scrip Name","Client Name","Buy / Sell","Quantity Traded","Trade Price / Wt.Avg.trade price","Exchange  "]
["2018-04-04",540615,"7NR","SANGHVI BELA SAMIR","SELL",{"v":60000,"d":"60,000"},27.26,"BSE"]
["2018-04-04",540615,"7NR","AJAY JASVANTLAL DOSHI","BUY",{"v":60000,"d":"60,000"},27.66,"BSE"]
["2018-04-04",520123,"ABCINDQ","GIRDHAR TRANSPORT COMPANY","SELL",{"v":27799,"d":"27,799"},138.88,"BSE"]
["2018-04-04",520123,"ABCINDQ","GIRDHAR TRANSPORT COMPANY","BUY",{"v":27799,"d":"27,799"},137.49,"BSE"]
["2018-04-04",539872,"BAJAJHCARE","ARYAMAN BROKING LIMITED","SELL",{"v":40000,"d":"40,000"},400.04,"BSE"]
["2018-04-04",539872,"BAJAJHCARE","VINOD HARILAL JHAVERI","BUY",{"v":65200,"d":"65,200"},400,"BSE"]
{"$rows_left_out":77}
{"sheet":"Call Tracker (Equity & F&O)","index":5,"n_rows":222,"n_cols":19,"rows_kept":222,"merged":[[8,9,8,10],[9,9,9,10],[10,9,10,10],[11,9,11,10],[12,9,12,10],[13,9,13,10],[14,9,14,10],[15,9,15,10],[16,9,16,10],[17,9,17,10],[18,9,18,10],[19,9,19,10],[20,9,20,10],[21,9,21,10],[22,9,22,10],[23,9,23,10],[25,9,25,10],[30,9,30,10],[31,9,31,10],[32,0,33,0],[32,1,33,1],[32,6,33,6],[32,8,33,8],[32,9,33,10],[32,13,33,13],[32,14,33,14],[32,15,33,15],[37,9,37,10],[38,9,38,10],[41,9,41,10],[42,9,42,10],[43,9,43,10],[44,9,44,10],[45,9,45,10],[46,9,46,10],[47,9,47,10],[48,9,48,10],[49,9,49,10],[50,9,50,10],[51,9,51,10],[52,9,52,10],[54,9,54,10],[60,9,60,10],[61,9,61,10],[68,9,68,10],[69,9,69,10],[70,9,70,10],[71,9,71,10],[72,9,72,10],[73,9,73,10],[74,9,74,10],[83,9,83,10],[84,9,84,10],[85,9,85,10],[86,9,86,10],[87,9,87,10],[88,9,88,10],[89,9,89,10],[91,9,91,10],[92,9,92,10],[93,9,93,10],[94,9,94,10],[95,9,95,10],[96,9,96,10],[97,9,97,10],[98,9,98,10],[99,9,99,10],[100,9,100,10],[101,9,101,10],[102,9,102,10],[103,9,103,10],[104,9,104,10],[105,9,105,10],[106,9,106,10],[107,9,107,10],[108,9,108,10],[109,9,109,10],[110,9,110,10],[111,9,111,10],[112,9,112,10],[113,9,113,10],[114,9,114,10],[115,9,115,10],[116,9,116,10],[117,9,117,10],[118,9,118,10],[119,9,119,10],[120,9,120,10],[121,9,121,10],[122,9,122,10],[123,9,123,10],[124,9,124,10],[125,9,125,10],[126,9,126,10],[127,9,127,10],[128,9,128,10],[129,9,129,10],[130,9,130,10],[131,9,131,10],[132,9,132,10],[133,9,133,10],[134,9,134,10],[135,9,135,10],[136,9,136,10],[137,9,137,10],[138,9,138,10],[139,9,139,10],[140,9,140,10],[141,9,141,10],[142,9,142,10],[143,9,143,10],[144,9,144,10],[145,9,145,10],[146,9,146,10],[147,9,147,10],[148,9,148,10],[149,9,149,10],[150,9,150,10],[151,9,151,10],[152,9,152,10],[153,9,153,10],[154,9,154,10],[155,9,155,10],[156,9,156,10],[157,9,157,10],[159,9,159,10],[160,9,160,10],[161,9,161,10],[162,9,162,10],[163,9,163,10],[164,9,164,10],[165,9,165,10],[166,9,166,10],[167,9,167,10],[168,9,168,10],[169,9,169,10],[170,9,170,10],[171,9,171,10],[172,9,172,10],[173,9,173,10],[174,9,174,10],[175,9,175,10],[176,9,176,10],[177,9,177,10],[178,9,178,10],[179,9,179,10],[180,9,180,10],[181,9,181,10],[182,9,182,10],[183,9,183,10],[184,9,184,10],[185,9,185,10],[186,9,186,10],[187,9,187,10],[188,9,188,10],[189,9,189,10],[190,9,190,10],[191,9,191,10],[192,9,192,10],[193,9,193,10],[194,9,194,10],[195,9,195,10],[196,9,196,10],[197,9,197,10],[198,9,198,10],[199,9,199,10],[200,9,200,10],[201,9,201,10],[202,9,202,10],[203,9,203,10],[204,9,204,10],[205,9,205,10],[206,9,206,10],[207,9,207,10],[209,10,209,11]]}
[]
[]
[]
[]
[{"$nulls":13},"Back To Main Page"]
["Retail Research Technical Calls & Fundamental Performance Report for the month of April -2018 "]
[{"$nulls":13},{"$f":"Main!B10","v":"2018-04-05"}]
[null,"Positional  Call"]
["Sr.no","Date",null,"Company","Rec","Rec Price","Stop Loss***","Call Closed At","Target","Remark",null,"Profit / Loss per Share","Gain / Loss  %","Status","Closed Date","NSE Closed Price"]
[1,"2018-02-09",null,"HINDUNILVR","Buy","1330-1334",1275,null,1450,"Open",{"$nulls":5},{"$f":"VLOOKUP(D10,Sheet2!$A$1:M2108,6,0)","v":1357.45},null,null,"A"]
[2,"2018-02-12",null,"ITC","Buy","271-272",250,null,310,"Open",{"$nulls":5},{"$f":"VLOOKUP(D11,Sheet2!$A$1:M2109,6,0)","v":258.6},null,null,"P"]
[3,"2018-03-08",null,"CADILAHC","Buy",385,367,397.5,420,"Profit of Rs.12.5/-",null,{"$f":"H12-F12-K12","v":12.5},{"$f":"L12/F12","v":{"v":0.032467532467532464,"d":"3.25%"}},"Successful","2018-04-04",{"$f":"VLOOKUP(D12,Sheet2!$A$1:M2132,6,0)","v":394.7},null,null,"R"]
[4,"2018-03-13",null,"LUPIN","Buy",772,732,796,850,"Part Profit of Rs.24/-",null,{"$f":"H13-F13-K13","v":24},{"$f":"L13/F13","v":{"v":0.031088082901554404,"d":"3.11%"}},"Successful","2018-04-03",{"$f":"VLOOKUP(D13,Sheet2!$A$1:M2133,6,0)","v":775.2},null,null,"R"]
[5,"2018-03-16",null,"TATACHEM","Buy",686.5,658,714.5,"730-750","Profit of Rs.28/-",null,{"$f":"H14-F14-K14","v":28},{"$f":"L14/F14","v":{"v":0.04078659868900218,"d":"4.08%"}},"Successful","2018-04-03",{"$f":"VLOOKUP(D14,Sheet2!$A$1:M2134,6,0)","v":708.05},null,null,"H"]
[6,"2018-03-19",null,"TCS","Buy","2840-2845",2720,null,3050,"Open",{"$nulls":5},{"$f":"VLOOKUP(D15,Sheet2!$A$1:M2136,6,0)","v":2910.9},null,null,"A"]
{"$rows_left_out":208}
{"sheet":"Call Tracker (Currency)","index":6,"n_rows":58,"n_cols":18,"rows_kept":58,"merged":[[1,8,1,9],[2,8,2,9],[3,8,3,9],[4,8,4,9],[5,8,5,9],[6,8,6,9],[7,8,7,9],[8,8,8,9],[9,8,9,9],[10,8,10,9],[11,8,11,9],[12,8,12,9],[13,8,13,9],[14,8,14,9],[15,8,15,9],[16,8,16,9],[17,8,17,9],[18,8,18,9],[19,8,19,9],[20,8,20,9],[21,8,21,9],[22,8,22,9],[23,8,23,9],[24,8,24,9],[25,8,25,9],[26,8,26,9],[27,8,27,9],[28,8,28,9],[29,8,29,9],[30,8,30,9],[31,8,31,9],[32,8,32,9],[33,8,33,9],[34,8,34,9],[35,8,35,9],[36,8,36,9],[37,8,37,9],[38,8,38,9],[39,8,39,9],[40,8,40,9],[41,8,41,9],[42,8,42,9],[43,8,43,9],[44,8,44,9],[45,8,45,9],[46,8,46,9],[47,8,47,9],[48,8,48,9],[49,8,49,9],[50,8,50,9],[51,8,51,9],[52,8,52,9],[53,8,53,9],[54,8,54,9],[55,8,55,9],[56,8,56,9],[57,8,57,9],[58,8,58,9],[59,8,59,9],[60,8,60,9],[61,8,61,9],[62,8,62,9],[63,8,63,9],[64,8,64,9],[65,8,65,9],[66,8,66,9],[67,8,67,9],[68,8,68,9],[69,8,69,9],[70,8,70,9],[71,8,71,9],[72,8,72,9],[73,8,73,9],[74,8,74,9],[75,8,75,9],[76,8,76,9],[77,8,77,9],[78,8,78,9],[79,8,79,9],[80,8,80,9],[81,8,81,9],[82,8,82,9],[83,8,83,9],[84,8,84,9],[85,8,85,9],[86,8,86,9],[87,8,87,9],[88,8,88,9],[89,8,89,9],[90,8,90,9],[91,8,91,9],[92,8,92,9],[93,8,93,9],[94,8,94,9],[95,8,95,9],[96,8,96,9],[97,8,97,9],[98,8,98,9],[99,8,99,9],[100,8,100,9],[101,8,101,9],[102,8,102,9],[103,8,103,9],[104,8,104,9],[105,8,105,9],[106,8,106,9],[107,8,107,9],[108,8,108,9],[109,8,109,9],[110,8,110,9],[111,8,111,9],[112,8,112,9],[113,8,113,9],[114,8,114,9],[115,8,115,9],[116,8,116,9],[117,8,117,9],[118,8,118,9],[119,8,119,9],[120,8,120,9],[121,8,121,9],[122,8,122,9],[123,8,123,9],[124,8,124,9]]}
["Master Trade High Risk"]
["Sr.no","Date","Company","Rec","Rec Price","Stop Loss","Call Closed At","Target","Remark",null,"Profit / Loss per share","Gain / Loss  per Lot","Lot","Status","Closed Date"]
[1,"2017-05-08","USDINR MAY FUT","Buy",64.3935,64.29,64.66,64.59,"Profit of Rs.0.27/-",null,{"v":0.2664999999999935,"d":"0.27"},266.4999999999935,1000,"Successful","2017-05-09",null,null,"P"]
[2,"2017-05-08","USDINR JUN FUT","Buy",64.6535,64.45,64.965,65.05,"Profit of Rs 0.31/-",null,{"v":0.31150000000000944,"d":"0.31"},311.50000000000944,1000,"Successful","2017-05-09",null,null,"P"]
[3,"2017-05-09","EUROINR MAY FUT","Sell",70.65,70.8,70.07,70.4,"Profit of Rs 0.58/-",null,{"v":0.580000000000013,"d":"0.58"},580.00000000001,1000,"Successful","2017-05-12",null,null,"P"]
[4,"2017-05-09","GBPINR MAY FUT","Buy",83.774,83.37,83.37,84.77,"Loss of Rs 0.40/-",null,{"v":-0.40399999999999636,"d":"-0.40"},-403.99999999999636,1000,"Unsuccessful","2017-05-11",null,null,"P"]
[5,"2017-05-11","USDINR MAY FUT","Buy",64.6555,64.55,64.55,64.86,"Loss of Rs.0.1055/-",null,-0.10550000000000637,{"$f":"K7*M7","v":{"v":-105.50000000000637,"d":"-105.50"}},1000,"Unsuccessful","2017-05-11",null,null,"P"]
[6,"2017-05-15","USDINR MAY FUT","Buy",64.2275,64.08,64.46,64.48,"Profit of Rs 0.23/-",null,{"v":0.2324999999999875,"d":"0.23"},232.4999999999875,1000,"Successful","2017-05-18",null,null,"P"]
[7,"2017-05-19","USDINR MAY FUT","Sell",64.83,65,65,64.5,"Loss of Rs.0.17/-",null,{"v":-0.1700000000000017,"d":"-0.17"},-170.0000000000017,1000,"Unsuccessful","2017-05-19",null,null,"P"]
[8,"2017-05-23","USDINR MAY FUT","Buy",64.83,64.62,64.95,65.2,"Profit of Rs 0.12/-",null,{"v":0.12000000000000455,"d":"0.12"},120.00000000000455,1000,"Successful","2017-05-24",null,null,"P"]
[9,"2017-05-25","USDINR MAY FUT","Buy",64.57,64.25,64.56,65,"Loss of Rs.0.01/-",null,-0.009999999999990905,-9.999999999990905,1000,"Neutral","2017-05-29",null,null,"P"]
[10,"2017-05-30","USDINR JUN FUT","Buy",64.9125,64.71,64.71,65.31,"Loss of Rs.0.20/-",null,{"v":-0.20250000000000057,"d":"-0.20"},-202.50000000000057,1000,"Unsuccessful","2017-05-31",null,null,"P"]
[11,"2017-06-01","USDINR JUN FUT","Buy",64.655,64.45,64.45,65.05,"Loss of Rs.0.20/-",null,{"$f":"G13-E13","v":{"v":-0.2049999999999983,"d":"-0.20"}},{"$f":"K13*M13","v":-204.9999999999983},{"v":1000,"d":"1000.00"},"Unsuccessful","2017-06-08",null,null,"P"]
[12,"2017-06-12","USDINR JUN FUT","Buy",64.45,64,64.7625,65.2,"Profit of Rs 0.31/-",null,{"v":0.3125,"d":"0.31"},312.5,1000,"Successful","2017-06-16"]
[13,"2017-06-16","USDINR JUN FUT","Buy",64.51,64.2,64.7,65.11,"Profit of Rs 0.19/-",null,{"v":0.18999999999999773,"d":"0.19"},189.99999999999773,1000,"Successful","2017-06-21"]
{"$rows_left_out":44}
{"sheet":"Sheet2","index":7,"n_rows":1526,"n_cols":13,"rows_kept":1526,"hidden":true}
["SYMBOL","SERIES","OPEN","HIGH","LOW","CLOSE","LAST","PREVCLOSE","TOTTRDQTY","TOTTRDVAL","TIMESTAMP","TOTALTRADES","ISIN"]
["20MICRONS","EQ",50.1,52.3,49,49.3,49.5,49.9,193457,9861984.7,"2018-04-04",1874,"INE144J01027"]
["3IINFOTECH","EQ",5.15,5.3,5,5.1,5.1,5.15,3773118,19390662.15,"2018-04-04",1210,"INE748C01020"]
["3MINDIA","EQ",20111.3,21000.05,19851,20105,20131,20111.3,3744,76867491.05,"2018-04-04",1062,"INE470A01017"]
["63MOONS","EQ",101,107,99.65,101.05,101.2,100.15,975603,100866140.25,"2018-04-04",12650,"INE111B01023"]
["8KMILES","EQ",704.95,716,684.7,689.75,691,698.25,182882,128035493.15,"2018-04-04",6255,"INE650K01021"]
["A2ZINFRA","EQ",28.85,29.4,27.25,27.9,28.4,28.85,963860,27350404,"2018-04-04",3425,"INE619I01012"]
["AARTIDRUGS","EQ",540.8,556,535,543.8,547,534.9,7147,3900299.4,"2018-04-04",598,"INE767A01016"]
["AARTIIND","EQ",1165,1165,1150,1154.6,1155,1155.4,93973,108770579.7,"2018-04-04",2537,"INE769A01020"]
["AARVEEDEN","EQ",46.45,47.2,44,44.2,44.7,45.4,18317,825979.45,"2018-04-04",201,"INE273D01019"]
["ABAN","EQ",163.7,165.9,158.3,159.65,159.55,163,874550,141924319.1,"2018-04-04",10647,"INE421A01028"]
["ABB","EQ",1294.9,1300,1267.55,1271.35,1270,1283.15,44414,57027459.75,"2018-04-04",4245,"INE117A01022"]
["ABBOTINDIA","EQ",5674,5884,5600,5624.5,5601,5617.9,12475,72064803,"2018-04-04",1394,"INE358A01014"]
["ABCAPITAL","EQ",152.9,155.8,151,151.7,151.8,152,3032787,466355877.05,"2018-04-04",42130,"INE674K01013"]
["ABFRL","EQ",147.9,152.8,146.9,151,151.05,146.7,835680,125139153.4,"2018-04-04",6790,"INE647O01011"]
{"$rows_left_out":1511}