{"text_format":"3","workbook":"xlsx","n_sheets":9,"sheets":["Main","Future Intra","Cash Intra","MidCap Intra","Bulk Deals","Call Tracker (Equity & F&O)","Sheet2","Sheet1","Sheet3"],"not_rendered":{"images":4,"defined_names":4},"read":"whole","date_system":"1900"}

{"sheet":"Main","index":0,"n_rows":17,"n_cols":4,"rows_kept":17}
[null,"                                                                                                 "]
{"$rows_empty":8}
[null,"2019-03-05"]
[]
[null,"Sheet No.","Template Name","Summary"]
[null,1,"Future Intra","For Intraday trading in F&O segment"]
[null,2,"Cash Intra","For Intraday trading in cash market segment"]
[null,3,"Mid-cap Intra","For Intraday trading in Mid-cap stocks"]
[null,4,"Bulk Deals","Reveals Bulk Deals carried on NSE & BSE"]
[null,5,"Call Tracker"]

{"sheet":"Future Intra","index":1,"n_rows":237,"n_cols":15,"rows_kept":237,"merged":[[8,0,9,0],[8,1,9,1],[8,2,9,2],[8,5,8,7],[8,8,8,10]]}
[]
[]
[]
[]
[{"$nulls":12},"Back to Main Page"]
["FOR INTRA DAY TRADING",{"$nulls":10},{"$f":"Main!B10","v":"2019-03-05"}]
[]
[]
["Sr.no","Sector","Scrip","CLOSE RATE","Pivot Point","Supports",null,null,"Resistances"]
[null,"Sector",null,"Point","Point","S1","S2","S3","R1","R2","R3","HIGH","LOW","OI","% Change in OI"]
[1,"Index","BANKNIFTY",{"v":27201.3,"d":"27201.30"},{"v":27167.066666666666,"d":"27167.07"},{"v":27085.23333333333,"d":"27085.23"},{"v":26969.166666666664,"d":"26969.17"},{"v":26887.33333333333,"d":"26887.33"},{"v":27283.13333333333,"d":"27283.13"},{"v":27364.966666666667,"d":"27364.97"},{"v":27481.033333333333,"d":"27481.03"},27248.9,27051,1459680,{"v":0.2300743262602599,"d":"23.01%"}]
[2,"Index","NIFTY",10917.05,{"v":10905.699999999999,"d":"10905.70"},{"v":10881.949999999997,"d":"10881.95"},{"v":10846.849999999999,"d":"10846.85"},{"v":10823.099999999997,"d":"10823.10"},{"v":10940.799999999997,"d":"10940.80"},{"v":10964.550000000001,"d":"10964.55"},{"v":10999.649999999998,"d":"10999.65"},10929.45,10870.6,14973525,{"v":3.0093243840681643E-3,"d":"0.30%"}]
[3,"Index","NIFTYIT",{"v":15886,"d":"15886.00"},{"v":15865.333333333334,"d":"15865.33"},{"v":15829.666666666668,"d":"15829.67"},{"v":15773.333333333334,"d":"15773.33"},{"v":15737.666666666668,"d":"15737.67"},{"v":15921.666666666668,"d":"15921.67"},{"v":15957.333333333336,"d":"15957.33"},{"v":16013.666666666668,"d":"16013.67"},15901,15809,15500,{"v":0.20155038759689922,"d":"20.16%"}]
[4,"Cement","ACC",1473.45,{"v":1460.1333333333332,"d":"1460.13"},{"v":1431.4666666666665,"d":"1431.47"},{"v":1389.4833333333333,"d":"1389.48"},{"v":1360.8166666666666,"d":"1360.82"},{"v":1502.1166666666663,"d":"1502.12"},{"v":1530.7833333333333,"d":"1530.78"},{"v":1572.7666666666662,"d":"1572.77"},1488.8,1418.15,2825600,{"v":0.03259757345417336,"d":"3.26%"}]
[5,"Others","ADANIENT",134.05,{"v":133.13333333333333,"d":"133.13"},{"v":130.76666666666665,"d":"130.77"},{"v":127.48333333333332,"d":"127.48"},{"v":125.11666666666665,"d":"125.12"},{"v":136.41666666666666,"d":"136.42"},{"v":138.78333333333333,"d":"138.78"},{"v":142.06666666666666,"d":"142.07"},135.5,129.85,37908000,{"v":0.055933147632311976,"d":"5.59%"}]
[6,"Others","ADANIPORTS",335.55,{"v":334.28333333333336,"d":"334.28"},{"v":331.16666666666674,"d":"331.17"},{"v":326.78333333333336,"d":"326.78"},{"v":323.66666666666674,"d":"323.67"},{"v":338.66666666666674,"d":"338.67"},{"v":341.7833333333334,"d":"341.78"},{"v":346.16666666666674,"d":"346.17"},337.4,329.9,22570000,{"v":2.7768521603909807E-3,"d":"0.28%"}]
[7,"Power","ADANIPOWER",{"v":48.7,"d":"48.70"},{"v":48.63333333333333,"d":"48.63"},{"v":48.06666666666666,"d":"48.07"},{"v":47.43333333333333,"d":"47.43"},{"v":46.86666666666666,"d":"46.87"},{"v":49.266666666666666,"d":"49.27"},{"v":49.83333333333334,"d":"49.83"},{"v":50.46666666666667,"d":"50.47"},49.2,48,156860000,{"v":0.03551623976762609,"d":"3.55%"}]
[8,"Pharma","AJANTPHARM",983.15,{"v":980.6333333333332,"d":"980.63"},{"v":973.2166666666665,"d":"973.22"},{"v":963.2833333333333,"d":"963.28"},{"v":955.8666666666666,"d":"955.87"},{"v":990.5666666666664,"d":"990.57"},{"v":997.9833333333331,"d":"997.98"},{"v":1007.9166666666663,"d":"1007.92"},988.05,970.7,801500,{"v":0.01327433628318584,"d":"1.33%"}]
[9,"Banking","ALBK",{"v":49.1,"d":"49.10"},{"v":47.88333333333333,"d":"47.88"},{"v":46.11666666666667,"d":"46.12"},{"v":43.13333333333333,"d":"43.13"},{"v":41.36666666666667,"d":"41.37"},{"v":50.86666666666667,"d":"50.87"},{"v":52.63333333333333,"d":"52.63"},{"v":55.61666666666667,"d":"55.62"},49.65,44.9,22100000,{"v":0.14942528735632185,"d":"14.94%"}]
[10,"Automobile","AMARAJABAT",{"v":732.4,"d":"732.40"},{"v":729.9333333333334,"d":"729.93"},{"v":725.6666666666667,"d":"725.67"},{"v":718.9333333333334,"d":"718.93"},{"v":714.6666666666667,"d":"714.67"},{"v":736.6666666666667,"d":"736.67"},{"v":740.9333333333334,"d":"740.93"},{"v":747.6666666666667,"d":"747.67"},734.2,723.2,620200,{"v":0.057279236276849645,"d":"5.73%"}]
{"$rows_left_out":208}
{"sheet":"Cash Intra","index":2,"n_rows":247,"n_cols":13,"rows_kept":247,"merged":[[7,0,8,0],[7,1,8,1],[7,2,8,2],[7,3,8,3],[7,4,7,6],[7,7,7,9]]}
[]
[]
[]
[]
[{"$nulls":12},"Back to Main Page"]
["FOR INTRA DAY TRADING",{"$nulls":9},{"$f":"Main!B10","v":"2019-03-05"}]
[]
["Sr.no","Scrip","CLOSE RATE","Pivot Point","Supports",null,null,"Resistances"]
[null,null,"Point",null,"S1","S2","S3","R1","R2","R3","HIGH","LOW","Total Trade Quanity in Lakhs"]
[1,"Nifty 50",10863.5,{"v":10854.833333333334,"d":"10854.83"},{"v":10831.766666666668,"d":"10831.77"},{"v":10800.033333333335,"d":"10800.03"},{"v":10776.966666666669,"d":"10776.97"},{"v":10886.566666666668,"d":"10886.57"},{"v":10909.633333333333,"d":"10909.63"},{"v":10941.366666666667,"d":"10941.37"},10877.9,10823.1]
[2,"Nifty Bank",27043.9,27016.45,{"v":26956.350000000002,"d":"26956.35"},{"v":26868.800000000003,"d":"26868.80"},{"v":26808.700000000004,"d":"26808.70"},{"v":27104,"d":"27104.00"},{"v":27164.1,"d":"27164.10"},{"v":27251.649999999998,"d":"27251.65"},27076.55,26928.9]
[3,"Nifty CPSE",2080.2,{"v":2070.883333333333,"d":"2070.88"},{"v":2058.7166666666662,"d":"2058.72"},{"v":2037.2333333333331,"d":"2037.23"},{"v":2025.0666666666662,"d":"2025.07"},{"v":2092.3666666666663,"d":"2092.37"},{"v":2104.5333333333333,"d":"2104.53"},{"v":2126.0166666666664,"d":"2126.02"},2083.05,2049.4]
[4,"Nifty Infra",2942.65,{"v":2937.4500000000003,"d":"2937.45"},{"v":2925.2000000000007,"d":"2925.20"},{"v":2907.7500000000005,"d":"2907.75"},{"v":2895.500000000001,"d":"2895.50"},{"v":2954.9000000000005,"d":"2954.90"},{"v":2967.1499999999996,"d":"2967.15"},{"v":2984.6000000000004,"d":"2984.60"},2949.7,2920]
[5,"Nifty IT",15848.3,{"v":15823.866666666669,"d":"15823.87"},{"v":15776.633333333337,"d":"15776.63"},{"v":15704.966666666669,"d":"15704.97"},{"v":15657.733333333337,"d":"15657.73"},{"v":15895.533333333336,"d":"15895.53"},{"v":15942.766666666666,"d":"15942.77"},{"v":16014.433333333336,"d":"16014.43"},15871.1,15752.2]
[6,"Nifty PSE",3285.2,{"v":3272.0499999999997,"d":"3272.05"},{"v":3255.0999999999995,"d":"3255.10"},{"v":3224.9999999999995,"d":"3225.00"},{"v":3208.0499999999993,"d":"3208.05"},{"v":3302.1499999999996,"d":"3302.15"},{"v":3319.0999999999995,"d":"3319.10"},{"v":3349.2,"d":"3349.20"},3289,3241.95]
[7,"Nifty Midcap 50",4697.25,4673.35,{"v":4646.500000000001,"d":"4646.50"},{"v":4595.750000000001,"d":"4595.75"},{"v":4568.9000000000015,"d":"4568.90"},{"v":4724.1,"d":"4724.10"},{"v":4750.949999999999,"d":"4750.95"},{"v":4801.7,"d":"4801.70"},4700.2,4622.6]
[8,"ABB",1244.5,{"v":1247.2333333333333,"d":"1247.23"},{"v":1232.4666666666667,"d":"1232.47"},{"v":1220.4333333333334,"d":"1220.43"},{"v":1205.6666666666667,"d":"1205.67"},{"v":1259.2666666666667,"d":"1259.27"},{"v":1274.0333333333335,"d":"1274.03"},{"v":1286.0666666666666,"d":"1286.07"},1262,1235.2,1.9691]
[9,"ACC",1481.7,{"v":1467.3666666666668,"d":"1467.37"},{"v":1434.6333333333337,"d":"1434.63"},{"v":1387.5666666666668,"d":"1387.57"},{"v":1354.8333333333337,"d":"1354.83"},{"v":1514.4333333333336,"d":"1514.43"},{"v":1547.1666666666667,"d":"1547.17"},{"v":1594.2333333333336,"d":"1594.23"},1500.1,1420.3,12.00767]
[10,"AIAENG",1776.4,{"v":1765.0166666666667,"d":"1765.02"},{"v":1715.5333333333333,"d":"1715.53"},{"v":1654.6666666666667,"d":"1654.67"},{"v":1605.1833333333334,"d":"1605.18"},{"v":1825.8833333333332,"d":"1825.88"},{"v":1875.3666666666663,"d":"1875.37"},{"v":1936.2333333333331,"d":"1936.23"},1814.5,1704.15,0.4679]
[11,"AUBANK",569.6,{"v":570.4499999999999,"d":"570.45"},{"v":561.1499999999999,"d":"561.15"},{"v":552.6999999999999,"d":"552.70"},{"v":543.3999999999999,"d":"543.40"},{"v":578.8999999999999,"d":"578.90"},{"v":588.1999999999998,"d":"588.20"},{"v":596.6499999999999,"d":"596.65"},579.75,562,5.02483]
{"$rows_left_out":228}
{"sheet":"MidCap Intra","index":3,"n_rows":510,"n_cols":13,"rows_kept":510,"merged":[[0,0,0,1],[8,0,9,0],[8,1,9,1],[8,2,9,2],[8,3,9,3],[8,4,8,6],[8,7,8,9]]}
[]
[]
[]
[]
[{"$nulls":11},"Back To Main Page"]
["FOR INTRA DAY TRADING",{"$nulls":9},{"$f":"Main!B10","v":"2019-03-05"}]
[null,null," "]
[]
["Sr.no","Scrip","CLOSE RATE","Pivot Point","Supports",null,null,"Resistances"]
[null,null,"Point",null,"S1","S2","S3","R1","R2","R3","HIGH","LOW","Total Trade Quanity in Lakhs"]
[1,"3MINDIA",23011.5,{"v":23175.483333333334,"d":"23175.48"},{"v":22763.016666666666,"d":"22763.02"},{"v":22514.533333333333,"d":"22514.53"},{"v":22102.066666666666,"d":"22102.07"},{"v":23423.966666666667,"d":"23423.97"},{"v":23836.433333333334,"d":"23836.43"},{"v":24084.916666666668,"d":"24084.92"},23587.95,22927,0.03951]
[2,"8KMILES",106.6,{"v":106.23333333333333,"d":"106.23"},{"v":104.56666666666666,"d":"104.57"},{"v":102.53333333333333,"d":"102.53"},{"v":100.86666666666666,"d":"100.87"},{"v":108.26666666666667,"d":"108.27"},{"v":109.93333333333332,"d":"109.93"},{"v":111.96666666666667,"d":"111.97"},107.9,104.2,2.30708]
[3,"AARTIIND",1405.25,{"v":1405.9666666666665,"d":"1405.97"},{"v":1397.5333333333328,"d":"1397.53"},{"v":1389.8166666666664,"d":"1389.82"},{"v":1381.3833333333328,"d":"1381.38"},{"v":1413.683333333333,"d":"1413.68"},{"v":1422.1166666666668,"d":"1422.12"},{"v":1429.833333333333,"d":"1429.83"},1414.4,1398.25,0.51573]
[4,"ABAN",57.6,56.25,{"v":53.5,"d":"53.50"},{"v":49.4,"d":"49.40"},46.65,60.35,{"v":63.1,"d":"63.10"},{"v":67.2,"d":"67.20"},59,52.15,14.00089]
[5,"ABB",1244.5,{"v":1247.2333333333333,"d":"1247.23"},{"v":1232.4666666666667,"d":"1232.47"},{"v":1220.4333333333334,"d":"1220.43"},{"v":1205.6666666666667,"d":"1205.67"},{"v":1259.2666666666667,"d":"1259.27"},{"v":1274.0333333333335,"d":"1274.03"},{"v":1286.0666666666666,"d":"1286.07"},1262,1235.2,1.9691]
[6,"ABCAPITAL",95.95,{"v":94.93333333333332,"d":"94.93"},{"v":93.36666666666665,"d":"93.37"},{"v":90.78333333333332,"d":"90.78"},{"v":89.21666666666664,"d":"89.22"},{"v":97.51666666666665,"d":"97.52"},{"v":99.08333333333334,"d":"99.08"},{"v":101.66666666666666,"d":"101.67"},96.5,92.35,31.11358]
[7,"ABFRL",223.45,{"v":223.86666666666665,"d":"223.87"},{"v":220.8833333333333,"d":"220.88"},{"v":218.31666666666666,"d":"218.32"},{"v":215.33333333333331,"d":"215.33"},{"v":226.43333333333328,"d":"226.43"},{"v":229.41666666666663,"d":"229.42"},{"v":231.98333333333326,"d":"231.98"},226.85,221.3,4.92543]
[8,"ACC",1481.7,{"v":1467.3666666666668,"d":"1467.37"},{"v":1434.6333333333337,"d":"1434.63"},{"v":1387.5666666666668,"d":"1387.57"},{"v":1354.8333333333337,"d":"1354.83"},{"v":1514.4333333333336,"d":"1514.43"},{"v":1547.1666666666667,"d":"1547.17"},{"v":1594.2333333333336,"d":"1594.23"},1500.1,1420.3,12.00767]
[9,"ADANIPORTS",333.2,{"v":331.6666666666667,"d":"331.67"},{"v":328.53333333333336,"d":"328.53"},{"v":323.8666666666667,"d":"323.87"},{"v":320.73333333333335,"d":"320.73"},{"v":336.33333333333337,"d":"336.33"},{"v":339.4666666666667,"d":"339.47"},{"v":344.1333333333334,"d":"344.13"},334.8,327,47.56894]
[10,"ADANIPOWER",48.4,{"v":48.38333333333333,"d":"48.38"},{"v":47.766666666666666,"d":"47.77"},{"v":47.13333333333333,"d":"47.13"},{"v":46.516666666666666,"d":"46.52"},{"v":49.016666666666666,"d":"49.02"},{"v":49.633333333333326,"d":"49.63"},{"v":50.266666666666666,"d":"50.27"},49,47.75,164.89834]
{"$rows_left_out":491}
{"sheet":"Bulk Deals","index":4,"n_rows":83,"n_cols":8,"rows_kept":83,"merged":[[4,0,4,1],[4,2,4,3],[6,1,6,2]]}
[" "]
[]
[]
[]
[]
[{"$nulls":4},"Back To Main Page"]
["Subject :","BULK DEAL",null,{"$f":"Main!B10","v":"2019-03-05"}]
[]
["Date","Scrip code","Scrip Name","Client Name","Buy / Sell","Quantity Traded","Trade Price / Wt.Avg.trade price","Exchange  "]
["2019-03-01",541988,"AAVAS","MATTHEWS INTERNATIONAL FUNDS A/C MATTHEWS INDIA FUND","BUY",{"v":404915,"d":"404,915"},1070.1,"BSE"]
["2019-03-01",541988,"AAVAS","AMUNDI FUNDS SBI FM EQUITY INDIA","SELL",{"v":447963,"d":"447,963"},1070.1,"BSE"]
["2019-03-01",513349,"AJMERA","ARIIL TRUST .","BUY",985053,165.8,"BSE"]
["2019-03-01",513349,"AJMERA","HITA ASHWIN AJMERA","SELL",438459,165.8,"BSE"]
["2019-03-01",513349,"AJMERA","SHAILESH BHOGILAL AJMERA","SELL",541429,165.8,"BSE"]
["2019-03-01",511463,"ALEXANDER","KAHAR NIKLESH KANAIYABHAI","BUY",43797,18.71,"BSE"]
["2019-03-01",511463,"ALEXANDER","KAHAR NIKLESH KANAIYABHAI","SELL",32047,18.86,"BSE"]
["2019-03-01",540024,"ASHARI","PRABHULAL LALLUBHAI PAREKH","BUY",43010,6.19,"BSE"]
["2019-03-01",540024,"ASHARI","PRABHULAL LALLUBHAI PAREKH","SELL",2949,6.19,"BSE"]
["2019-03-01",540024,"ASHARI","VIJAY KUMAR AGGARWAL","SELL",100000,6.19,"BSE"]
["2019-03-01",530187,"ATHARVENT","NIKHILDINESHKUMARSHAH","BUY",275000,1.62,"BSE"]
{"$rows_left_out":64}
{"sheet":"Call Tracker (Equity & F&O)","index":5,"n_rows":345,"n_cols":18,"rows_kept":345,"merged":[[22,0,23,0],[22,1,23,1],[22,2,23,2],[22,9,23,9],[22,11,23,11],[22,12,23,12],[22,13,23,13],[22,14,23,14],[28,0,29,0],[28,1,29,1],[28,2,29,2],[28,9,29,9],[28,11,29,11],[28,12,29,12],[28,13,29,13],[28,14,29,14]]}
[]
[]
[]
[]
[{"$nulls":12},"Back To Main Page"]
["Retail Research Technical Calls & Fundamental Performance Report for the month of March -2019 "]
[{"$nulls":12},{"$f":"Main!B10","v":"2019-03-05"}]
[null,"Positional  Call"]
["Sr.no","Date",null,"Company","Rec","Rec Price","Stop Loss***","Call Closed At","Target","Remark","Profit / Loss per Share","Gain / Loss  %","Status","Closed Date","NSE Closed Price"]
[1,"2019-01-24",null,"ITC","Buy","279-281",268,null,305,"Open",{"$nulls":4},{"$f":"VLOOKUP(D10,Sheet2!A10:M1505,6,0)","v":278.2},null,null,"R"]
[2,"2019-03-01",null,"UPL","Sell","879-884",922.2,null,800,"Open",{"$nulls":4},{"$f":"VLOOKUP(D11,Sheet2!A11:M1806,6,0)","v":869.75},null,null,"R"]
[3,"2019-03-01",null,"BEL","Buy","82.50-83.50",78.5,null,92,"Open",{"$nulls":4},{"$f":"VLOOKUP(D12,Sheet2!A12:M1507,6,0)","v":85},null,null,"H"]
[4,"2019-03-01",null,"ZEEL","Sell","477-480",507.3,null,"435-425","Open",{"$nulls":4},{"$f":"VLOOKUP(D13,Sheet2!A13:M1808,6,0)","v":486.35},null,null,"R"]
[]
[]
[]
[]
["CLBS = Closing Basis ***",{"$nulls":4},"Reinitiated $"]
["Dividend adjusted <>",{"$nulls":4},"Revised stoploss #"]
["Part book {}"]
{"$rows_left_out":204}
{"sheet":"Sheet2","index":6,"n_rows":1640,"n_cols":14,"rows_kept":1640,"hidden":true}
["SYMBOL","SERIES","OPEN","HIGH","LOW","CLOSE","LAST","PREVCLOSE","TOTTRDQTY","TOTTRDVAL","TIMESTAMP","TOTALTRADES","ISIN","ISIN"]
["20MICRONS","EQ",37.3,38,37.1,37.8,37.25,36.55,30685,1154353.15,"2019-03-01",347,"INE144J01027"]
["21STCENMGM","EQ",17.95,18.25,17.65,17.75,17.65,17.95,3114,55309.4,"2019-03-01",34,"INE253B01015"]
["3IINFOTECH","EQ",3.45,3.65,3.35,3.6,3.55,3.35,2287303,8063648.85,"2019-03-01",1003,"INE748C01020"]
["3MINDIA","EQ",23098.65,23587.95,22927,23011.5,22927,22896.25,3951,91879714.3,"2019-03-01",1815,"INE470A01017"]
["3PLAND","EQ",11.65,11.65,10.6,10.75,10.75,11.15,526,6044.15,"2019-03-01",11,"INE105C01023"]
["5PAISA","EQ",216,216.25,210,213.3,213.05,208.4,3248,694878.05,"2019-03-01",229,"INE618L01018"]
["63MOONS","EQ",80.05,83.9,80.05,82,81.7,79.55,275273,22551468.7,"2019-03-01",3947,"INE111B01023"]
["8KMILES","EQ",105.1,107.9,104.2,106.6,106,103.75,230708,24458185.05,"2019-03-01",3504,"INE650K01021"]
["A2ZINFRA","BE",17.35,17.6,17.05,17.6,17.6,16.8,140739,2468148.7,"2019-03-01",258,"INE619I01012"]
["AARTIDRUGS","EQ",590,603.3,586.8,593.9,591,589.4,15244,9096043.85,"2019-03-01",935,"INE767A01016"]
["AARTIIND","EQ",1405.1,1414.4,1398.25,1405.25,1403,1390.1,51573,72521177.75,"2019-03-01",5620,"INE769A01020"]
["AARVEEDEN","EQ",21.7,22.75,21.55,22.25,22.25,21.7,9087,199862.2,"2019-03-01",131,"INE273D01019"]
["AAVAS","EQ",1005.5,1085,1002.2,1069.6,1070,1004.15,151797,161175481.65,"2019-03-01",7154,"INE216P01012"]
["ABAN","EQ",52.15,59,52.15,57.6,57.6,52.6,1400089,79160388.5,"2019-03-01",10047,"INE421A01028"]
["ABB","EQ",1245.9,1262,1235.2,1244.5,1240,1227.05,196910,245907448.55,"2019-03-01",8872,"INE117A01022"]
["ABBOTINDIA","EQ",7429.8,7435,7313,7333.4,7313,7437.6,7366,54287088.1,"2019-03-01",1617,"INE358A01014"]
["ABCAPITAL","EQ",92.5,96.5,92.35,95.95,96.05,91.9,3111358,294852616.6,"2019-03-01",32996,"INE674K01013"]
["ABFRL","EQ",226.35,226.85,221.3,223.45,223.3,225.3,492543,110058927.45,"2019-03-01",10834,"INE647O01011"]
["ABSLNN50ET","EQ",275,275,275,275,275,270,6,1650,"2019-03-01",1,"INF209KB1B87"]
{"$rows_left_out":1621}
{"sheet":"Sheet1","index":7,"n_rows":0,"n_cols":0,"rows_kept":0,"hidden":true}

{"sheet":"Sheet3","index":8,"n_rows":0,"n_cols":0,"rows_kept":0,"hidden":true}