{"text_format":"3","workbook":"xlsx","n_sheets":7,"sheets":["Main","Future Intra","Cash Intra","MidCap Intra","Bulk Deals","Call Tracker (Equity & F&O)","Sheet2"],"not_rendered":{"images":4,"defined_names":4},"read":"whole","date_system":"1900"}

{"sheet":"Main","index":0,"n_rows":17,"n_cols":4,"rows_kept":17}
[null,"                                                                                                 "]
{"$rows_empty":8}
[null,"2018-12-04"]
[]
[null,"Sheet No.","Template Name","Summary"]
[null,1,"Future Intra","For Intraday trading in F&O segment"]
[null,2,"Cash Intra","For Intraday trading in cash market segment"]
[null,3,"Mid-cap Intra","For Intraday trading in Mid-cap stocks"]
[null,4,"Bulk Deals","Reveals Bulk Deals carried on NSE & BSE"]
[null,5,"Call Tracker"]

{"sheet":"Future Intra","index":1,"n_rows":242,"n_cols":15,"rows_kept":242,"merged":[[8,0,9,0],[8,1,9,1],[8,2,9,2],[8,5,8,7],[8,8,8,10]]}
[]
[]
[]
[]
[{"$nulls":12},"Back to Main Page"]
["FOR INTRA DAY TRADING",{"$nulls":10},{"$f":"Main!B10","v":"2018-12-04"}]
[]
[]
["Sr.no","Sector","Scrip","CLOSE RATE","Pivot Point","Supports",null,null,"Resistances"]
[null,"Sector",null,"Point","Point","S1","S2","S3","R1","R2","R3","HIGH","LOW","OI","% Change in OI"]
[1,"Index","BANKNIFTY",{"v":26960.4,"d":"26960.40"},{"v":26969.766666666666,"d":"26969.77"},{"v":26874.033333333333,"d":"26874.03"},{"v":26787.666666666668,"d":"26787.67"},{"v":26691.933333333334,"d":"26691.93"},{"v":27056.13333333333,"d":"27056.13"},{"v":27151.86666666666,"d":"27151.87"},{"v":27238.23333333333,"d":"27238.23"},27065.5,26883.4,1731840,{"v":-0.019398675046713096,"d":"-1.94%"}]
[2,"Index","NIFTY",{"v":10924,"d":"10924.00"},{"v":10923.1,"d":"10923.10"},{"v":10872.2,"d":"10872.20"},{"v":10820.4,"d":"10820.40"},{"v":10769.5,"d":"10769.50"},{"v":10974.900000000001,"d":"10974.90"},{"v":11025.8,"d":"11025.80"},{"v":11077.600000000002,"d":"11077.60"},10974,10871.3,20250900,{"v":0.021179069028637126,"d":"2.12%"}]
[3,"Index","NIFTYIT",{"v":14816,"d":"14816.00"},{"v":14780,"d":"14780.00"},{"v":14719,"d":"14719.00"},{"v":14622,"d":"14622.00"},{"v":14561,"d":"14561.00"},{"v":14877,"d":"14877.00"},{"v":14938,"d":"14938.00"},{"v":15035,"d":"15035.00"},14841,14683,13300,{"v":0.1565217391304348,"d":"15.65%"}]
[4,"Index","NIFTYMID50",{"v":4900,"d":"4900.00"},{"v":4899.666666666667,"d":"4899.67"},{"v":4899.333333333334,"d":"4899.33"},{"v":4898.666666666667,"d":"4898.67"},{"v":4898.333333333334,"d":"4898.33"},{"v":4900.333333333334,"d":"4900.33"},{"v":4900.666666666668,"d":"4900.67"},{"v":4901.333333333334,"d":"4901.33"},4900,4899,591690,{"v":3.719546215361726E-4,"d":"0.04%"}]
[5,"Cement","ACC",1521.85,1514.75,1494.65,1467.45,{"v":1447.3500000000001,"d":"1447.35"},1541.95,1562.05,1589.25,1534.85,1487.55,1446800,{"v":0.009489254814401339,"d":"0.95%"}]
[6,"Others","ADANIENT",167.15,{"v":166.71666666666667,"d":"166.72"},{"v":164.18333333333334,"d":"164.18"},{"v":161.21666666666667,"d":"161.22"},{"v":158.68333333333334,"d":"158.68"},{"v":169.68333333333334,"d":"169.68"},{"v":172.2166666666667,"d":"172.22"},{"v":175.18333333333334,"d":"175.18"},169.25,163.75,39472000,{"v":2.2344099126548854E-3,"d":"0.22%"}]
[7,"Others","ADANIPORTS",{"v":376.4,"d":"376.40"},{"v":374.4166666666667,"d":"374.42"},{"v":368.08333333333337,"d":"368.08"},{"v":359.7666666666667,"d":"359.77"},{"v":353.4333333333334,"d":"353.43"},{"v":382.73333333333335,"d":"382.73"},{"v":389.0666666666667,"d":"389.07"},{"v":397.3833333333333,"d":"397.38"},380.75,366.1,18220000,{"v":0.04953917050691244,"d":"4.95%"}]
[8,"Power","ADANIPOWER",58.05,{"v":57.51666666666667,"d":"57.52"},{"v":56.533333333333346,"d":"56.53"},{"v":55.01666666666667,"d":"55.02"},{"v":54.033333333333346,"d":"54.03"},{"v":59.033333333333346,"d":"59.03"},{"v":60.01666666666668,"d":"60.02"},{"v":61.533333333333346,"d":"61.53"},58.5,56,160640000,{"v":0.038396897220426635,"d":"3.84%"}]
[9,"Pharma","AJANTPHARM",{"v":1157.1,"d":"1157.10"},{"v":1163.6166666666666,"d":"1163.62"},{"v":1144.7333333333331,"d":"1144.73"},{"v":1132.3666666666666,"d":"1132.37"},{"v":1113.4833333333331,"d":"1113.48"},{"v":1175.9833333333331,"d":"1175.98"},{"v":1194.8666666666668,"d":"1194.87"},{"v":1207.2333333333331,"d":"1207.23"},1182.5,1151.25,601000,{"v":-0.06821705426356589,"d":"-6.82%"}]
[10,"Banking","ALBK",{"v":49,"d":"49.00"},{"v":48.78333333333333,"d":"48.78"},{"v":48.016666666666666,"d":"48.02"},{"v":47.03333333333333,"d":"47.03"},{"v":46.266666666666666,"d":"46.27"},{"v":49.766666666666666,"d":"49.77"},{"v":50.53333333333333,"d":"50.53"},{"v":51.516666666666666,"d":"51.52"},49.55,47.8,16478000,{"v":0.026027397260273973,"d":"2.60%"}]
{"$rows_left_out":213}
{"sheet":"Cash Intra","index":2,"n_rows":247,"n_cols":13,"rows_kept":247,"merged":[[7,0,8,0],[7,1,8,1],[7,2,8,2],[7,3,8,3],[7,4,7,6],[7,7,7,9]]}
[]
[]
[]
[]
[{"$nulls":12},"Back to Main Page"]
["FOR INTRA DAY TRADING",{"$nulls":9},{"$f":"Main!B10","v":"2018-12-04"}]
[]
["Sr.no","Scrip","CLOSE RATE","Pivot Point","Supports",null,null,"Resistances"]
[null,null,"Point",null,"S1","S2","S3","R1","R2","R3","HIGH","LOW","Total Trade Quanity in Lakhs"]
[1,"Nifty 50",10883.75,{"v":10890.1,"d":"10890.10"},{"v":10839,"d":"10839.00"},10794.25,10743.15,10934.85,{"v":10985.950000000003,"d":"10985.95"},{"v":11030.7,"d":"11030.70"},10941.2,10845.35]
[2,"Nifty Bank",26857.55,{"v":26895.43333333333,"d":"26895.43"},{"v":26753.766666666663,"d":"26753.77"},{"v":26649.983333333334,"d":"26649.98"},{"v":26508.316666666666,"d":"26508.32"},{"v":26999.21666666666,"d":"26999.22"},{"v":27140.883333333324,"d":"27140.88"},{"v":27244.666666666657,"d":"27244.67"},27037.1,26791.65]
[3,"Nifty CPSE",2009.3,1997.55,{"v":1977.6499999999999,"d":"1977.65"},{"v":1946,"d":"1946.00"},{"v":1926.1,"d":"1926.10"},{"v":2029.1999999999998,"d":"2029.20"},{"v":2049.1,"d":"2049.10"},2080.75,2017.45,1965.9]
[4,"Nifty Infra",3120.1,{"v":3111.983333333333,"d":"3111.98"},{"v":3097.7666666666664,"d":"3097.77"},{"v":3075.4333333333334,"d":"3075.43"},{"v":3061.2166666666667,"d":"3061.22"},{"v":3134.316666666666,"d":"3134.32"},{"v":3148.5333333333324,"d":"3148.53"},{"v":3170.866666666666,"d":"3170.87"},3126.2,3089.65]
[5,"Nifty IT",14740.4,14720.65,{"v":14650.5,"d":"14650.50"},{"v":14560.6,"d":"14560.60"},14490.45,14810.55,{"v":14880.699999999997,"d":"14880.70"},{"v":14970.599999999999,"d":"14970.60"},14790.8,14630.75]
[6,"Nifty PSE",3267.2,{"v":3251.2999999999997,"d":"3251.30"},{"v":3224.5999999999995,"d":"3224.60"},{"v":3181.9999999999995,"d":"3182.00"},{"v":3155.2999999999993,"d":"3155.30"},{"v":3293.8999999999996,"d":"3293.90"},{"v":3320.5999999999995,"d":"3320.60"},{"v":3363.2,"d":"3363.20"},3278,3208.7]
[7,"Nifty Midcap 50",4815.9,{"v":4812.183333333333,"d":"4812.18"},{"v":4783.066666666667,"d":"4783.07"},{"v":4750.233333333334,"d":"4750.23"},{"v":4721.116666666667,"d":"4721.12"},{"v":4845.016666666666,"d":"4845.02"},{"v":4874.133333333333,"d":"4874.13"},{"v":4906.966666666666,"d":"4906.97"},4841.3,4779.35]
[8,"ABB",1389.2,{"v":1396.0666666666666,"d":"1396.07"},{"v":1373.1333333333332,"d":"1373.13"},{"v":1357.0666666666666,"d":"1357.07"},{"v":1334.1333333333332,"d":"1334.13"},{"v":1412.1333333333332,"d":"1412.13"},{"v":1435.0666666666666,"d":"1435.07"},{"v":1451.1333333333332,"d":"1451.13"},1419,1380,0.34631]
[9,"ACC",1516.8,{"v":1510.3,"d":"1510.30"},{"v":1490.6,"d":"1490.60"},{"v":1464.3999999999999,"d":"1464.40"},{"v":1444.6999999999998,"d":"1444.70"},{"v":1536.5,"d":"1536.50"},{"v":1556.2000000000003,"d":"1556.20"},{"v":1582.4,"d":"1582.40"},1530,1484.1,7.20915]
[10,"AIAENG",1724.45,{"v":1727.6166666666668,"d":"1727.62"},{"v":1680.2333333333336,"d":"1680.23"},{"v":1636.0166666666669,"d":"1636.02"},{"v":1588.6333333333337,"d":"1588.63"},{"v":1771.8333333333335,"d":"1771.83"},{"v":1819.2166666666667,"d":"1819.22"},{"v":1863.4333333333334,"d":"1863.43"},1775,1683.4,0.43685]
[11,"AUBANK",591.6,{"v":589.1999999999999,"d":"589.20"},{"v":580.3999999999999,"d":"580.40"},{"v":569.1999999999999,"d":"569.20"},{"v":560.3999999999999,"d":"560.40"},{"v":600.3999999999999,"d":"600.40"},{"v":609.1999999999998,"d":"609.20"},{"v":620.3999999999999,"d":"620.40"},598,578,5.16498]
{"$rows_left_out":228}
{"sheet":"MidCap Intra","index":3,"n_rows":510,"n_cols":13,"rows_kept":510,"merged":[[0,0,0,1],[8,0,9,0],[8,1,9,1],[8,2,9,2],[8,3,9,3],[8,4,8,6],[8,7,8,9]]}
[]
[]
[]
[]
[{"$nulls":11},"Back To Main Page"]
["FOR INTRA DAY TRADING",{"$nulls":9},{"$f":"Main!B10","v":"2018-12-04"}]
[null,null," "]
[]
["Sr.no","Scrip","CLOSE RATE","Pivot Point","Supports",null,null,"Resistances"]
[null,null,"Point",null,"S1","S2","S3","R1","R2","R3","HIGH","LOW","Total Trade Quanity in Lakhs"]
[1,"3MINDIA",21902.15,{"v":21940.716666666664,"d":"21940.72"},{"v":21591.433333333327,"d":"21591.43"},{"v":21280.716666666664,"d":"21280.72"},{"v":20931.433333333327,"d":"20931.43"},{"v":22251.433333333327,"d":"22251.43"},{"v":22600.71666666666,"d":"22600.72"},{"v":22911.433333333327,"d":"22911.43"},22290,21630,0.01536]
[2,"8KMILES",193,{"v":193,"d":"193.00"},{"v":193,"d":"193.00"},{"v":193,"d":"193.00"},{"v":193,"d":"193.00"},{"v":193,"d":"193.00"},{"v":193,"d":"193.00"},{"v":193,"d":"193.00"},193,193,0.26096]
[3,"AARTIIND",1456.6,{"v":1441.2333333333333,"d":"1441.23"},{"v":1420.4666666666667,"d":"1420.47"},{"v":1384.3333333333333,"d":"1384.33"},{"v":1363.5666666666666,"d":"1363.57"},{"v":1477.3666666666668,"d":"1477.37"},{"v":1498.1333333333337,"d":"1498.13"},{"v":1534.2666666666669,"d":"1534.27"},1462,1405.1,0.82083]
[4,"ABAN",75.6,{"v":75.73333333333333,"d":"75.73"},{"v":74.06666666666666,"d":"74.07"},{"v":72.53333333333333,"d":"72.53"},{"v":70.86666666666666,"d":"70.87"},{"v":77.26666666666667,"d":"77.27"},{"v":78.93333333333332,"d":"78.93"},{"v":80.46666666666667,"d":"80.47"},77.4,74.2,4.74329]
[5,"ABB",1389.2,{"v":1396.0666666666666,"d":"1396.07"},{"v":1373.1333333333332,"d":"1373.13"},{"v":1357.0666666666666,"d":"1357.07"},{"v":1334.1333333333332,"d":"1334.13"},{"v":1412.1333333333332,"d":"1412.13"},{"v":1435.0666666666666,"d":"1435.07"},{"v":1451.1333333333332,"d":"1451.13"},1419,1380,0.34631]
[6,"ABCAPITAL",101.9,{"v":103.03333333333335,"d":"103.03"},{"v":100.16666666666669,"d":"100.17"},{"v":98.43333333333334,"d":"98.43"},{"v":95.56666666666668,"d":"95.57"},{"v":104.7666666666667,"d":"104.77"},{"v":107.63333333333334,"d":"107.63"},{"v":109.3666666666667,"d":"109.37"},105.9,101.3,14.44966]
[7,"ABFRL",185.4,{"v":183.29999999999998,"d":"183.30"},{"v":180.19999999999996,"d":"180.20"},{"v":174.99999999999997,"d":"175.00"},{"v":171.89999999999995,"d":"171.90"},{"v":188.49999999999997,"d":"188.50"},{"v":191.6,"d":"191.60"},{"v":196.79999999999998,"d":"196.80"},186.4,178.1,4.67426]
[8,"ACC",1516.8,{"v":1510.3,"d":"1510.30"},{"v":1490.6,"d":"1490.60"},{"v":1464.3999999999999,"d":"1464.40"},{"v":1444.6999999999998,"d":"1444.70"},{"v":1536.5,"d":"1536.50"},{"v":1556.2000000000003,"d":"1556.20"},{"v":1582.4,"d":"1582.40"},1530,1484.1,7.20915]
[9,"ADANIPORTS",375.65,{"v":373.51666666666665,"d":"373.52"},{"v":367.1333333333333,"d":"367.13"},{"v":358.6166666666667,"d":"358.62"},{"v":352.23333333333335,"d":"352.23"},{"v":382.0333333333333,"d":"382.03"},{"v":388.41666666666663,"d":"388.42"},{"v":396.9333333333333,"d":"396.93"},379.9,365,43.03979]
[10,"ADANIPOWER",57.85,{"v":57.300000000000004,"d":"57.30"},{"v":56.25000000000001,"d":"56.25"},{"v":54.650000000000006,"d":"54.65"},{"v":53.60000000000001,"d":"53.60"},{"v":58.900000000000006,"d":"58.90"},59.95,{"v":61.550000000000004,"d":"61.55"},58.35,55.7,299.14058]
{"$rows_left_out":491}
{"sheet":"Bulk Deals","index":4,"n_rows":79,"n_cols":8,"rows_kept":79,"merged":[[4,0,4,1],[4,2,4,3],[6,1,6,2]]}
[" "]
[]
[]
[]
[]
[{"$nulls":4},"Back To Main Page"]
["Subject :","BULK DEAL",null,{"$f":"Main!B10","v":"2018-12-04"}]
[]
["Date","Scrip code","Scrip Name","Client Name","Buy / Sell","Quantity Traded","Trade Price / Wt.Avg.trade price","Exchange  "]
["2018-12-03",538778,"AKASHDEEP","SKYVEIL TRADE SOLUTIONS LLP","BUY",{"v":569000,"d":"569,000"},43.5,"BSE"]
["2018-12-03",538778,"AKASHDEEP","SANGEETA PAREEKH","SELL",{"v":569000,"d":"569,000"},43.5,"BSE"]
["2018-12-03",504340,"CONFINT","VIJAYKANT DEVIPRASAD MISHRA","SELL",{"v":113300,"d":"113,300"},0.88,"BSE"]
["2018-12-03",504340,"CONFINT","PINKY SURANA","BUY",{"v":113300,"d":"113,300"},0.88,"BSE"]
["2018-12-03",539770,"DARJEELING","BHARATI ARVIND SHAH","SELL",{"v":16530,"d":"16,530"},103.77,"BSE"]
["2018-12-03",539009,"GBLIL","HIGHGROWTH VINCOM PRIVATE LIMITED","SELL",{"v":40000,"d":"40,000"},63,"BSE"]
["2018-12-03",539009,"GBLIL","BUDDHADEB LAHA","BUY",{"v":40000,"d":"40,000"},63,"BSE"]
["2018-12-03",539009,"GBLIL","VAGHELA PRAKASH KANTILAL","SELL",{"v":39500,"d":"39,500"},63,"BSE"]
["2018-12-03",539009,"GBLIL","ARUN LAHA","BUY",{"v":39500,"d":"39,500"},63,"BSE"]
["2018-12-03",540938,"GUJHYSPIN","NIKESH D PANCHAL","SELL",{"v":100000,"d":"100,000"},6.35,"BSE"]
["2018-12-03",532334,"HBESD","ASHARI AGENCIES LIMITED","BUY",{"v":100000,"d":"100,000"},14.63,"BSE"]
{"$rows_left_out":60}
{"sheet":"Call Tracker (Equity & F&O)","index":5,"n_rows":296,"n_cols":18,"rows_kept":296,"merged":[[38,0,39,0],[38,1,39,1],[38,2,39,2],[38,9,39,9],[38,11,39,11],[38,12,39,12],[38,13,39,13],[38,14,39,14],[40,0,41,0],[40,1,41,1],[40,2,41,2],[40,9,41,9],[40,11,41,11],[40,12,41,12],[40,13,41,13],[40,14,41,14],[51,0,52,0],[51,1,52,1],[51,2,52,2],[51,9,52,9],[51,11,52,11],[51,12,52,12],[51,13,52,13],[51,14,52,14]]}
[]
[]
[]
[]
[{"$nulls":12},"Back To Main Page"]
["Retail Research Technical Calls & Fundamental Performance Report for the month of December -2018 "]
[{"$nulls":12},{"$f":"Main!B10","v":"2018-12-04"}]
[null,"Positional  Call"]
["Sr.no","Date",null,"Company","Rec","Rec Price","Stop Loss***","Call Closed At","Target","Remark","Profit / Loss per Share","Gain / Loss  %","Status","Closed Date","NSE Closed Price"]
[1,"2018-11-14",null,"ASHOKLEY","Buy",108,100.7,111.25,"122-125","Part Profit of Rs.3.25/-",{"$f":"H10-F10","v":3.25},{"$f":"K10/F10","v":{"v":0.03009259259259259,"d":"3.01%"}},"Successful","2018-11-30",{"$nulls":3},"R"]
[2,"2018-11-21",null,"ADANIPORTS","Sell","358-361",377.7,null,"322-326","Open",{"$nulls":4},{"$f":"VLOOKUP(D11,Sheet2!A11:M1647,6,0)","v":375.65},null,null,"R"]
[3,"2018-11-29",null,"JSWSTEEL","Buy",312,297.7,322,"344-350","Part Profit of Rs.10/-",{"$f":"H12-F12","v":10},{"$f":"K12/F12","v":{"v":0.03205128205128205,"d":"3.21%"}},"Successful","2018-11-30",{"$nulls":3},"R"]
[4,"2018-11-30",null,"RAYMOND","Sell",820,861.6,793.5,"745-735","Part Profit of Rs.26.5/-",{"$f":"F13-H13","v":26.5},{"v":0.03231707317073171,"d":"3.23%"},"Successful","2018-12-03",{"$nulls":3},"R"]
[5,"2018-11-30",null,"INFY","Buy","662-668",628,null,725,"Open",{"$nulls":4},{"$f":"VLOOKUP(D14,Sheet2!A14:M1650,6,0)","v":670.35},null,null,"H"]
{"$rows_empty":19}
["CLBS = Closing Basis ***",{"$nulls":4},"Reinitiated $"]
["Dividend adjusted <>",{"$nulls":4},"Revised stoploss #"]
["Part book {}"]
["Master Trade High Risk"]
["Sr.no","Date",null,"Company","Rec","Rec Price","Stop Loss","Call Closed At","Target","Remark","Profit / Loss per share","Gain / Loss  per Lot","Lot","Status","Closed Date"]
{"$rows_left_out":195}
{"sheet":"Sheet2","index":6,"n_rows":1639,"n_cols":14,"rows_kept":1639,"hidden":true}
["SYMBOL","SERIES","OPEN","HIGH","LOW","CLOSE","LAST","PREVCLOSE","TOTTRDQTY","TOTTRDVAL","TIMESTAMP","TOTALTRADES","ISIN","ISIN"]
["20MICRONS","EQ",43,43.6,42.7,42.9,43,42.8,13265,570535,"2018-12-03",266,"INE144J01027"]
["21STCENMGM","EQ",22.4,22.8,22.4,22.8,22.8,22.4,201,4582.4,"2018-12-03",2,"INE253B01015"]
["3IINFOTECH","EQ",3.9,3.9,3.75,3.8,3.8,3.75,2182085,8356859.75,"2018-12-03",807,"INE748C01020"]
["3MINDIA","EQ",21680,22290,21630,21902.15,21999.9,21634,1536,33835099.7,"2018-12-03",1020,"INE470A01017"]
["5PAISA","EQ",195.05,198.8,190,191.4,190.05,194.95,1728,332093.2,"2018-12-03",101,"INE618L01018"]
["63MOONS","EQ",99.95,104.3,99,100.15,99.2,100.05,491446,49818564.55,"2018-12-03",8168,"INE111B01023"]
["8KMILES","EQ",193,193,193,193,193,183.85,26096,5036528,"2018-12-03",337,"INE650K01021"]
["A2ZINFRA","EQ",12.65,13.95,12.65,12.95,12.95,13.7,378858,4953515.65,"2018-12-03",865,"INE619I01012"]
["AARTIDRUGS","EQ",551.6,566.75,549.5,564.9,565,552.95,10509,5827229.55,"2018-12-03",488,"INE767A01016"]
["AARTIIND","EQ",1435,1462,1405.1,1456.6,1452,1435.9,82083,118635256.9,"2018-12-03",9986,"INE769A01020"]
["AARVEEDEN","EQ",25,25.45,24.55,24.95,24.55,24.95,3205,80082.15,"2018-12-03",33,"INE273D01019"]
["AAVAS","EQ",770.5,785,760.1,779.15,778.1,769.35,111929,86099847.05,"2018-12-03",3676,"INE216P01012"]
["ABAN","EQ",75.3,77.4,74.2,75.6,75.3,75,474329,35779379.15,"2018-12-03",4668,"INE421A01028"]
["ABB","EQ",1410,1419,1380,1389.2,1384,1408.7,34631,48397307.9,"2018-12-03",2718,"INE117A01022"]
["ABBOTINDIA","EQ",7453.95,7839.7,7355,7775.55,7809,7420.15,8024,61261985,"2018-12-03",1824,"INE358A01014"]
["ABCAPITAL","EQ",105.5,105.9,101.3,101.9,102,105.05,1444966,148607665.9,"2018-12-03",23656,"INE674K01013"]
["ABFRL","EQ",182.25,186.4,178.1,185.4,185.25,181.05,467426,84960002.15,"2018-12-03",5790,"INE647O01011"]
["ABMINTLTD","BE",15.7,15.7,15.7,15.7,15.7,16.5,80,1256,"2018-12-03",1,"INE251C01017"]
["ACC","EQ",1497,1530,1484.1,1516.8,1514.9,1485.5,720915,1093976765.05,"2018-12-03",40027,"INE012A01025"]
{"$rows_left_out":1619}