{"text_format":"3","workbook":"xlsx","n_sheets":7,"sheets":["Main","Future Intra","Cash Intra","MidCap Intra","Bulk Deals","Call Tracker (Equity & F&O)","Sheet2"],"not_rendered":{"images":4,"defined_names":4},"read":"whole","date_system":"1900"}

{"sheet":"Main","index":0,"n_rows":17,"n_cols":4,"rows_kept":17}
[null,"                                                                                                 "]
{"$rows_empty":8}
[null,"2018-10-04"]
[]
[null,"Sheet No.","Template Name","Summary"]
[null,1,"Future Intra","For Intraday trading in F&O segment"]
[null,2,"Cash Intra","For Intraday trading in cash market segment"]
[null,3,"Mid-cap Intra","For Intraday trading in Mid-cap stocks"]
[null,4,"Bulk Deals","Reveals Bulk Deals carried on NSE & BSE"]
[null,5,"Call Tracker"]

{"sheet":"Future Intra","index":1,"n_rows":248,"n_cols":15,"rows_kept":248,"merged":[[8,0,9,0],[8,1,9,1],[8,2,9,2],[8,5,8,7],[8,8,8,10]]}
[]
[]
[]
[]
[{"$nulls":12},"Back to Main Page"]
["FOR INTRA DAY TRADING",{"$nulls":10},{"$f":"Main!B10","v":"2018-10-04"}]
[]
[]
["Sr.no","Sector","Scrip","CLOSE RATE","Pivot Point","Supports",null,null,"Resistances"]
[null,"Sector",null,"Point","Point","S1","S2","S3","R1","R2","R3","HIGH","LOW","OI","% Change in OI"]
[1,"Index","BANKNIFTY",25163.65,{"v":25283.5,"d":"25283.50"},{"v":24990,"d":"24990.00"},24816.35,24522.85,25457.15,25750.65,{"v":25924.300000000003,"d":"25924.30"},25577,25109.85,1939240,{"v":0.020652631578947367,"d":"2.07%"}]
[2,"Index","NIFTY",{"v":10893.6,"d":"10893.60"},{"v":10932.866666666667,"d":"10932.87"},{"v":10840.733333333334,"d":"10840.73"},{"v":10787.866666666667,"d":"10787.87"},{"v":10695.733333333334,"d":"10695.73"},{"v":10985.733333333334,"d":"10985.73"},{"v":11077.866666666669,"d":"11077.87"},{"v":11130.733333333334,"d":"11130.73"},11025,10880,18143100,{"v":0.054455898698864504,"d":"5.45%"}]
[3,"Index","NIFTYCPSE",2315.55,771.85,{"v":1543.7,"d":"1543.70"},771.85,{"v":1543.7,"d":"1543.70"},{"v":1543.7,"d":"1543.70"},771.85,{"v":1543.7,"d":"1543.70"},0,0,0,{"v":0,"d":"0.00%"}]
[4,"Index","NIFTYINFRA",3177.55,{"v":1059.1833333333334,"d":"1059.18"},{"v":2118.366666666667,"d":"2118.37"},{"v":1059.1833333333334,"d":"1059.18"},{"v":2118.366666666667,"d":"2118.37"},{"v":2118.366666666667,"d":"2118.37"},{"v":1059.1833333333334,"d":"1059.18"},{"v":2118.366666666667,"d":"2118.37"},0,0,0,{"v":0,"d":"0.00%"}]
[5,"Index","NIFTYIT",{"v":15946,"d":"15946.00"},{"v":16060.333333333334,"d":"16060.33"},{"v":15810.666666666668,"d":"15810.67"},{"v":15675.333333333334,"d":"15675.33"},{"v":15425.666666666668,"d":"15425.67"},{"v":16195.666666666668,"d":"16195.67"},{"v":16445.333333333336,"d":"16445.33"},{"v":16580.666666666668,"d":"16580.67"},16310,15925,39300,{"v":0.10238429172510519,"d":"10.24%"}]
[6,"Index","NIFTYMID50",{"v":4660,"d":"4660.00"},{"v":4656.666666666667,"d":"4656.67"},{"v":4653.333333333334,"d":"4653.33"},{"v":4646.666666666667,"d":"4646.67"},{"v":4643.333333333334,"d":"4643.33"},{"v":4663.333333333334,"d":"4663.33"},{"v":4666.666666666668,"d":"4666.67"},{"v":4673.333333333334,"d":"4673.33"},4660,4650,761310,{"v":2.8905911258852437E-4,"d":"0.03%"}]
[7,"Index","NIFTYPSE",3599.05,{"v":1199.6833333333334,"d":"1199.68"},{"v":2399.366666666667,"d":"2399.37"},{"v":1199.6833333333334,"d":"1199.68"},{"v":2399.366666666667,"d":"2399.37"},{"v":2399.366666666667,"d":"2399.37"},{"v":1199.6833333333334,"d":"1199.68"},{"v":2399.366666666667,"d":"2399.37"},0,0,0,{"v":0,"d":"0.00%"}]
[8,"Cement","ACC",{"v":1506.2,"d":"1506.20"},{"v":1521.4333333333334,"d":"1521.43"},{"v":1478.0166666666669,"d":"1478.02"},{"v":1449.8333333333335,"d":"1449.83"},{"v":1406.416666666667,"d":"1406.42"},{"v":1549.6166666666668,"d":"1549.62"},{"v":1593.0333333333333,"d":"1593.03"},{"v":1621.2166666666667,"d":"1621.22"},1564.85,1493.25,1386800,{"v":0.02786836643937148,"d":"2.79%"}]
[9,"Others","ADANIENT",133.95,{"v":135.54999999999998,"d":"135.55"},{"v":128.59999999999997,"d":"128.60"},{"v":123.24999999999997,"d":"123.25"},{"v":116.29999999999995,"d":"116.30"},{"v":140.89999999999998,"d":"140.90"},{"v":147.84999999999997,"d":"147.85"},{"v":153.2,"d":"153.20"},142.5,130.2,39376000,{"v":-0.01005631536604988,"d":"-1.01%"}]
[10,"Others","ADANIPORTS",330.85,{"v":332.73333333333335,"d":"332.73"},{"v":326.1666666666667,"d":"326.17"},{"v":321.48333333333335,"d":"321.48"},{"v":314.9166666666667,"d":"314.92"},{"v":337.4166666666667,"d":"337.42"},{"v":343.9833333333333,"d":"343.98"},{"v":348.6666666666667,"d":"348.67"},339.3,328.05,10420000,{"v":-0.020676691729323307,"d":"-2.07%"}]
{"$rows_left_out":222}
{"sheet":"Cash Intra","index":2,"n_rows":248,"n_cols":13,"rows_kept":248,"merged":[[7,0,8,0],[7,1,8,1],[7,2,8,2],[7,3,8,3],[7,4,7,6],[7,7,7,9]]}
[]
[]
[]
[]
[{"$nulls":12},"Back to Main Page"]
["FOR INTRA DAY TRADING",{"$nulls":9},{"$f":"Main!B10","v":"2018-10-04"}]
[]
["Sr.no","Scrip","CLOSE RATE","Pivot Point","Supports",null,null,"Resistances"]
[null,null,"Point",null,"S1","S2","S3","R1","R2","R3","HIGH","LOW","Total Trade Quanity in Lakhs"]
[1,"Nifty 50",10858.25,{"v":10897.016666666666,"d":"10897.02"},{"v":10804.983333333334,"d":"10804.98"},{"v":10751.716666666667,"d":"10751.72"},{"v":10659.683333333334,"d":"10659.68"},{"v":10950.283333333333,"d":"10950.28"},{"v":11042.316666666666,"d":"11042.32"},{"v":11095.583333333332,"d":"11095.58"},10989.05,10843.75]
[2,"Nifty Bank",25069.9,{"v":25188.766666666663,"d":"25188.77"},{"v":24907.483333333326,"d":"24907.48"},{"v":24745.066666666662,"d":"24745.07"},{"v":24463.783333333326,"d":"24463.78"},{"v":25351.183333333327,"d":"25351.18"},{"v":25632.466666666667,"d":"25632.47"},{"v":25794.883333333328,"d":"25794.88"},25470.05,25026.35]
[3,"Nifty CPSE",2341,{"v":2334.2166666666667,"d":"2334.22"},{"v":2310.2333333333336,"d":"2310.23"},{"v":2279.4666666666667,"d":"2279.47"},{"v":2255.4833333333336,"d":"2255.48"},{"v":2364.9833333333336,"d":"2364.98"},{"v":2388.9666666666662,"d":"2388.97"},{"v":2419.7333333333336,"d":"2419.73"},2358.2,2303.45]
[4,"Nifty Infra",2933.45,{"v":2940.5833333333335,"d":"2940.58"},{"v":2913.916666666667,"d":"2913.92"},{"v":2894.3833333333337,"d":"2894.38"},{"v":2867.716666666667,"d":"2867.72"},{"v":2960.116666666667,"d":"2960.12"},{"v":2986.7833333333338,"d":"2986.78"},{"v":3006.3166666666666,"d":"3006.32"},2967.25,2921.05]
[5,"Nifty IT",15909.8,{"v":16020.683333333334,"d":"16020.68"},{"v":15763.366666666669,"d":"15763.37"},{"v":15616.933333333334,"d":"15616.93"},{"v":15359.616666666669,"d":"15359.62"},{"v":16167.116666666669,"d":"16167.12"},{"v":16424.433333333334,"d":"16424.43"},{"v":16570.86666666667,"d":"16570.87"},16278,15874.25]
[6,"Nifty PSE",3629.5,{"v":3619.9833333333336,"d":"3619.98"},{"v":3580.916666666667,"d":"3580.92"},{"v":3532.3333333333335,"d":"3532.33"},{"v":3493.266666666667,"d":"3493.27"},{"v":3668.566666666667,"d":"3668.57"},{"v":3707.6333333333337,"d":"3707.63"},{"v":3756.216666666667,"d":"3756.22"},3659.05,3571.4]
[7,"Nifty Midcap 50",4650.45,{"v":4673.883333333332,"d":"4673.88"},{"v":4614.616666666665,"d":"4614.62"},{"v":4578.783333333333,"d":"4578.78"},{"v":4519.5166666666655,"d":"4519.52"},{"v":4709.716666666664,"d":"4709.72"},{"v":4768.983333333333,"d":"4768.98"},{"v":4804.816666666664,"d":"4804.82"},4733.15,4638.05]
[8,"ABB",1422.2,{"v":1429.6833333333334,"d":"1429.68"},{"v":1395.4166666666667,"d":"1395.42"},{"v":1368.6333333333334,"d":"1368.63"},{"v":1334.3666666666668,"d":"1334.37"},{"v":1456.4666666666667,"d":"1456.47"},{"v":1490.7333333333331,"d":"1490.73"},{"v":1517.5166666666667,"d":"1517.52"},1463.95,1402.9,1.2154]
[9,"ACC",1509.7,{"v":1523.3999999999999,"d":"1523.40"},{"v":1480.7999999999997,"d":"1480.80"},{"v":1451.8999999999999,"d":"1451.90"},{"v":1409.2999999999997,"d":"1409.30"},{"v":1552.2999999999997,"d":"1552.30"},{"v":1594.8999999999996,"d":"1594.90"},{"v":1623.7999999999997,"d":"1623.80"},1566,1494.5,5.45265]
[10,"AIAENG",1741.25,{"v":1739.1499999999999,"d":"1739.15"},{"v":1719.0999999999997,"d":"1719.10"},{"v":1696.9499999999998,"d":"1696.95"},{"v":1676.8999999999996,"d":"1676.90"},{"v":1761.2999999999997,"d":"1761.30"},1781.35,{"v":1803.4999999999998,"d":"1803.50"},1759.2,1717,0.35441]
[11,"AUBANK",564.75,{"v":561.9833333333333,"d":"561.98"},{"v":549.4666666666667,"d":"549.47"},{"v":534.1833333333334,"d":"534.18"},{"v":521.6666666666667,"d":"521.67"},{"v":577.2666666666667,"d":"577.27"},{"v":589.7833333333333,"d":"589.78"},{"v":605.0666666666666,"d":"605.07"},574.5,546.7,7.63903]
{"$rows_left_out":229}
{"sheet":"MidCap Intra","index":3,"n_rows":510,"n_cols":13,"rows_kept":510,"merged":[[0,0,0,1],[8,0,9,0],[8,1,9,1],[8,2,9,2],[8,3,9,3],[8,4,8,6],[8,7,8,9]]}
[]
[]
[]
[]
[{"$nulls":11},"Back To Main Page"]
["FOR INTRA DAY TRADING",{"$nulls":9},{"$f":"Main!B10","v":"2018-10-04"}]
[null,null," "]
[]
["Sr.no","Scrip","CLOSE RATE","Pivot Point","Supports",null,null,"Resistances"]
[null,null,"Point",null,"S1","S2","S3","R1","R2","R3","HIGH","LOW","Total Trade Quanity in Lakhs"]
[1,"3MINDIA",22656.4,{"v":23011.399999999998,"d":"23011.40"},{"v":22222.799999999996,"d":"22222.80"},{"v":21789.199999999997,"d":"21789.20"},{"v":21000.599999999995,"d":"21000.60"},{"v":23444.999999999996,"d":"23445.00"},{"v":24233.599999999995,"d":"24233.60"},{"v":24667.199999999997,"d":"24667.20"},23800,22577.8,0.0172]
[2,"8KMILES",172.75,172.75,172.75,172.75,172.75,172.75,172.75,172.75,172.75,172.75,0.50732]
[3,"AARTIIND",1207.05,{"v":1190.2833333333333,"d":"1190.28"},{"v":1155.6166666666666,"d":"1155.62"},{"v":1104.1833333333332,"d":"1104.18"},{"v":1069.5166666666664,"d":"1069.52"},{"v":1241.7166666666667,"d":"1241.72"},{"v":1276.3833333333337,"d":"1276.38"},{"v":1327.8166666666668,"d":"1327.82"},1224.95,1138.85,0.41029]
[4,"ABAN",82.7,{"v":82.68333333333334,"d":"82.68"},{"v":81.06666666666668,"d":"81.07"},{"v":79.43333333333334,"d":"79.43"},{"v":77.81666666666668,"d":"77.82"},{"v":84.31666666666668,"d":"84.32"},{"v":85.93333333333335,"d":"85.93"},{"v":87.56666666666668,"d":"87.57"},84.3,81.05,8.31298]
[5,"ABB",1422.2,{"v":1429.6833333333334,"d":"1429.68"},{"v":1395.4166666666667,"d":"1395.42"},{"v":1368.6333333333334,"d":"1368.63"},{"v":1334.3666666666668,"d":"1334.37"},{"v":1456.4666666666667,"d":"1456.47"},{"v":1490.7333333333331,"d":"1490.73"},{"v":1517.5166666666667,"d":"1517.52"},1463.95,1402.9,1.2154]
[6,"ABCAPITAL",110.25,{"v":110.76666666666665,"d":"110.77"},{"v":108.3333333333333,"d":"108.33"},{"v":106.41666666666664,"d":"106.42"},{"v":103.98333333333329,"d":"103.98"},{"v":112.68333333333331,"d":"112.68"},{"v":115.11666666666665,"d":"115.12"},{"v":117.03333333333332,"d":"117.03"},113.2,108.85,18.98083]
[7,"ABFRL",182.2,{"v":182.0666666666667,"d":"182.07"},{"v":178.33333333333337,"d":"178.33"},{"v":174.46666666666667,"d":"174.47"},{"v":170.73333333333335,"d":"170.73"},{"v":185.9333333333334,"d":"185.93"},{"v":189.66666666666669,"d":"189.67"},{"v":193.53333333333342,"d":"193.53"},185.8,178.2,7.59036]
[8,"ACC",1509.7,{"v":1523.3999999999999,"d":"1523.40"},{"v":1480.7999999999997,"d":"1480.80"},{"v":1451.8999999999999,"d":"1451.90"},{"v":1409.2999999999997,"d":"1409.30"},{"v":1552.2999999999997,"d":"1552.30"},{"v":1594.8999999999996,"d":"1594.90"},{"v":1623.7999999999997,"d":"1623.80"},1566,1494.5,5.45265]
[9,"ADANIPORTS",329.75,{"v":331.3833333333333,"d":"331.38"},{"v":324.76666666666665,"d":"324.77"},{"v":319.7833333333333,"d":"319.78"},{"v":313.16666666666663,"d":"313.17"},{"v":336.3666666666667,"d":"336.37"},{"v":342.98333333333335,"d":"342.98"},{"v":347.9666666666667,"d":"347.97"},338,326.4,44.38442]
[10,"ADANIPOWER",25.95,{"v":26.133333333333336,"d":"26.13"},{"v":25.316666666666674,"d":"25.32"},{"v":24.683333333333337,"d":"24.68"},{"v":23.866666666666674,"d":"23.87"},{"v":26.766666666666673,"d":"26.77"},{"v":27.583333333333336,"d":"27.58"},{"v":28.216666666666672,"d":"28.22"},26.95,25.5,190.0848]
{"$rows_left_out":491}
{"sheet":"Bulk Deals","index":4,"n_rows":87,"n_cols":8,"rows_kept":87,"merged":[[4,0,4,1],[4,2,4,3],[6,1,6,2]]}
[" "]
[]
[]
[]
[]
[{"$nulls":4},"Back To Main Page"]
["Subject :","BULK DEAL",null,{"$f":"Main!B10","v":"2018-10-04"}]
[]
["Date","Scrip code","Scrip Name","Client Name","Buy / Sell","Quantity Traded","Trade Price / Wt.Avg.trade price","Exchange  "]
["2018-10-03",540697,"AMFL","PANNU BALWANTSINGH UJAGARSINGH","BUY",{"v":64000,"d":"64,000"},9.18,"BSE"]
["2018-10-03",540024,"ASHARI","VIJAY KUMAR AGGARWAL","SELL",{"v":110000,"d":"110,000"},27.2,"BSE"]
["2018-10-03",540024,"ASHARI","RESOURCE OPZIONE CONSULTANCY PRIVATE LIMITED","BUY",{"v":107500,"d":"107,500"},27.1,"BSE"]
["2018-10-03",540024,"ASHARI","VIBRANT SECURITIES PRIVATE LIMITED","SELL",{"v":65002,"d":"65,002"},27.2,"BSE"]
["2018-10-03",540024,"ASHARI","VIBRANT SECURITIES PRIVATE LIMITED","BUY",{"v":65002,"d":"65,002"},27.1,"BSE"]
["2018-10-03",540024,"ASHARI","VAGABOUND TRADEX PRIVATE LIMITED","SELL",{"v":50000,"d":"50,000"},27.2,"BSE"]
["2018-10-03",541865,"ASPL","VIBRANT INVESTMENTS","SELL",{"v":60000,"d":"60,000"},26.6,"BSE"]
["2018-10-03",541865,"ASPL","SAPNA MAHESH RUPANI","BUY",{"v":60000,"d":"60,000"},26.6,"BSE"]
["2018-10-03",530859,"COSBOARD","RATTAN CHAND","SELL",{"v":59000,"d":"59,000"},21.62,"BSE"]
["2018-10-03",530859,"COSBOARD","RATTAN CHAND","BUY",{"v":59000,"d":"59,000"},20.82,"BSE"]
["2018-10-03",530859,"COSBOARD","RUCHIKA JAIN","SELL",{"v":32000,"d":"32,000"},22.08,"BSE"]
{"$rows_left_out":68}
{"sheet":"Call Tracker (Equity & F&O)","index":5,"n_rows":259,"n_cols":18,"rows_kept":259,"merged":[[35,0,36,0],[35,1,36,1],[35,9,36,9],[35,11,36,11],[35,12,36,12],[35,13,36,13],[35,14,36,14],[35,17,36,17],[37,0,38,0],[37,1,38,1],[37,9,38,9],[37,11,38,11],[37,12,38,12],[37,13,38,13],[37,14,38,14],[37,17,38,17],[41,0,42,0],[41,1,42,1],[41,9,42,9],[41,11,42,11],[41,12,42,12],[41,13,42,13],[41,14,42,14]]}
[]
[]
[]
[]
[{"$nulls":12},"Back To Main Page"]
["Retail Research Technical Calls & Fundamental Performance Report for the month of October -2018 "]
[{"$nulls":12},{"$f":"Main!B10","v":"2018-10-04"}]
[null,"Positional  Call"]
["Sr.no","Date",null,"Company","Rec","Rec Price","Stop Loss***","Call Closed At","Target","Remark","Profit / Loss per Share","Gain / Loss  %","Status","Closed Date","NSE Closed Price"]
[1,"2018-09-24",null,"SUNPHARMA","Buy","630-635",610,null,"670-680","Open",{"$nulls":4},{"$f":"VLOOKUP(D10,Sheet2!$A$1:M2213,6,0)","v":620.85},null,null,"H"]
[2,"2018-09-26",null,"SBIN","Buy",266,249.7,274.5,"285-295","Profit of Rs. 8.50/-",{"$f":"H11-F11","v":8.5},{"$f":"K11/F11","v":{"v":0.03195488721804511,"d":"3.20%"}},"Successful","2018-10-01",{"$nulls":3},"R"]
[3,"2018-09-27",null,"ITC","Buy",291.5,278,301.5,320,"Profit of Rs. 10/-",10,{"$f":"K12/F12","v":{"v":0.03430531732418525,"d":"3.43%"}},"Successful","2018-10-01",{"$nulls":3},"H"]
[4,"2018-09-28",null,"RBLBANK","Buy",520,499,538,"570-580","Profit of Rs. 18/-",18,{"$f":"K13/F13","v":{"v":0.03461538461538462,"d":"3.46%"}},"Successful","2018-10-03",{"$nulls":3},"H"]
[5,"2018-09-28",null,"PIDILITIND","Buy",1049.5,1017.7,998,"1100-1120","Loss of Rs. 51.50/-",-51.5,{"$f":"K14/F14","v":{"v":-0.049070986183897096,"d":"-4.91%"}},"Unsuccessful","2018-10-03",{"$nulls":3},"R"]
[6,"2018-10-01",null,"M&MFIN","Buy",400,379,414,440,"Profit of Rs. 14/-",14,{"$f":"K15/F15","v":{"v":0.035,"d":"3.50%"}},"Successful","2018-10-01",{"$nulls":3},"H"]
[7,"2018-10-01",null,"CONCOR","Buy",634,598.7,659,"690-700","Profit of Rs. 25/-",25,{"v":0.03943217665615142,"d":"3.94%"},"Successful","2018-10-01",{"$nulls":3},"R"]
[8,"2018-10-03",null,"SUDARSCHEM","Buy","400-404",384.4,null,"430-440","Open",{"$nulls":4},{"$f":"VLOOKUP(D17,Sheet2!$A$1:M2220,6,0)","v":396.55},null,null,"R"]
[9,"2018-10-03",null,"CEATLTD","Buy","1128-1138",1078,null,"1200-1220","Open",{"$nulls":4},{"$f":"VLOOKUP(D18,Sheet2!$A$1:M2221,6,0)","v":1109.15},null,null,"H"]
[10,"2018-10-03",null,"INDUSINDBK","Buy","1650-1660",1597.7,null,"1760-1780","Open",{"$nulls":4},{"$f":"VLOOKUP(D19,Sheet2!$A$1:M2222,6,0)","v":1638.7},null,null,"R"]
{"$rows_empty":11}
{"$rows_left_out":207}
{"sheet":"Sheet2","index":6,"n_rows":1628,"n_cols":14,"rows_kept":1628,"hidden":true}
["SYMBOL","SERIES","OPEN","HIGH","LOW","CLOSE","LAST","PREVCLOSE","TOTTRDQTY","TOTTRDVAL","TIMESTAMP","TOTALTRADES","ISIN","ISIN"]
["20MICRONS","EQ",41.9,43.55,41.9,42.4,42.05,41.85,38228,1630444.75,"2018-10-03",457,"INE144J01027"]
["21STCENMGM","EQ",28.3,28.6,27.8,27.8,27.8,28.3,1807,51097.2,"2018-10-03",28,"INE253B01015"]
["3IINFOTECH","EQ",3.4,3.45,3.35,3.35,3.4,3.35,1742576,5902816.45,"2018-10-03",682,"INE748C01020"]
["3MINDIA","EQ",23350,23800,22577.8,22656.4,22660,23088.15,1720,39301144.05,"2018-10-03",609,"INE470A01017"]
["5PAISA","EQ",204.25,214.8,192.3,208.65,207.45,210.8,12602,2618611.6,"2018-10-03",336,"INE618L01018"]
["63MOONS","EQ",68,69.7,66.8,67.5,66.8,66.75,124696,8511612.5,"2018-10-03",1509,"INE111B01023"]
["8KMILES","BE",172.75,172.75,172.75,172.75,172.75,181.8,50732,8763953,"2018-10-03",419,"INE650K01021"]
["A2ZINFRA","EQ",9.5,10,9.05,9.05,9.05,10.05,4776767,44024825.2,"2018-10-03",3729,"INE619I01012"]
["AARTIDRUGS","EQ",555,573.25,555,563.7,561,554.6,11447,6462335.9,"2018-10-03",703,"INE767A01016"]
["AARTIIND","EQ",1138.85,1224.95,1138.85,1207.05,1224.9,1138.85,41029,48379395.35,"2018-10-03",3958,"INE769A01020"]
["AARVEEDEN","EQ",23.55,24.9,23.05,24.2,24.2,23.6,14963,361000.05,"2018-10-03",102,"INE273D01019"]
["ABAN","EQ",81.05,84.3,81.05,82.7,82.5,80.15,831298,68803173.5,"2018-10-03",8203,"INE421A01028"]
["ABB","EQ",1430,1463.95,1402.9,1422.2,1419.6,1422.9,121540,174229325.25,"2018-10-03",9903,"INE117A01022"]
["ABBOTINDIA","EQ",7700,7739.25,7550,7592.55,7600.45,7640.85,3217,24551123.3,"2018-10-03",1208,"INE358A01014"]
["ABCAPITAL","EQ",110.65,113.2,108.85,110.25,109.9,110.75,1898083,209577578.25,"2018-10-03",22542,"INE674K01013"]
["ABFRL","EQ",184.2,185.8,178.2,182.2,182.2,184.8,759036,138816563.2,"2018-10-03",11296,"INE647O01011"]
["ABMINTLTD","BE",17.15,17.15,17.15,17.15,17.15,18.05,8,137.2,"2018-10-03",1,"INE251C01017"]
["ACC","EQ",1565.7,1566,1494.5,1509.7,1497.05,1573.6,545265,833839193.25,"2018-10-03",29739,"INE012A01025"]
["ACCELYA","EQ",1036,1036,1013,1024.15,1025,1035.45,2772,2832612.65,"2018-10-03",334,"INE793A01012"]
{"$rows_left_out":1608}