{"text_format":"3","workbook":"xlsx","n_sheets":7,"sheets":["Main","Future Intra","Cash Intra","MidCap Intra","Bulk Deals","Call Tracker (Equity & F&O)","Sheet2"],"not_rendered":{"images":4,"defined_names":4},"read":"whole","date_system":"1900"}

{"sheet":"Main","index":0,"n_rows":17,"n_cols":4,"rows_kept":17}
[null,"                                                                                                 "]
{"$rows_empty":8}
[null,"2018-09-04"]
[]
[null,"Sheet No.","Template Name","Summary"]
[null,1,"Future Intra","For Intraday trading in F&O segment"]
[null,2,"Cash Intra","For Intraday trading in cash market segment"]
[null,3,"Mid-cap Intra","For Intraday trading in Mid-cap stocks"]
[null,4,"Bulk Deals","Reveals Bulk Deals carried on NSE & BSE"]
[null,5,"Call Tracker"]

{"sheet":"Future Intra","index":1,"n_rows":250,"n_cols":15,"rows_kept":250,"merged":[[8,0,9,0],[8,1,9,1],[8,2,9,2],[8,5,8,7],[8,8,8,10]]}
[]
[]
[]
[]
[{"$nulls":12},"Back to Main Page"]
["FOR INTRA DAY TRADING",{"$nulls":10},{"$f":"Main!B10","v":"2018-09-04"}]
[]
[]
["Sr.no","Sector","Scrip","CLOSE RATE","Pivot Point","Supports",null,null,"Resistances"]
[null,"Sector",null,"Point","Point","S1","S2","S3","R1","R2","R3","HIGH","LOW","OI","% Change in OI"]
[1,"Index","BANKNIFTY",28014.55,{"v":28092.016666666666,"d":"28092.02"},{"v":27884.083333333332,"d":"27884.08"},{"v":27753.616666666665,"d":"27753.62"},{"v":27545.68333333333,"d":"27545.68"},{"v":28222.483333333334,"d":"28222.48"},{"v":28430.416666666668,"d":"28430.42"},{"v":28560.883333333335,"d":"28560.88"},28299.95,27961.55,1706400,{"v":0.04446185486240329,"d":"4.45%"}]
[2,"Index","NIFTY",11641.75,{"v":11678.933333333334,"d":"11678.93"},{"v":11582.81666666667,"d":"11582.82"},{"v":11523.883333333335,"d":"11523.88"},{"v":11427.76666666667,"d":"11427.77"},{"v":11737.866666666669,"d":"11737.87"},{"v":11833.983333333334,"d":"11833.98"},{"v":11892.916666666668,"d":"11892.92"},11775.05,11620,25947600,{"v":0.005522164223351198,"d":"0.55%"}]
[3,"Index","NIFTYCPSE",{"v":2187.4,"d":"2187.40"},{"v":729.1333333333333,"d":"729.13"},{"v":1458.2666666666667,"d":"1458.27"},{"v":729.1333333333333,"d":"729.13"},{"v":1458.2666666666667,"d":"1458.27"},{"v":1458.2666666666667,"d":"1458.27"},{"v":729.1333333333333,"d":"729.13"},{"v":1458.2666666666667,"d":"1458.27"},0,0,0,{"v":0,"d":"0.00%"}]
[4,"Index","NIFTYINFRA",3108.75,1036.25,{"v":2072.5,"d":"2072.50"},1036.25,{"v":2072.5,"d":"2072.50"},{"v":2072.5,"d":"2072.50"},1036.25,{"v":2072.5,"d":"2072.50"},0,0,0,{"v":0,"d":"0.00%"}]
[5,"Index","NIFTYIT",{"v":15826,"d":"15826.00"},{"v":15921.666666666666,"d":"15921.67"},{"v":15713.333333333332,"d":"15713.33"},{"v":15600.666666666666,"d":"15600.67"},{"v":15392.333333333332,"d":"15392.33"},{"v":16034.333333333332,"d":"16034.33"},{"v":16242.666666666664,"d":"16242.67"},{"v":16355.333333333332,"d":"16355.33"},16130,15809,22400,{"v":-0.058823529411764705,"d":"-5.88%"}]
[6,"Index","NIFTYMID50",{"v":5405,"d":"5405.00"},{"v":5427,"d":"5427.00"},{"v":5383,"d":"5383.00"},{"v":5361,"d":"5361.00"},{"v":5317,"d":"5317.00"},{"v":5449,"d":"5449.00"},{"v":5493,"d":"5493.00"},{"v":5515,"d":"5515.00"},5471,5405,591910,{"v":5.5782818891781326E-4,"d":"0.06%"}]
[7,"Index","NIFTYPSE",3501.05,{"v":1167.0166666666667,"d":"1167.02"},{"v":2334.0333333333333,"d":"2334.03"},{"v":1167.0166666666667,"d":"1167.02"},{"v":2334.0333333333333,"d":"2334.03"},{"v":2334.0333333333333,"d":"2334.03"},{"v":1167.0166666666667,"d":"1167.02"},{"v":2334.0333333333333,"d":"2334.03"},0,0,0,{"v":0,"d":"0.00%"}]
[8,"Cement","ACC",1668.55,{"v":1665.8666666666668,"d":"1665.87"},{"v":1643.7333333333336,"d":"1643.73"},{"v":1618.9166666666667,"d":"1618.92"},{"v":1596.7833333333335,"d":"1596.78"},{"v":1690.6833333333336,"d":"1690.68"},{"v":1712.8166666666668,"d":"1712.82"},{"v":1737.6333333333337,"d":"1737.63"},1688,1641.05,1587600,{"v":0.031981279251170044,"d":"3.20%"}]
[9,"Others","ADANIENT",{"v":210.7,"d":"210.70"},{"v":214.54999999999998,"d":"214.55"},{"v":200.24999999999997,"d":"200.25"},{"v":189.79999999999998,"d":"189.80"},{"v":175.49999999999997,"d":"175.50"},{"v":224.99999999999997,"d":"225.00"},{"v":239.29999999999998,"d":"239.30"},{"v":249.74999999999997,"d":"249.75"},228.85,204.1,16320000,{"v":-0.1293213828425096,"d":"-12.93%"}]
[10,"Others","ADANIPORTS",{"v":387,"d":"387.00"},{"v":387.98333333333335,"d":"387.98"},{"v":380.3666666666667,"d":"380.37"},{"v":373.73333333333335,"d":"373.73"},{"v":366.1166666666667,"d":"366.12"},{"v":394.6166666666667,"d":"394.62"},{"v":402.23333333333335,"d":"402.23"},{"v":408.8666666666667,"d":"408.87"},395.6,381.35,8817500,{"v":-0.00899128968811464,"d":"-0.90%"}]
{"$rows_left_out":224}
{"sheet":"Cash Intra","index":2,"n_rows":248,"n_cols":13,"rows_kept":248,"merged":[[7,0,8,0],[7,1,8,1],[7,2,8,2],[7,3,8,3],[7,4,7,6],[7,7,7,9]]}
[]
[]
[]
[]
[{"$nulls":12},"Back to Main Page"]
["FOR INTRA DAY TRADING",{"$nulls":9},{"$f":"Main!B10","v":"2018-09-04"}]
[]
["Sr.no","Scrip","CLOSE RATE","Pivot Point","Supports",null,null,"Resistances"]
[null,null,"Point",null,"S1","S2","S3","R1","R2","R3","HIGH","LOW","Total Trade Quanity in Lakhs"]
[1,"Nifty 50",11582.35,11633.85,{"v":11515.900000000001,"d":"11515.90"},11449.45,{"v":11331.500000000002,"d":"11331.50"},{"v":11700.300000000001,"d":"11700.30"},{"v":11818.250000000002,"d":"11818.25"},{"v":11884.7,"d":"11884.70"},11751.8,11567.4]
[2,"Nifty Bank",27819.5,{"v":27933.36666666667,"d":"27933.37"},{"v":27663.533333333336,"d":"27663.53"},{"v":27507.56666666667,"d":"27507.57"},{"v":27237.733333333337,"d":"27237.73"},{"v":28089.333333333336,"d":"28089.33"},{"v":28359.166666666664,"d":"28359.17"},{"v":28515.133333333335,"d":"28515.13"},28203.2,27777.4]
[3,"Nifty CPSE",2375.7,{"v":2383.133333333333,"d":"2383.13"},{"v":2363.7166666666662,"d":"2363.72"},{"v":2351.733333333333,"d":"2351.73"},{"v":2332.316666666666,"d":"2332.32"},{"v":2395.1166666666663,"d":"2395.12"},{"v":2414.5333333333333,"d":"2414.53"},{"v":2426.5166666666664,"d":"2426.52"},2402.55,2371.15]
[4,"Nifty Infra",3275,{"v":3287.2000000000003,"d":"3287.20"},{"v":3257.6000000000004,"d":"3257.60"},{"v":3240.2000000000003,"d":"3240.20"},{"v":3210.6000000000004,"d":"3210.60"},{"v":3304.6000000000004,"d":"3304.60"},{"v":3334.2,"d":"3334.20"},{"v":3351.6000000000004,"d":"3351.60"},3316.8,3269.8]
[5,"Nifty IT",15724.7,{"v":15825.316666666666,"d":"15825.32"},{"v":15602.383333333331,"d":"15602.38"},{"v":15480.066666666666,"d":"15480.07"},{"v":15257.133333333331,"d":"15257.13"},{"v":15947.633333333331,"d":"15947.63"},{"v":16170.566666666666,"d":"16170.57"},{"v":16292.883333333331,"d":"16292.88"},16048.25,15703]
[6,"Nifty PSE",3699.6,{"v":3713.9666666666667,"d":"3713.97"},{"v":3679.4833333333336,"d":"3679.48"},{"v":3659.366666666667,"d":"3659.37"},{"v":3624.8833333333337,"d":"3624.88"},{"v":3734.0833333333335,"d":"3734.08"},{"v":3768.566666666666,"d":"3768.57"},{"v":3788.6833333333334,"d":"3788.68"},3748.45,3693.85]
[7,"Nifty Midcap 50",5311.3,{"v":5332.616666666667,"d":"5332.62"},{"v":5277.333333333334,"d":"5277.33"},{"v":5243.366666666667,"d":"5243.37"},{"v":5188.083333333334,"d":"5188.08"},{"v":5366.583333333334,"d":"5366.58"},{"v":5421.866666666667,"d":"5421.87"},{"v":5455.833333333334,"d":"5455.83"},5387.9,5298.65]
[8,"ABB",1305.55,{"v":1312.4833333333333,"d":"1312.48"},{"v":1295.0666666666666,"d":"1295.07"},{"v":1284.5833333333333,"d":"1284.58"},{"v":1267.1666666666665,"d":"1267.17"},{"v":1322.9666666666667,"d":"1322.97"},{"v":1340.3833333333332,"d":"1340.38"},{"v":1350.8666666666668,"d":"1350.87"},1329.9,1302,0.81094]
[9,"ACC",1662.1,{"v":1657.3333333333333,"d":"1657.33"},{"v":1635.7666666666664,"d":"1635.77"},{"v":1609.4333333333332,"d":"1609.43"},{"v":1587.8666666666663,"d":"1587.87"},{"v":1683.6666666666665,"d":"1683.67"},{"v":1705.2333333333336,"d":"1705.23"},{"v":1731.5666666666666,"d":"1731.57"},1678.9,1631,7.87758]
[10,"AIAENG",1714.9,{"v":1733.6333333333332,"d":"1733.63"},{"v":1687.2666666666664,"d":"1687.27"},{"v":1659.6333333333332,"d":"1659.63"},{"v":1613.2666666666664,"d":"1613.27"},{"v":1761.2666666666664,"d":"1761.27"},{"v":1807.6333333333332,"d":"1807.63"},{"v":1835.2666666666664,"d":"1835.27"},1780,1706,0.12507]
[11,"AUBANK",730.1,{"v":730.0333333333333,"d":"730.03"},{"v":724.2166666666666,"d":"724.22"},{"v":718.3333333333333,"d":"718.33"},{"v":712.5166666666665,"d":"712.52"},{"v":735.9166666666666,"d":"735.92"},{"v":741.7333333333332,"d":"741.73"},{"v":747.6166666666667,"d":"747.62"},735.85,724.15,2.715]
{"$rows_left_out":229}
{"sheet":"MidCap Intra","index":3,"n_rows":510,"n_cols":13,"rows_kept":510,"merged":[[0,0,0,1],[8,0,9,0],[8,1,9,1],[8,2,9,2],[8,3,9,3],[8,4,8,6],[8,7,8,9]]}
[]
[]
[]
[]
[{"$nulls":11},"Back To Main Page"]
["FOR INTRA DAY TRADING",{"$nulls":9},{"$f":"Main!B10","v":"2018-09-04"}]
[null,null," "]
[]
["Sr.no","Scrip","CLOSE RATE","Pivot Point","Supports",null,null,"Resistances"]
[null,null,"Point",null,"S1","S2","S3","R1","R2","R3","HIGH","LOW","Total Trade Quanity in Lakhs"]
[1,"3MINDIA",25981.7,{"v":26150.516666666663,"d":"26150.52"},{"v":25639.033333333326,"d":"25639.03"},{"v":25296.36666666666,"d":"25296.37"},{"v":24784.883333333324,"d":"24784.88"},{"v":26493.183333333327,"d":"26493.18"},{"v":27004.666666666664,"d":"27004.67"},{"v":27347.33333333333,"d":"27347.33"},26662,25807.85,0.096]
[2,"8KMILES",319.5,{"v":325.2,"d":"325.20"},{"v":311.4,"d":"311.40"},{"v":303.3,"d":"303.30"},{"v":289.5,"d":"289.50"},{"v":333.29999999999995,"d":"333.30"},{"v":347.1,"d":"347.10"},{"v":355.19999999999993,"d":"355.20"},339,317.1,0.58376]
[3,"AARTIIND",1354.75,{"v":1363.5666666666666,"d":"1363.57"},{"v":1342.1833333333332,"d":"1342.18"},{"v":1329.6166666666666,"d":"1329.62"},{"v":1308.2333333333331,"d":"1308.23"},{"v":1376.1333333333332,"d":"1376.13"},{"v":1397.5166666666664,"d":"1397.52"},{"v":1410.0833333333333,"d":"1410.08"},1384.95,1351,0.15649]
[4,"ABAN",114.4,115.25,{"v":112.7,"d":"112.70"},{"v":111,"d":"111.00"},108.45,116.95,{"v":119.50000000000001,"d":"119.50"},{"v":121.2,"d":"121.20"},117.8,113.55,4.13142]
[5,"ABB",1305.55,{"v":1312.4833333333333,"d":"1312.48"},{"v":1295.0666666666666,"d":"1295.07"},{"v":1284.5833333333333,"d":"1284.58"},{"v":1267.1666666666665,"d":"1267.17"},{"v":1322.9666666666667,"d":"1322.97"},{"v":1340.3833333333332,"d":"1340.38"},{"v":1350.8666666666668,"d":"1350.87"},1329.9,1302,0.81094]
[6,"ABCAPITAL",141.05,{"v":141.6,"d":"141.60"},{"v":139.64999999999998,"d":"139.65"},{"v":138.24999999999997,"d":"138.25"},{"v":136.29999999999995,"d":"136.30"},{"v":143,"d":"143.00"},144.95,{"v":146.35000000000002,"d":"146.35"},143.55,140.2,11.12249]
[7,"ABFRL",202.05,{"v":202.63333333333333,"d":"202.63"},{"v":199.01666666666665,"d":"199.02"},{"v":195.98333333333332,"d":"195.98"},{"v":192.36666666666665,"d":"192.37"},{"v":205.66666666666666,"d":"205.67"},{"v":209.28333333333333,"d":"209.28"},{"v":212.31666666666666,"d":"212.32"},206.25,199.6,14.19629]
[8,"ACC",1662.1,{"v":1657.3333333333333,"d":"1657.33"},{"v":1635.7666666666664,"d":"1635.77"},{"v":1609.4333333333332,"d":"1609.43"},{"v":1587.8666666666663,"d":"1587.87"},{"v":1683.6666666666665,"d":"1683.67"},{"v":1705.2333333333336,"d":"1705.23"},{"v":1731.5666666666666,"d":"1731.57"},1678.9,1631,7.87758]
[9,"ADANIPORTS",384.45,{"v":385.2833333333333,"d":"385.28"},{"v":377.6166666666666,"d":"377.62"},{"v":370.7833333333333,"d":"370.78"},{"v":363.1166666666666,"d":"363.12"},{"v":392.1166666666666,"d":"392.12"},{"v":399.78333333333336,"d":"399.78"},{"v":406.6166666666666,"d":"406.62"},392.95,378.45,27.44322]
[10,"ADANIPOWER",33.7,{"v":34.333333333333336,"d":"34.33"},{"v":32.56666666666667,"d":"32.57"},{"v":31.433333333333337,"d":"31.43"},{"v":29.66666666666667,"d":"29.67"},{"v":35.46666666666667,"d":"35.47"},{"v":37.233333333333334,"d":"37.23"},{"v":38.36666666666667,"d":"38.37"},36.1,33.2,242.81514]
{"$rows_left_out":491}
{"sheet":"Bulk Deals","index":4,"n_rows":87,"n_cols":8,"rows_kept":87,"merged":[[4,0,4,1],[4,2,4,3],[6,1,6,2]]}
[" "]
[]
[]
[]
[]
[{"$nulls":4},"Back To Main Page"]
["Subject :","BULK DEAL",null,{"$f":"Main!B10","v":"2018-09-04"}]
[]
["Date","Scrip code","Scrip Name","Client Name","Buy / Sell","Quantity Traded","Trade Price / Wt.Avg.trade price","Exchange  "]
["2018-09-03",540694,"ANG","ANIL KUMAR GUPTA","SELL",{"v":25600,"d":"25,600"},64.09,"BSE"]
["2018-09-03",540694,"ANG","ANIL KUMAR GUPTA","BUY",{"v":33600,"d":"33,600"},68.36,"BSE"]
["2018-09-03",540024,"ASHARI","MANOJKUMAR GUNVANTRAI SOMANI","SELL",{"v":33138,"d":"33,138"},20.01,"BSE"]
["2018-09-03",540024,"ASHARI","MANOJKUMAR GUNVANTRAI SOMANI","BUY",{"v":55643,"d":"55,643"},19.78,"BSE"]
["2018-09-03",540024,"ASHARI","VIRPAL SINGH","SELL",{"v":107000,"d":"107,000"},20.05,"BSE"]
["2018-09-03",532290,"BLBLIMITED","GOOD SKILL SECURITIES & SERVICES LIMITED","SELL",{"v":859515,"d":"859,515"},6.15,"BSE"]
["2018-09-03",532290,"BLBLIMITED","ACN FINANCIAL SERVICES LIMITED","BUY",{"v":828300,"d":"828,300"},6.15,"BSE"]
["2018-09-03",539335,"CHPLIND","ASHUTOSH DIXIT","BUY",{"v":40100,"d":"40,100"},18,"BSE"]
["2018-09-03",539335,"CHPLIND","RASHMI RAVI SHARMA","SELL",{"v":40000,"d":"40,000"},18,"BSE"]
["2018-09-03",539266,"CONCRETE","ALPABEN ANANTBHAI PATEL","SELL",{"v":76354,"d":"76,354"},8.88,"BSE"]
["2018-09-03",523369,"DCMSRMIND","HB PORTFOLIO LIMITED","SELL",{"v":98057,"d":"98,057"},178.06,"BSE"]
{"$rows_left_out":68}
{"sheet":"Call Tracker (Equity & F&O)","index":5,"n_rows":244,"n_cols":18,"rows_kept":244,"merged":[[43,0,44,0],[43,1,44,1],[43,8,44,8],[43,9,44,9],[43,10,44,10],[43,11,44,11],[43,12,44,12],[43,13,44,13],[43,14,44,14]]}
[]
[]
[]
[]
[{"$nulls":12},"Back To Main Page"]
["Retail Research Technical Calls & Fundamental Performance Report for the month of August -2018 "]
[{"$nulls":12},{"$f":"Main!B10","v":"2018-09-04"}]
[null,"Positional  Call"]
["Sr.no","Date",null,"Company","Rec","Rec Price","Stop Loss***","Call Closed At","Target","Remark","Profit / Loss per Share","Gain / Loss  %","Status","Closed Date","NSE Closed Price"]
[1,"2018-08-23",null,"PARAGMILK","Buy","303-305",289.7,null,"332-336","Open",{"$nulls":4},{"$f":"VLOOKUP(D10,Sheet2!$A$1:M2194,6,0)","v":309.6},null,null,"R"]
[2,"2018-08-31",null,"SIEMENS","Buy","990-1000",945,null,"1085-1095","Open",{"$nulls":4},{"$f":"VLOOKUP(D11,Sheet2!$A$1:M2195,6,0)","v":1019.75},null,null,"R"]
[3,"2018-08-31",null,"SUNPHARMA","Buy",651,618,672.5,"700-720","Part profit of Rs.21.5/-",{"$f":"H12-F12","v":21.5},{"$f":"K12/F12","v":{"v":0.03302611367127496,"d":"3.30%"}},"Successful","2018-09-03",{"$f":"VLOOKUP(D12,Sheet2!$A$1:M2196,6,0)","v":652.85},null,null,"H"]
[4,"2018-09-03",null,"RECLTD","Buy","120-122",116,null,"135-140","Open",{"$nulls":4},{"$f":"VLOOKUP(D13,Sheet2!$A$1:M2197,6,0)","v":119.8},null,null,"H"]
{"$rows_empty":7}
["CLBS = Closing Basis ***",{"$nulls":4},"Reinitiated $"]
["Dividend adjusted <>",{"$nulls":4},"Revised stoploss #"]
["Part book {}"]
["Master Trade High Risk"]
["Sr.no","Date",null,"Company","Rec","Rec Price","Stop Loss","Call Closed At","Target","Remark","Profit / Loss per share","Gain / Loss  per Lot","Lot","Status","Closed Date"]
{"$rows_empty":9}
{"$rows_left_out":190}
{"sheet":"Sheet2","index":6,"n_rows":1654,"n_cols":14,"rows_kept":1654,"hidden":true}
["SYMBOL","SERIES","OPEN","HIGH","LOW","CLOSE","LAST","PREVCLOSE","TOTTRDQTY","TOTTRDVAL","TIMESTAMP","TOTALTRADES","ISIN","ISIN"]
["20MICRONS","EQ",50,50,49,49.25,49.2,49.2,55136,2719930.8,"2018-08-31",539,"INE144J01027"]
["21STCENMGM","EQ",34.65,35.35,34.65,34.65,34.65,35.35,2232,77520.8,"2018-08-31",17,"INE253B01015"]
["3IINFOTECH","EQ",3.65,3.65,3.55,3.6,3.65,3.6,1733563,6269914.9,"2018-08-31",620,"INE748C01020"]
["3MINDIA","EQ",26000,26248.1,25660,25945,25711,26007.45,3199,82963931.1,"2018-08-31",866,"INE470A01017"]
["3PLAND","BE",12.35,12.35,12.35,12.35,12.35,13,3,37.05,"2018-08-31",1,"INE105C01023"]
["5PAISA","EQ",309,314.95,295,311.7,312.4,302.5,5511,1709368.75,"2018-08-31",290,"INE618L01018"]
["63MOONS","EQ",78,81.55,77.55,79.75,79.25,78,194419,15555953.95,"2018-08-31",2238,"INE111B01023"]
["8KMILES","BE",321,327.1,312,327.1,327.1,311.55,48845,15862143.35,"2018-08-31",914,"INE650K01021"]
["A2ZINFRA","EQ",20.75,21.45,19.8,20.65,20.55,20.55,1105980,22921985.85,"2018-08-31",3347,"INE619I01012"]
["AARTIDRUGS","EQ",550,574,546.5,554.95,552,547.9,50210,27985747.75,"2018-08-31",1635,"INE767A01016"]
["AARTIIND","EQ",1386,1389.95,1354.55,1375,1376.9,1381,15196,20861284.2,"2018-08-31",1363,"INE769A01020"]
["AARVEEDEN","EQ",28.5,28.5,27.55,27.95,27.95,27.95,38556,1079288.25,"2018-08-31",197,"INE273D01019"]
["ABAN","EQ",115.95,117.1,114.4,115.5,115.2,115.85,404839,46827537.35,"2018-08-31",4674,"INE421A01028"]
["ABB","EQ",1316,1325,1302,1308.4,1310,1309.55,41420,54484919.15,"2018-08-31",4237,"INE117A01022"]
["ABBOTINDIA","EQ",8012,8699,7981,8330.75,8270,7956.9,54263,449923926.2,"2018-08-31",7669,"INE358A01014"]
["ABCAPITAL","EQ",142.8,142.9,140.3,141.25,141.1,143.35,1022709,144609700.6,"2018-08-31",10096,"INE674K01013"]
["ABFRL","EQ",197.7,200.6,195,198.5,199.6,196.8,1052464,208009967.3,"2018-08-31",11813,"INE647O01011"]
["ABMINTLTD","BE",17,17,17,17,17,16.2,18,306,"2018-08-31",2,"INE251C01017"]
["ACC","EQ",1628.5,1645,1622.45,1638.75,1643,1624.05,708924,1157046914.65,"2018-08-31",27213,"INE012A01025"]
{"$rows_left_out":1634}