{"text_format":"3","workbook":"xlsx","n_sheets":10,"sheets":["Main","Future Intra","Cash Intra","MidCap Intra","Bulk Deals","Call Tracker (Equity & F&O)","Call Tracker (Currency)","Sheet2","Sheet1","Sheet3"],"not_rendered":{"images":4,"defined_names":4},"read":"whole","date_system":"1900"}

{"sheet":"Main","index":0,"n_rows":17,"n_cols":4,"rows_kept":17}
[null,"                                                                                                 "]
{"$rows_empty":8}
[null,"2018-07-04"]
[]
[null,"Sheet No.","Template Name","Summary"]
[null,1,"Future Intra","For Intraday trading in F&O segment"]
[null,2,"Cash Intra","For Intraday trading in cash market segment"]
[null,3,"Mid-cap Intra","For Intraday trading in Mid-cap stocks"]
[null,4,"Bulk Deals","Reveals Bulk Deals carried on NSE & BSE"]
[null,5,"Call Tracker"]

{"sheet":"Future Intra","index":1,"n_rows":250,"n_cols":15,"rows_kept":250,"merged":[[8,0,9,0],[8,1,9,1],[8,2,9,2],[8,5,8,7],[8,8,8,10]]}
[]
[]
[]
[]
[{"$nulls":12},"Back to Main Page"]
["FOR INTRA DAY TRADING",{"$nulls":10},{"$f":"Main!B10","v":"2018-07-04"}]
[]
[]
["Sr.no","Sector","Scrip","CLOSE RATE","Pivot Point","Supports",null,null,"Resistances"]
[null,"Sector",null,"Point","Point","S1","S2","S3","R1","R2","R3","HIGH","LOW","OI","% Change in OI"]
[1,"Index","BANKNIFTY",26254.95,{"v":26254.88333333333,"d":"26254.88"},{"v":26165.266666666663,"d":"26165.27"},{"v":26075.583333333332,"d":"26075.58"},{"v":25985.966666666664,"d":"25985.97"},{"v":26344.566666666662,"d":"26344.57"},{"v":26434.18333333333,"d":"26434.18"},{"v":26523.86666666666,"d":"26523.87"},26344.5,26165.2,2162720,{"v":0.05354637568199532,"d":"5.35%"}]
[2,"Index","NIFTY",10723.95,{"v":10695.816666666668,"d":"10695.82"},{"v":10658.533333333335,"d":"10658.53"},{"v":10593.116666666667,"d":"10593.12"},{"v":10555.833333333334,"d":"10555.83"},{"v":10761.233333333335,"d":"10761.23"},{"v":10798.516666666668,"d":"10798.52"},{"v":10863.933333333336,"d":"10863.93"},10733.1,10630.4,20898300,{"v":0.030042474225279742,"d":"3.00%"}]
[3,"Index","NIFTYCPSE",2439.95,{"v":813.3166666666666,"d":"813.32"},{"v":1626.6333333333332,"d":"1626.63"},{"v":813.3166666666666,"d":"813.32"},{"v":1626.6333333333332,"d":"1626.63"},{"v":1626.6333333333332,"d":"1626.63"},{"v":813.3166666666666,"d":"813.32"},{"v":1626.6333333333332,"d":"1626.63"},0,0,0,{"v":0,"d":"0.00%"}]
[4,"Index","NIFTYINFRA",3500.75,{"v":1166.9166666666667,"d":"1166.92"},{"v":2333.8333333333335,"d":"2333.83"},{"v":1166.9166666666667,"d":"1166.92"},{"v":2333.8333333333335,"d":"2333.83"},{"v":2333.8333333333335,"d":"2333.83"},{"v":1166.9166666666667,"d":"1166.92"},{"v":2333.8333333333335,"d":"2333.83"},0,0,0,{"v":0,"d":"0.00%"}]
[5,"Index","NIFTYIT",{"v":14226,"d":"14226.00"},{"v":14179.666666666666,"d":"14179.67"},{"v":14115.333333333332,"d":"14115.33"},{"v":14004.666666666666,"d":"14004.67"},{"v":13940.333333333332,"d":"13940.33"},{"v":14290.333333333332,"d":"14290.33"},{"v":14354.666666666664,"d":"14354.67"},{"v":14465.333333333332,"d":"14465.33"},14244,14069,41700,{"v":0.013365735115431349,"d":"1.34%"}]
[6,"Index","NIFTYMID50",{"v":4812,"d":"4812.00"},{"v":4831.333333333333,"d":"4831.33"},{"v":4792.666666666666,"d":"4792.67"},{"v":4773.333333333333,"d":"4773.33"},{"v":4734.666666666666,"d":"4734.67"},{"v":4850.666666666666,"d":"4850.67"},{"v":4889.333333333332,"d":"4889.33"},{"v":4908.666666666666,"d":"4908.67"},4870,4812,591690,{"v":3.719546215361726E-4,"d":"0.04%"}]
[7,"Index","NIFTYPSE",3893.55,{"v":1297.8500000000001,"d":"1297.85"},{"v":2595.7000000000003,"d":"2595.70"},{"v":1297.8500000000001,"d":"1297.85"},{"v":2595.7000000000003,"d":"2595.70"},{"v":2595.7000000000003,"d":"2595.70"},{"v":1297.8500000000001,"d":"1297.85"},{"v":2595.7000000000003,"d":"2595.70"},0,0,0,{"v":0,"d":"0.00%"}]
[8,"Cement","ACC",{"v":1332.6,"d":"1332.60"},1323.25,1304.85,{"v":1277.1,"d":"1277.10"},{"v":1258.6999999999998,"d":"1258.70"},{"v":1351,"d":"1351.00"},{"v":1369.4,"d":"1369.40"},1397.15,1341.65,1295.5,1981200,{"v":0.05114601018675721,"d":"5.11%"}]
[9,"Others","ADANIENT",{"v":105.7,"d":"105.70"},{"v":105.06666666666666,"d":"105.07"},{"v":102.68333333333332,"d":"102.68"},{"v":99.66666666666666,"d":"99.67"},{"v":97.28333333333332,"d":"97.28"},{"v":108.08333333333333,"d":"108.08"},{"v":110.46666666666665,"d":"110.47"},{"v":113.48333333333333,"d":"113.48"},107.45,102.05,15700000,{"v":0.017630282603059374,"d":"1.76%"}]
[10,"Others","ADANIPORTS",364.95,{"v":364.5833333333333,"d":"364.58"},{"v":361.8166666666666,"d":"361.82"},{"v":358.6833333333333,"d":"358.68"},{"v":355.9166666666666,"d":"355.92"},{"v":367.71666666666664,"d":"367.72"},{"v":370.4833333333334,"d":"370.48"},{"v":373.6166666666667,"d":"373.62"},367.35,361.45,8115000,{"v":-0.002151859821703043,"d":"-0.22%"}]
{"$rows_left_out":224}
{"sheet":"Cash Intra","index":2,"n_rows":248,"n_cols":13,"rows_kept":248,"merged":[[7,0,8,0],[7,1,8,1],[7,2,8,2],[7,3,8,3],[7,4,7,6],[7,7,7,9]]}
[]
[]
[]
[]
[{"$nulls":12},"Back to Main Page"]
["FOR INTRA DAY TRADING",{"$nulls":9},{"$f":"Main!B10","v":"2018-07-04"}]
[]
["Sr.no","Scrip","CLOSE RATE","Pivot Point","Supports",null,null,"Resistances"]
[null,null,"Point",null,"S1","S2","S3","R1","R2","R3","HIGH","LOW","Total Trade Quanity in Lakhs"]
[1,"Nifty 50",10699.9,10681.15,{"v":10649,"d":"10649.00"},{"v":10598.1,"d":"10598.10"},10565.95,10732.05,{"v":10764.199999999997,"d":"10764.20"},{"v":10815.099999999999,"d":"10815.10"},10713.3,10630.25]
[2,"Nifty Bank",26204.1,{"v":26220.733333333334,"d":"26220.73"},{"v":26125.36666666667,"d":"26125.37"},{"v":26046.633333333335,"d":"26046.63"},{"v":25951.26666666667,"d":"25951.27"},{"v":26299.466666666667,"d":"26299.47"},{"v":26394.83333333333,"d":"26394.83"},{"v":26473.566666666666,"d":"26473.57"},26316.1,26142]
[3,"Nifty CPSE",2208.4,{"v":2200.6666666666665,"d":"2200.67"},{"v":2188.583333333333,"d":"2188.58"},{"v":2168.7666666666664,"d":"2168.77"},{"v":2156.683333333333,"d":"2156.68"},{"v":2220.483333333333,"d":"2220.48"},{"v":2232.566666666666,"d":"2232.57"},{"v":2252.383333333333,"d":"2252.38"},2212.75,2180.85]
[4,"Nifty Infra",3063.85,{"v":3058.7000000000003,"d":"3058.70"},{"v":3046.5000000000005,"d":"3046.50"},3029.15,{"v":3016.9500000000003,"d":"3016.95"},{"v":3076.0500000000006,"d":"3076.05"},{"v":3088.2500000000005,"d":"3088.25"},{"v":3105.600000000001,"d":"3105.60"},3070.9,3041.35]
[5,"Nifty IT",14222.55,{"v":14178.766666666665,"d":"14178.77"},{"v":14118.63333333333,"d":"14118.63"},{"v":14014.716666666665,"d":"14014.72"},{"v":13954.58333333333,"d":"13954.58"},{"v":14282.683333333329,"d":"14282.68"},{"v":14342.816666666664,"d":"14342.82"},{"v":14446.733333333328,"d":"14446.73"},14238.9,14074.85]
[6,"Nifty PSE",3488,{"v":3476.4,"d":"3476.40"},{"v":3459.9,"d":"3459.90"},{"v":3431.8,"d":"3431.80"},{"v":3415.3,"d":"3415.30"},{"v":3504.5,"d":"3504.50"},{"v":3521,"d":"3521.00"},{"v":3549.1,"d":"3549.10"},3492.9,3448.3]
[7,"Nifty Midcap 50",4883.8,{"v":4857.416666666667,"d":"4857.42"},{"v":4822.583333333334,"d":"4822.58"},{"v":4761.366666666667,"d":"4761.37"},{"v":4726.533333333334,"d":"4726.53"},{"v":4918.633333333334,"d":"4918.63"},{"v":4953.466666666668,"d":"4953.47"},{"v":5014.683333333334,"d":"5014.68"},4892.25,4796.2]
[8,"ABB",1173.55,{"v":1177.3833333333332,"d":"1177.38"},{"v":1166.1666666666665,"d":"1166.17"},{"v":1158.7833333333333,"d":"1158.78"},{"v":1147.5666666666666,"d":"1147.57"},{"v":1184.7666666666664,"d":"1184.77"},{"v":1195.9833333333331,"d":"1195.98"},{"v":1203.3666666666663,"d":"1203.37"},1188.6,1170,0.1962]
[9,"ACC",1332.85,1325.95,{"v":1308.9,"d":"1308.90"},1284.95,{"v":1267.9,"d":"1267.90"},{"v":1349.9,"d":"1349.90"},{"v":1366.9499999999998,"d":"1366.95"},{"v":1390.9,"d":"1390.90"},1343,1302,2.84242]
[10,"AIAENG",1515.65,{"v":1510,"d":"1510.00"},{"v":1487.3,"d":"1487.30"},1458.95,1436.25,1538.35,{"v":1561.0499999999997,"d":"1561.05"},{"v":1589.3999999999999,"d":"1589.40"},1532.7,1481.65,0.62427]
[11,"AUBANK",670.6,{"v":669.5166666666668,"d":"669.52"},{"v":659.2333333333336,"d":"659.23"},{"v":647.8666666666668,"d":"647.87"},{"v":637.5833333333336,"d":"637.58"},{"v":680.8833333333336,"d":"680.88"},{"v":691.1666666666666,"d":"691.17"},{"v":702.5333333333335,"d":"702.53"},679.8,658.15,0.91579]
{"$rows_left_out":229}
{"sheet":"MidCap Intra","index":3,"n_rows":511,"n_cols":13,"rows_kept":511,"merged":[[0,0,0,1],[8,0,9,0],[8,1,9,1],[8,2,9,2],[8,3,9,3],[8,4,8,6],[8,7,8,9]]}
[]
[]
[]
[]
[{"$nulls":11},"Back To Main Page"]
["FOR INTRA DAY TRADING",{"$nulls":9},{"$f":"Main!B10","v":"2018-07-04"}]
[null,null," "]
[]
["Sr.no","Scrip","CLOSE RATE","Pivot Point","Supports",null,null,"Resistances"]
[null,null,"Point",null,"S1","S2","S3","R1","R2","R3","HIGH","LOW","Total Trade Quanity in Lakhs"]
[1,"3MINDIA",19553.75,{"v":19601.433333333334,"d":"19601.43"},{"v":19402.36666666667,"d":"19402.37"},{"v":19250.983333333334,"d":"19250.98"},{"v":19051.916666666668,"d":"19051.92"},{"v":19752.81666666667,"d":"19752.82"},{"v":19951.883333333335,"d":"19951.88"},{"v":20103.26666666667,"d":"20103.27"},19800.5,19450.05,0.00472]
[2,"8KMILES",316.4,{"v":331.40000000000003,"d":"331.40"},{"v":298.80000000000007,"d":"298.80"},{"v":281.20000000000005,"d":"281.20"},{"v":248.60000000000008,"d":"248.60"},{"v":349.00000000000006,"d":"349.00"},{"v":381.6000000000001,"d":"381.60"},{"v":399.20000000000005,"d":"399.20"},364,313.8,66.48146]
[3,"AARTIIND",1215.65,{"v":1207.3166666666666,"d":"1207.32"},{"v":1195.3333333333333,"d":"1195.33"},{"v":1175.0166666666667,"d":"1175.02"},{"v":1163.0333333333333,"d":"1163.03"},{"v":1227.6333333333332,"d":"1227.63"},{"v":1239.6166666666668,"d":"1239.62"},{"v":1259.9333333333332,"d":"1259.93"},1219.3,1187,0.13905]
[4,"ABAN",116.2,{"v":114.71666666666665,"d":"114.72"},{"v":108.9833333333333,"d":"108.98"},{"v":101.76666666666665,"d":"101.77"},{"v":96.0333333333333,"d":"96.03"},{"v":121.93333333333331,"d":"121.93"},{"v":127.66666666666666,"d":"127.67"},{"v":134.88333333333333,"d":"134.88"},120.45,107.5,20.12079]
[5,"ABB",1173.55,{"v":1177.3833333333332,"d":"1177.38"},{"v":1166.1666666666665,"d":"1166.17"},{"v":1158.7833333333333,"d":"1158.78"},{"v":1147.5666666666666,"d":"1147.57"},{"v":1184.7666666666664,"d":"1184.77"},{"v":1195.9833333333331,"d":"1195.98"},{"v":1203.3666666666663,"d":"1203.37"},1188.6,1170,0.1962]
[6,"ABCAPITAL",129.75,129.75,{"v":128.5,"d":"128.50"},127.25,{"v":126,"d":"126.00"},{"v":131,"d":"131.00"},132.25,{"v":133.5,"d":"133.50"},131,128.5,7.21282]
[7,"ABFRL",139.55,{"v":138.70000000000002,"d":"138.70"},{"v":137.00000000000003,"d":"137.00"},{"v":134.45000000000002,"d":"134.45"},{"v":132.75000000000003,"d":"132.75"},{"v":141.25000000000003,"d":"141.25"},{"v":142.95000000000002,"d":"142.95"},{"v":145.50000000000003,"d":"145.50"},140.4,136.15,2.0236]
[8,"ACC",1332.85,1325.95,{"v":1308.9,"d":"1308.90"},1284.95,{"v":1267.9,"d":"1267.90"},{"v":1349.9,"d":"1349.90"},{"v":1366.9499999999998,"d":"1366.95"},{"v":1390.9,"d":"1390.90"},1343,1302,2.84242]
[9,"ADANIPORTS",362.75,{"v":362.81666666666666,"d":"362.82"},{"v":360.18333333333334,"d":"360.18"},{"v":357.6166666666667,"d":"357.62"},{"v":354.98333333333335,"d":"354.98"},{"v":365.3833333333333,"d":"365.38"},{"v":368.01666666666665,"d":"368.02"},{"v":370.5833333333333,"d":"370.58"},365.45,360.25,14.88048]
[10,"ADANIPOWER",16,{"v":15.816666666666668,"d":"15.82"},{"v":15.483333333333338,"d":"15.48"},{"v":14.96666666666667,"d":"14.97"},{"v":14.63333333333334,"d":"14.63"},{"v":16.333333333333336,"d":"16.33"},{"v":16.666666666666668,"d":"16.67"},{"v":17.183333333333334,"d":"17.18"},16.15,15.3,104.69657]
{"$rows_left_out":492}
{"sheet":"Bulk Deals","index":4,"n_rows":52,"n_cols":8,"rows_kept":52,"merged":[[4,0,4,1],[4,2,4,3],[6,1,6,2]]}
[" "]
[]
[]
[]
[]
[{"$nulls":4},"Back To Main Page"]
["Subject :","BULK DEAL",null,{"$f":"Main!B10","v":"2018-07-04"}]
[]
["Date","Scrip code","Scrip Name","Client Name","Buy / Sell","Quantity Traded","Trade Price / Wt.Avg.trade price","Exchange  "]
["2018-07-03",539042,"AGIIL","JASPREET KAUR","SELL",{"v":56812,"d":"56,812"},88.31,"BSE"]
["2018-07-03",539042,"AGIIL","GURPREET SINGH","SELL",{"v":98375,"d":"98,375"},90.01,"BSE"]
["2018-07-03",539042,"AGIIL","GURPREET SINGH","BUY",{"v":30000,"d":"30,000"},99.96,"BSE"]
["2018-07-03",539042,"AGIIL","HAVELI INDIA LTD","SELL",{"v":20000,"d":"20,000"},97.77,"BSE"]
["2018-07-03",539042,"AGIIL","HAVELI INDIA LTD","BUY",{"v":70000,"d":"70,000"},101.72,"BSE"]
["2018-07-03",532749,"ALLCARGO","SHASHI KIRAN JANARDHAN SHETTY .","BUY",{"v":1229180,"d":"1,229,180"},110,"BSE"]
["2018-07-03",537766,"BCP","BHARATKUMAR NIHALCHAND SHAH","BUY",{"v":300000,"d":"300,000"},34.23,"BSE"]
["2018-07-03",537766,"BCP","KAMAL BABULAL AGARWAL","SELL",{"v":329852,"d":"329,852"},34.24,"BSE"]
["2018-07-03",537766,"BCP","KAMAL BABULAL AGARWAL","BUY",{"v":329852,"d":"329,852"},34.37,"BSE"]
["2018-07-03",538928,"KARNAVATI","THEETA TRADING LLP","BUY",{"v":150000,"d":"150,000"},26.97,"BSE"]
["2018-07-03",538928,"KARNAVATI","NAVNEETBHAI MULJIBHAI VARIA","SELL",{"v":80000,"d":"80,000"},27,"BSE"]
{"$rows_left_out":33}
{"sheet":"Call Tracker (Equity & F&O)","index":5,"n_rows":252,"n_cols":18,"rows_kept":252,"merged":[[40,0,41,0],[40,1,41,1],[40,9,41,9],[40,10,41,10],[40,11,41,11],[40,12,41,12],[40,13,41,13],[40,14,41,14],[45,0,46,0],[45,1,46,1],[45,8,46,8],[45,9,46,9],[45,10,46,10],[45,11,46,11],[45,12,46,12],[45,13,46,13],[45,14,46,14]]}
[]
[]
[]
[]
[{"$nulls":12},"Back To Main Page"]
["Retail Research Technical Calls & Fundamental Performance Report for the month of July -2018 "]
[{"$nulls":12},{"$f":"Main!B10","v":"2018-07-04"}]
[null,"Positional  Call"]
["Sr.no","Date",null,"Company","Rec","Rec Price","Stop Loss***","Call Closed At","Target","Remark","Profit / Loss per Share","Gain / Loss  %","Status","Closed Date","NSE Closed Price"]
[1,"2018-06-18",null,"BIOCON","Buy",624,596,644.5,"675-685","Part Profit of Rs.20.5/-",{"$f":"H10-F10","v":20.5},{"$f":"K10/F10","v":{"v":0.032852564102564104,"d":"3.29%"}},"Successful","2018-06-25",{"$nulls":3},"H"]
[2,"2018-06-21",null,"CENTURYTEX","Buy",902.5,873,864.5,"955-965","Loss of Rs.38/-",{"$f":"H11-F11","v":{"v":-38,"d":"-38.00"}},{"v":-0.042105263157894736,"d":"-4.21%"},"Unsuccessful","2018-07-02",{"$nulls":3},"R"]
[3,"2018-06-27",null,"RAMCOCEM","Buy","703-707",675,null,"760-770","Open",{"$nulls":4},{"$f":"VLOOKUP(D12,Sheet2!$A$1:M2162,6,0)","v":704},null,null,"R"]
[4,"2018-06-29",null,"CANBK","Buy","251-254",241,null,"270-280","Open",{"$nulls":4},{"$f":"VLOOKUP(D13,Sheet2!$A$1:M2164,6,0)","v":244.75},null,null,"H"]
[5,"2018-07-03",null,"MCDOWELL-N","Buy","655-660",620,null,"715-725","Open",{"$nulls":4},{"$f":"VLOOKUP(D14,Sheet2!$A$1:M2165,6,0)","v":655.35},null,null,"R"]
[6,"2018-07-03",null,"NILKAMAL","Buy","1570-1580",1498,null,"1720-1740","Open",{"$nulls":4},{"$f":"VLOOKUP(D15,Sheet2!$A$1:M2166,6,0)","v":1635.9},null,null,"R"]
[7,"2018-07-03",null,"ZEEL","Buy","537-541",518,null,"580-590","Open",{"$nulls":4},{"$f":"VLOOKUP(D16,Sheet2!$A$1:M2167,6,0)","v":544.8},null,null,"H"]
[]
[]
[]
["CLBS = Closing Basis ***",{"$nulls":4},"Reinitiated $"]
{"$rows_left_out":187}
{"sheet":"Call Tracker (Currency)","index":6,"n_rows":58,"n_cols":18,"rows_kept":58,"hidden":true,"merged":[[1,8,1,9],[2,8,2,9],[3,8,3,9],[4,8,4,9],[5,8,5,9],[6,8,6,9],[7,8,7,9],[8,8,8,9],[9,8,9,9],[10,8,10,9],[11,8,11,9],[12,8,12,9],[13,8,13,9],[14,8,14,9],[15,8,15,9],[16,8,16,9],[17,8,17,9],[18,8,18,9],[19,8,19,9],[20,8,20,9],[21,8,21,9],[22,8,22,9],[23,8,23,9],[24,8,24,9],[25,8,25,9],[26,8,26,9],[27,8,27,9],[28,8,28,9],[29,8,29,9],[30,8,30,9],[31,8,31,9],[32,8,32,9],[33,8,33,9],[34,8,34,9],[35,8,35,9],[36,8,36,9],[37,8,37,9],[38,8,38,9],[39,8,39,9],[40,8,40,9],[41,8,41,9],[42,8,42,9],[43,8,43,9],[44,8,44,9],[45,8,45,9],[46,8,46,9],[47,8,47,9],[48,8,48,9],[49,8,49,9],[50,8,50,9],[51,8,51,9],[52,8,52,9],[53,8,53,9],[54,8,54,9],[55,8,55,9],[56,8,56,9],[57,8,57,9],[58,8,58,9],[59,8,59,9],[60,8,60,9],[61,8,61,9],[62,8,62,9],[63,8,63,9],[64,8,64,9],[65,8,65,9],[66,8,66,9],[67,8,67,9],[68,8,68,9],[69,8,69,9],[70,8,70,9],[71,8,71,9],[72,8,72,9],[73,8,73,9],[74,8,74,9],[75,8,75,9],[76,8,76,9],[77,8,77,9],[78,8,78,9],[79,8,79,9],[80,8,80,9],[81,8,81,9],[82,8,82,9],[83,8,83,9],[84,8,84,9],[85,8,85,9],[86,8,86,9],[87,8,87,9],[88,8,88,9],[89,8,89,9],[90,8,90,9],[91,8,91,9],[92,8,92,9],[93,8,93,9],[94,8,94,9],[95,8,95,9],[96,8,96,9],[97,8,97,9],[98,8,98,9],[99,8,99,9],[100,8,100,9],[101,8,101,9],[102,8,102,9],[103,8,103,9],[104,8,104,9],[105,8,105,9],[106,8,106,9],[107,8,107,9],[108,8,108,9],[109,8,109,9],[110,8,110,9],[111,8,111,9],[112,8,112,9],[113,8,113,9],[114,8,114,9],[115,8,115,9],[116,8,116,9],[117,8,117,9],[118,8,118,9],[119,8,119,9],[120,8,120,9],[121,8,121,9],[122,8,122,9],[123,8,123,9],[124,8,124,9]]}
["Master Trade High Risk"]
["Sr.no","Date","Company","Rec","Rec Price","Stop Loss","Call Closed At","Target","Remark",null,"Profit / Loss per share","Gain / Loss  per Lot","Lot","Status","Closed Date"]
[1,"2017-05-08","USDINR MAY FUT","Buy",64.3935,64.29,64.66,64.59,"Profit of Rs.0.27/-",null,{"v":0.2664999999999935,"d":"0.27"},266.4999999999935,1000,"Successful","2017-05-09",null,null,"P"]
[2,"2017-05-08","USDINR JUN FUT","Buy",64.6535,64.45,64.965,65.05,"Profit of Rs 0.31/-",null,{"v":0.31150000000000944,"d":"0.31"},311.50000000000944,1000,"Successful","2017-05-09",null,null,"P"]
[3,"2017-05-09","EUROINR MAY FUT","Sell",70.65,70.8,70.07,70.4,"Profit of Rs 0.58/-",null,{"v":0.580000000000013,"d":"0.58"},580.00000000001,1000,"Successful","2017-05-12",null,null,"P"]
[4,"2017-05-09","GBPINR MAY FUT","Buy",83.774,83.37,83.37,84.77,"Loss of Rs 0.40/-",null,{"v":-0.40399999999999636,"d":"-0.40"},-403.99999999999636,1000,"Unsuccessful","2017-05-11",null,null,"P"]
[5,"2017-05-11","USDINR MAY FUT","Buy",64.6555,64.55,64.55,64.86,"Loss of Rs.0.1055/-",null,-0.10550000000000637,{"$f":"K7*M7","v":{"v":-105.50000000000637,"d":"-105.50"}},1000,"Unsuccessful","2017-05-11",null,null,"P"]
[6,"2017-05-15","USDINR MAY FUT","Buy",64.2275,64.08,64.46,64.48,"Profit of Rs 0.23/-",null,{"v":0.2324999999999875,"d":"0.23"},232.4999999999875,1000,"Successful","2017-05-18",null,null,"P"]
[7,"2017-05-19","USDINR MAY FUT","Sell",64.83,65,65,64.5,"Loss of Rs.0.17/-",null,{"v":-0.1700000000000017,"d":"-0.17"},-170.0000000000017,1000,"Unsuccessful","2017-05-19",null,null,"P"]
[8,"2017-05-23","USDINR MAY FUT","Buy",64.83,64.62,64.95,65.2,"Profit of Rs 0.12/-",null,{"v":0.12000000000000455,"d":"0.12"},120.00000000000455,1000,"Successful","2017-05-24",null,null,"P"]
[9,"2017-05-25","USDINR MAY FUT","Buy",64.57,64.25,64.56,65,"Loss of Rs.0.01/-",null,-0.009999999999990905,-9.999999999990905,1000,"Neutral","2017-05-29",null,null,"P"]
[10,"2017-05-30","USDINR JUN FUT","Buy",64.9125,64.71,64.71,65.31,"Loss of Rs.0.20/-",null,{"v":-0.20250000000000057,"d":"-0.20"},-202.50000000000057,1000,"Unsuccessful","2017-05-31",null,null,"P"]
[11,"2017-06-01","USDINR JUN FUT","Buy",64.655,64.45,64.45,65.05,"Loss of Rs.0.20/-",null,{"$f":"G13-E13","v":{"v":-0.2049999999999983,"d":"-0.20"}},{"$f":"K13*M13","v":-204.9999999999983},{"v":1000,"d":"1000.00"},"Unsuccessful","2017-06-08",null,null,"P"]
[12,"2017-06-12","USDINR JUN FUT","Buy",64.45,64,64.7625,65.2,"Profit of Rs 0.31/-",null,{"v":0.3125,"d":"0.31"},312.5,1000,"Successful","2017-06-16"]
[13,"2017-06-16","USDINR JUN FUT","Buy",64.51,64.2,64.7,65.11,"Profit of Rs 0.19/-",null,{"v":0.18999999999999773,"d":"0.19"},189.99999999999773,1000,"Successful","2017-06-21"]
[14,"2017-06-22","USDINR JUN FUT","Buy",64.56,64.2,64.2,65.1,"Loss of Rs.0.36/-",null,{"v":-0.35999999999999943,"d":"-0.36"},-359.99999999999943,{"v":1000,"d":"1000.00"},"Unsuccessful","2017-06-30"]
[15,"2017-07-10","USDINR JUL FUT","Buy",64.67,64.4,64.4,65.15,"Loss of Rs.0.27/-",null,{"v":-0.269999999999996,"d":"-0.27"},-269.999999999996,{"v":1000,"d":"1000.00"},"Unsuccessful","2017-07-31"]
[16,"2017-08-02","USDINR AUG FUT","Buy",64.235,63.98,63.98,64.75,"Loss of Rs.0.26/-",null,{"v":-0.25500000000000256,"d":"-0.26"},-255.00000000000256,{"v":1000,"d":"1000.00"},"Unsuccessful","2017-08-02"]
[17,"2017-08-08","USDINR AUG FUT","Buy",63.9425,63.6,64.15,64.5,"Profit of Rs 0.21/-",null,{"v":0.20750000000000313,"d":"0.21"},207.50000000000313,1000,"Successful","2017-08-10"]
[18,"2017-08-22","USDINR AUG FUT","Buy",64.1175,63.9,64.01,64.5,"Loss of Rs.0.11/-",null,{"$f":"G20-E20","v":{"v":-0.1075000000000017,"d":"-0.11"}},{"$f":"K20*M20","v":-107.5000000000017},{"v":1000,"d":"1000.00"},"Unsuccessful","2017-08-29"]
{"$rows_left_out":39}
{"sheet":"Sheet2","index":7,"n_rows":1644,"n_cols":14,"rows_kept":1644,"hidden":true}
["SYMBOL","SERIES","OPEN","HIGH","LOW","CLOSE","LAST","PREVCLOSE","TOTTRDQTY","TOTTRDVAL","TIMESTAMP","TOTALTRADES","ISIN","ISIN"]
["20MICRONS","EQ",35.5,37,35.5,35.8,35.85,36,29266,1053360.65,"2018-07-03",396,"INE144J01027"]
["21STCENMGM","EQ",36.9,37.4,36.05,37.05,37.2,36.7,1569,58159.75,"2018-07-03",16,"INE253B01015"]
["3IINFOTECH","EQ",4.15,4.25,4.05,4.25,4.25,4.15,2544155,10575740.75,"2018-07-03",1289,"INE748C01020"]
["3MINDIA","EQ",19800.5,19800.5,19450.05,19553.75,19575,19809.7,472,9270694.15,"2018-07-03",265,"INE470A01017"]
["3PLAND","EQ",14.4,14.4,13.3,14,14,13.3,2169,29751.5,"2018-07-03",11,"INE105C01023"]
["5PAISA","EQ",318.9,318.9,307,315.55,315.1,315.1,1335,417319.8,"2018-07-03",77,"INE618L01018"]
["63MOONS","EQ",76.95,79,76.25,76.95,77.05,77.25,213309,16534494.3,"2018-07-03",2569,"INE111B01023"]
["8KMILES","EQ",340,364,313.8,316.4,314.5,392.2,6648146,2211955314.6,"2018-07-03",144015,"INE650K01021"]
["A2ZINFRA","EQ",19.55,20.15,19.45,19.85,19.8,19.8,178186,3536462.6,"2018-07-03",897,"INE619I01012"]
["AARTIDRUGS","EQ",537,558.05,527.85,537.8,536.2,537.7,15925,8638398.7,"2018-07-03",1440,"INE767A01016"]
["AARTIIND","EQ",1201.05,1219.3,1187,1215.65,1209,1201.05,13905,16758765.1,"2018-07-03",1189,"INE769A01020"]
["AARVEEDEN","EQ",30.4,31.9,29.05,31.45,31.4,30.4,9311,288912.55,"2018-07-03",155,"INE273D01019"]
["ABAN","EQ",109.7,120.45,107.5,116.2,116.1,109.65,2012079,230918148.6,"2018-07-03",21649,"INE421A01028"]
["ABB","EQ",1175.6,1188.6,1170,1173.55,1172,1181.5,19620,23136527.4,"2018-07-03",2358,"INE117A01022"]
["ABBOTINDIA","EQ",7135,7198.95,7037.05,7091.6,7060,7156.65,3270,23179547.05,"2018-07-03",1050,"INE358A01014"]
["ABCAPITAL","EQ",129.3,131,128.5,129.75,130,129.35,721282,93481700.4,"2018-07-03",8113,"INE674K01013"]
["ABFRL","EQ",137.5,140.4,136.15,139.55,140,137.45,202360,27883114.45,"2018-07-03",3866,"INE647O01011"]
["ACC","EQ",1318,1343,1302,1332.85,1334.5,1320.15,284242,377171940.9,"2018-07-03",10684,"INE012A01025"]
["ACCELYA","EQ",1190,1190,1152.6,1172.9,1163.05,1173.55,523,612491.25,"2018-07-03",149,"INE793A01012"]
{"$rows_left_out":1625}
{"sheet":"Sheet1","index":8,"n_rows":0,"n_cols":0,"rows_kept":0,"hidden":true}

{"sheet":"Sheet3","index":9,"n_rows":0,"n_cols":0,"rows_kept":0,"hidden":true}