{"text_format":"3","workbook":"xlsx","n_sheets":10,"sheets":["Main","Future Intra","Cash Intra","MidCap Intra","Bulk Deals","Call Tracker (Equity & F&O)","Sheet2","Sheet1","Sheet3","Sheet4"],"not_rendered":{"images":4,"defined_names":4},"read":"whole","date_system":"1900"}

{"sheet":"Main","index":0,"n_rows":17,"n_cols":4,"rows_kept":17}
[null,"                                                                                                 "]
{"$rows_empty":8}
[null,"2019-04-04"]
[]
[null,"Sheet No.","Template Name","Summary"]
[null,1,"Future Intra","For Intraday trading in F&O segment"]
[null,2,"Cash Intra","For Intraday trading in cash market segment"]
[null,3,"Mid-cap Intra","For Intraday trading in Mid-cap stocks"]
[null,4,"Bulk Deals","Reveals Bulk Deals carried on NSE & BSE"]
[null,5,"Call Tracker"]

{"sheet":"Future Intra","index":1,"n_rows":236,"n_cols":15,"rows_kept":236,"merged":[[8,0,9,0],[8,1,9,1],[8,2,9,2],[8,5,8,7],[8,8,8,10]]}
[]
[]
[]
[]
[{"$nulls":12},"Back to Main Page"]
["FOR INTRA DAY TRADING",{"$nulls":10},{"$f":"Main!B10","v":"2019-04-04"}]
[]
[]
["Sr.no","Sector","Scrip","CLOSE RATE","Pivot Point","Supports",null,null,"Resistances"]
[null,"Sector",null,"Point","Point","S1","S2","S3","R1","R2","R3","HIGH","LOW","OI","% Change in OI"]
[1,"Index","BANKNIFTY",{"v":30330.9,"d":"30330.90"},{"v":30440.216666666664,"d":"30440.22"},{"v":30151.433333333327,"d":"30151.43"},{"v":29971.966666666664,"d":"29971.97"},{"v":29683.183333333327,"d":"29683.18"},{"v":30619.683333333327,"d":"30619.68"},{"v":30908.46666666666,"d":"30908.47"},{"v":31087.933333333327,"d":"31087.93"},30729,30260.75,2066500,{"v":-0.030758695733743575,"d":"-3.08%"}]
[2,"Index","NIFTY",11729.65,{"v":11759.6,"d":"11759.60"},{"v":11685.050000000001,"d":"11685.05"},11640.45,{"v":11565.900000000001,"d":"11565.90"},{"v":11804.2,"d":"11804.20"},11878.75,11923.35,11834.15,11715,16804050,{"v":-0.01307362282069579,"d":"-1.31%"}]
[3,"Index","NIFTYIT",{"v":16067,"d":"16067.00"},{"v":16046.333333333334,"d":"16046.33"},{"v":15973.666666666668,"d":"15973.67"},{"v":15880.333333333334,"d":"15880.33"},{"v":15807.666666666668,"d":"15807.67"},{"v":16139.666666666668,"d":"16139.67"},{"v":16212.333333333336,"d":"16212.33"},{"v":16305.666666666668,"d":"16305.67"},16119,15953,16200,{"v":-0.10743801652892562,"d":"-10.74%"}]
[4,"Cement","ACC",{"v":1632.4,"d":"1632.40"},{"v":1638.0833333333333,"d":"1638.08"},{"v":1621.0666666666666,"d":"1621.07"},{"v":1609.7333333333333,"d":"1609.73"},{"v":1592.7166666666667,"d":"1592.72"},{"v":1649.4166666666665,"d":"1649.42"},{"v":1666.4333333333334,"d":"1666.43"},{"v":1677.7666666666664,"d":"1677.77"},1655.1,1626.75,2530800,{"v":0.0438871473354232,"d":"4.39%"}]
[5,"Others","ADANIENT",148.25,{"v":149.53333333333333,"d":"149.53"},{"v":145.91666666666666,"d":"145.92"},{"v":143.58333333333331,"d":"143.58"},{"v":139.96666666666664,"d":"139.97"},{"v":151.86666666666667,"d":"151.87"},{"v":155.48333333333335,"d":"155.48"},{"v":157.8166666666667,"d":"157.82"},153.15,147.2,41136000,{"v":-0.006376811594202898,"d":"-0.64%"}]
[6,"Others","ADANIPORTS",383.55,{"v":384.51666666666665,"d":"384.52"},{"v":381.0333333333333,"d":"381.03"},{"v":378.51666666666665,"d":"378.52"},{"v":375.0333333333333,"d":"375.03"},{"v":387.0333333333333,"d":"387.03"},{"v":390.51666666666665,"d":"390.52"},{"v":393.0333333333333,"d":"393.03"},388,382,21270000,{"v":-0.011042659537370684,"d":"-1.10%"}]
[7,"Power","ADANIPOWER",49.75,{"v":50,"d":"50.00"},{"v":49,"d":"49.00"},48.25,47.25,50.75,51.75,{"v":52.5,"d":"52.50"},51,49.25,154880000,{"v":-3.730863244564518E-3,"d":"-0.37%"}]
[8,"Pharma","AJANTPHARM",1017.85,{"v":1022.6166666666667,"d":"1022.62"},{"v":1009.2333333333333,"d":"1009.23"},{"v":1000.6166666666667,"d":"1000.62"},{"v":987.2333333333333,"d":"987.23"},{"v":1031.2333333333333,"d":"1031.23"},{"v":1044.6166666666668,"d":"1044.62"},{"v":1053.2333333333333,"d":"1053.23"},1036,1014,732500,{"v":0.008953168044077135,"d":"0.90%"}]
[9,"Banking","ALBK",{"v":52.7,"d":"52.70"},{"v":53.550000000000004,"d":"53.55"},{"v":51.400000000000006,"d":"51.40"},{"v":50.1,"d":"50.10"},47.95,{"v":54.85000000000001,"d":"54.85"},{"v":57,"d":"57.00"},{"v":58.30000000000001,"d":"58.30"},55.7,52.25,26078000,{"v":-0.03185328185328185,"d":"-3.19%"}]
[10,"Automobile","AMARAJABAT",{"v":675.1,"d":"675.10"},{"v":691.0499999999998,"d":"691.05"},{"v":636.5999999999997,"d":"636.60"},{"v":598.0999999999998,"d":"598.10"},{"v":543.6499999999996,"d":"543.65"},{"v":729.5499999999997,"d":"729.55"},{"v":783.9999999999998,"d":"784.00"},{"v":822.4999999999998,"d":"822.50"},745.5,652.55,1892800,{"v":0.3725888324873096,"d":"37.26%"}]
{"$rows_left_out":207}
{"sheet":"Cash Intra","index":2,"n_rows":247,"n_cols":13,"rows_kept":247,"merged":[[7,0,8,0],[7,1,8,1],[7,2,8,2],[7,3,8,3],[7,4,7,6],[7,7,7,9]]}
[]
[]
[]
[]
[{"$nulls":12},"Back to Main Page"]
["FOR INTRA DAY TRADING",{"$nulls":9},{"$f":"Main!B10","v":"2019-04-04"}]
[]
["Sr.no","Scrip","CLOSE RATE","Pivot Point","Supports",null,null,"Resistances"]
[null,null,"Point",null,"S1","S2","S3","R1","R2","R3","HIGH","LOW","Total Trade Quanity in Lakhs"]
[1,"Nifty 50",11643.95,{"v":11678.033333333333,"d":"11678.03"},{"v":11595.066666666666,"d":"11595.07"},{"v":11546.183333333332,"d":"11546.18"},{"v":11463.216666666665,"d":"11463.22"},{"v":11726.916666666666,"d":"11726.92"},{"v":11809.883333333333,"d":"11809.88"},{"v":11858.766666666666,"d":"11858.77"},11761,11629.15]
[2,"Nifty Bank",30093.3,{"v":30244.033333333336,"d":"30244.03"},{"v":29885.516666666674,"d":"29885.52"},{"v":29677.733333333337,"d":"29677.73"},{"v":29319.216666666674,"d":"29319.22"},{"v":30451.816666666673,"d":"30451.82"},{"v":30810.333333333336,"d":"30810.33"},{"v":31018.116666666672,"d":"31018.12"},30602.55,30036.25]
[3,"Nifty CPSE",2221.9,{"v":2232.916666666667,"d":"2232.92"},{"v":2204.7833333333338,"d":"2204.78"},{"v":2187.666666666667,"d":"2187.67"},{"v":2159.5333333333338,"d":"2159.53"},{"v":2250.0333333333338,"d":"2250.03"},{"v":2278.166666666667,"d":"2278.17"},{"v":2295.2833333333338,"d":"2295.28"},2261.05,2215.8]
[4,"Nifty Infra",3208,{"v":3225.633333333333,"d":"3225.63"},{"v":3185.5666666666666,"d":"3185.57"},{"v":3163.133333333333,"d":"3163.13"},{"v":3123.0666666666666,"d":"3123.07"},{"v":3248.0666666666666,"d":"3248.07"},{"v":3288.133333333333,"d":"3288.13"},{"v":3310.5666666666666,"d":"3310.57"},3265.7,3203.2]
[5,"Nifty IT",15962.95,{"v":15945.1,"d":"15945.10"},15880.35,15797.75,{"v":15733,"d":"15733.00"},{"v":16027.7,"d":"16027.70"},16092.45,{"v":16175.050000000001,"d":"16175.05"},16009.85,15862.5]
[6,"Nifty PSE",3526.75,{"v":3547.2666666666664,"d":"3547.27"},{"v":3500.2333333333327,"d":"3500.23"},{"v":3473.7166666666662,"d":"3473.72"},{"v":3426.6833333333325,"d":"3426.68"},{"v":3573.783333333333,"d":"3573.78"},{"v":3620.8166666666666,"d":"3620.82"},{"v":3647.333333333333,"d":"3647.33"},3594.3,3520.75]
[7,"Nifty Midcap 50",5036.15,{"v":5066.283333333333,"d":"5066.28"},{"v":4995.116666666666,"d":"4995.12"},{"v":4954.083333333333,"d":"4954.08"},{"v":4882.916666666666,"d":"4882.92"},{"v":5107.316666666666,"d":"5107.32"},{"v":5178.483333333334,"d":"5178.48"},{"v":5219.5166666666655,"d":"5219.52"},5137.45,5025.25]
[8,"ABB",1332.15,1330.75,{"v":1321.5,"d":"1321.50"},1310.85,{"v":1301.6,"d":"1301.60"},{"v":1341.4,"d":"1341.40"},1350.65,{"v":1361.3000000000002,"d":"1361.30"},1340,1320.1,0.69523]
[9,"ACC",1624.6,{"v":1628.4333333333334,"d":"1628.43"},{"v":1611.8666666666668,"d":"1611.87"},{"v":1599.1333333333334,"d":"1599.13"},{"v":1582.5666666666668,"d":"1582.57"},{"v":1641.1666666666667,"d":"1641.17"},{"v":1657.7333333333333,"d":"1657.73"},{"v":1670.4666666666667,"d":"1670.47"},1645,1615.7,6.80202]
[10,"AIAENG",1726.35,{"v":1735.9666666666665,"d":"1735.97"},{"v":1700.983333333333,"d":"1700.98"},{"v":1675.6166666666663,"d":"1675.62"},{"v":1640.6333333333328,"d":"1640.63"},{"v":1761.333333333333,"d":"1761.33"},{"v":1796.3166666666666,"d":"1796.32"},{"v":1821.6833333333332,"d":"1821.68"},1770.95,1710.6,0.15308]
[11,"AUBANK",598.85,{"v":605.6333333333333,"d":"605.63"},{"v":589.2666666666667,"d":"589.27"},{"v":579.6833333333333,"d":"579.68"},{"v":563.3166666666666,"d":"563.32"},{"v":615.2166666666667,"d":"615.22"},{"v":631.5833333333333,"d":"631.58"},{"v":641.1666666666667,"d":"641.17"},622,596.05,2.22908]
{"$rows_left_out":228}
{"sheet":"MidCap Intra","index":3,"n_rows":510,"n_cols":13,"rows_kept":510,"merged":[[0,0,0,1],[8,0,9,0],[8,1,9,1],[8,2,9,2],[8,3,9,3],[8,4,8,6],[8,7,8,9]]}
[]
[]
[]
[]
[{"$nulls":11},"Back To Main Page"]
["FOR INTRA DAY TRADING",{"$nulls":9},{"$f":"Main!B10","v":"2019-04-04"}]
[null,null," "]
[]
["Sr.no","Scrip","CLOSE RATE","Pivot Point","Supports",null,null,"Resistances"]
[null,null,"Point",null,"S1","S2","S3","R1","R2","R3","HIGH","LOW","Total Trade Quanity in Lakhs"]
[1,"3MINDIA",23983.5,{"v":24120.283333333336,"d":"24120.28"},{"v":23660.266666666674,"d":"23660.27"},{"v":23337.033333333336,"d":"23337.03"},{"v":22877.016666666674,"d":"22877.02"},{"v":24443.516666666674,"d":"24443.52"},{"v":24903.533333333336,"d":"24903.53"},{"v":25226.766666666674,"d":"25226.77"},24580.3,23797.05,0.12795]
[2,"8KMILES",100.3,{"v":101.60000000000001,"d":"101.60"},{"v":98.70000000000002,"d":"98.70"},{"v":97.10000000000001,"d":"97.10"},{"v":94.20000000000002,"d":"94.20"},{"v":103.20000000000002,"d":"103.20"},{"v":106.10000000000002,"d":"106.10"},{"v":107.70000000000002,"d":"107.70"},104.5,100,1.46122]
[3,"AARTIIND",1579.6,{"v":1579.8666666666668,"d":"1579.87"},{"v":1564.7333333333336,"d":"1564.73"},{"v":1549.8666666666668,"d":"1549.87"},{"v":1534.7333333333336,"d":"1534.73"},{"v":1594.7333333333336,"d":"1594.73"},{"v":1609.8666666666668,"d":"1609.87"},{"v":1624.7333333333336,"d":"1624.73"},1595,1565,1.31922]
[4,"ABAN",58.45,{"v":58.76666666666667,"d":"58.77"},{"v":57.683333333333344,"d":"57.68"},{"v":56.91666666666667,"d":"56.92"},{"v":55.83333333333334,"d":"55.83"},{"v":59.533333333333346,"d":"59.53"},{"v":60.616666666666674,"d":"60.62"},{"v":61.38333333333335,"d":"61.38"},59.85,58,0.61356]
[5,"ABB",1332.15,1330.75,{"v":1321.5,"d":"1321.50"},1310.85,{"v":1301.6,"d":"1301.60"},{"v":1341.4,"d":"1341.40"},1350.65,{"v":1361.3000000000002,"d":"1361.30"},1340,1320.1,0.69523]
[6,"ABCAPITAL",100.3,{"v":101.26666666666667,"d":"101.27"},{"v":98.73333333333333,"d":"98.73"},{"v":97.16666666666667,"d":"97.17"},{"v":94.63333333333334,"d":"94.63"},{"v":102.83333333333333,"d":"102.83"},{"v":105.36666666666666,"d":"105.37"},{"v":106.93333333333332,"d":"106.93"},103.8,99.7,27.2246]
[7,"ABFRL",219.7,{"v":219.8166666666667,"d":"219.82"},{"v":217.98333333333338,"d":"217.98"},{"v":216.26666666666668,"d":"216.27"},{"v":214.43333333333337,"d":"214.43"},{"v":221.5333333333334,"d":"221.53"},{"v":223.3666666666667,"d":"223.37"},{"v":225.0833333333334,"d":"225.08"},221.65,218.1,3.32435]
[8,"ACC",1624.6,{"v":1628.4333333333334,"d":"1628.43"},{"v":1611.8666666666668,"d":"1611.87"},{"v":1599.1333333333334,"d":"1599.13"},{"v":1582.5666666666668,"d":"1582.57"},{"v":1641.1666666666667,"d":"1641.17"},{"v":1657.7333333333333,"d":"1657.73"},{"v":1670.4666666666667,"d":"1670.47"},1645,1615.7,6.80202]
[9,"ADANIPORTS",382,{"v":382.76666666666665,"d":"382.77"},{"v":379.2333333333333,"d":"379.23"},{"v":376.46666666666664,"d":"376.47"},{"v":372.9333333333333,"d":"372.93"},{"v":385.5333333333333,"d":"385.53"},{"v":389.0666666666666,"d":"389.07"},{"v":391.8333333333333,"d":"391.83"},386.3,380,27.01443]
[10,"ADANIPOWER",49.4,{"v":49.78333333333333,"d":"49.78"},{"v":48.61666666666666,"d":"48.62"},{"v":47.83333333333333,"d":"47.83"},{"v":46.66666666666666,"d":"46.67"},{"v":50.56666666666666,"d":"50.57"},{"v":51.733333333333334,"d":"51.73"},{"v":52.516666666666666,"d":"52.52"},50.95,49,110.39301]
{"$rows_left_out":491}
{"sheet":"Bulk Deals","index":4,"n_rows":105,"n_cols":8,"rows_kept":105,"merged":[[4,0,4,1],[4,2,4,3],[6,1,6,2]]}
[" "]
[]
[]
[]
[]
[{"$nulls":4},"Back To Main Page"]
["Subject :","BULK DEAL",null,{"$f":"Main!B10","v":"2019-04-04"}]
[]
["Date","Scrip code","Scrip Name","Client Name","Buy / Sell","Quantity Traded","Trade Price / Wt.Avg.trade price","Exchange  "]
["2019-04-03",542580,"AARTECH","RAM BALLABH KATTA","SELL",{"v":72000,"d":"72,000"},34.64,"BSE"]
["2019-04-03",542580,"AARTECH","VIPULKUMAR BIPINCHANDRA KHANDHAR","SELL",{"v":108000,"d":"108,000"},34.75,"BSE"]
["2019-04-03",542580,"AARTECH","GIRIRAJ PRASAD AGRAWAL","BUY",180000,34.71,"BSE"]
["2019-04-03",540024,"ASHARI","VIJAY KUMAR AGGARWAL","SELL",65755,8.68,"BSE"]
["2019-04-03",537766,"BCP","ACHINTYA SECURITIES PVT. LTD.","BUY",240856,39.77,"BSE"]
["2019-04-03",537766,"BCP","ACHINTYA SECURITIES PVT. LTD.","SELL",365856,39.3,"BSE"]
["2019-04-03",530067,"CSLFINANCE","RADHIKA SHARMA","SELL",39060,301.64,"BSE"]
["2019-04-03",540945,"FSSPL","PREYASH SATHVARA","BUY",76000,4.84,"BSE"]
["2019-04-03",540945,"FSSPL","PREYASH SATHVARA","SELL",76000,4.84,"BSE"]
["2019-04-03",540945,"FSSPL","VIJAY CHANDULAL THAKKAR","BUY",92000,4.83,"BSE"]
["2019-04-03",540945,"FSSPL","RAHUL R MEHTA","BUY",88000,4.84,"BSE"]
{"$rows_left_out":86}
{"sheet":"Call Tracker (Equity & F&O)","index":5,"n_rows":267,"n_cols":18,"rows_kept":267,"merged":[[25,0,26,0],[25,1,26,1],[25,2,26,2],[25,9,26,9],[25,11,26,11],[25,12,26,12],[25,13,26,13],[25,14,26,14],[28,0,29,0],[28,1,29,1],[28,2,29,2],[28,9,29,9],[28,11,29,11],[28,12,29,12],[28,13,29,13],[28,14,29,14],[30,0,31,0],[30,1,31,1],[30,2,31,2],[30,9,31,9],[30,11,31,11],[30,12,31,12],[30,13,31,13],[30,14,31,14]]}
[]
[]
[]
[]
[{"$nulls":12},"Back To Main Page"]
["Retail Research Technical Calls & Fundamental Performance Report for the month of April -2019 "]
[{"$nulls":12},{"$f":"Main!B10","v":"2019-04-04"}]
[null,"Positional  Call"]
["Sr.no","Date",null,"Company","Rec","Rec Price","Stop Loss***","Call Closed At","Target","Remark","Profit / Loss per Share","Gain / Loss  %","Status","Closed Date","NSE Closed Price"]
[1,"2019-03-07",null,"RAYMOND","Sell","825-830",888.8,null,"720-730","Open",{"$nulls":4},{"$f":"VLOOKUP(D10,Sheet2!A16:M1811,6,0)","v":809.2},null,null,"R"]
[2,"2019-03-13",null,"DLF","Sell",193,206.6,206.6,"164-168 ","Loss of Rs.13.6/-",{"$f":"F11-G11","v":-13.599999999999994},{"$f":"K11/F11","v":{"v":-0.07046632124352328,"d":"-7.05%"}},"Unsuccessful","2019-04-03",{"$nulls":3},"R"]
[3,"2019-03-15",null,"OFSS","Buy",3395,3250,3497,"3650-3700"," Profit of Rs.102/-",{"$f":"H12-F12","v":102},{"$f":"K12/F12","v":{"v":0.03004418262150221,"d":"3.00%"}},"Successful","2019-04-03",{"$nulls":3},"H"]
[4,"2019-03-20",null,"HEROMOTOCO","Buy","2610-2630",2490,null,"2850-2900","Open",{"$nulls":4},{"$f":"VLOOKUP(D13,Sheet2!A19:M1814,6,0)","v":2580.45},null,null,"H"]
[5,"2019-03-25",null,"MARUTI","Buy",6600,6290,6940,"7000-7100"," Profit of Rs.340/-",{"$f":"H14-F14","v":340},{"$f":"K14/F14","v":{"v":0.051515151515151514,"d":"5.15%"}},"Successful","2019-04-03",{"$nulls":3},"R"]
[6,"2019-04-01",null,"WIPRO","Buy","257-259",248,null,280,"Open",{"$nulls":4},{"$f":"VLOOKUP(D15,Sheet2!A21:M1816,6,0)","v":261.65},null,null,"H"]
[7,"2019-04-03",null,"BOSCHLTD","Buy","17950-18000",16850,null,"19500-20000","Open",{"$nulls":4},{"$f":"VLOOKUP(D16,Sheet2!A22:M1817,6,0)","v":18005.95},null,null,"R"]
[]
[]
[]
[]
{"$rows_left_out":217}
{"sheet":"Sheet2","index":6,"n_rows":1641,"n_cols":14,"rows_kept":1641,"hidden":true}
["SYMBOL","SERIES","OPEN","HIGH","LOW","CLOSE","LAST","PREVCLOSE","TOTTRDQTY","TOTTRDVAL","TIMESTAMP","TOTALTRADES","ISIN","ISIN"]
["20MICRONS","EQ",40,40.05,38.6,39.2,39,39.5,6254,247486.65,"2019-04-03",188,"INE144J01027"]
["21STCENMGM","EQ",20.3,20.3,20.3,20.3,20.3,19.95,691,14027.3,"2019-04-03",5,"INE253B01015"]
["3IINFOTECH","EQ",3.75,3.8,3.65,3.7,3.7,3.8,1256037,4684680.15,"2019-04-03",533,"INE748C01020"]
["3MINDIA","EQ",24305,24580.3,23797.05,23983.5,23960,24304,12795,310609992.8,"2019-04-03",1042,"INE470A01017"]
["3PLAND","EQ",11.15,11.15,10.95,11.1,11.15,10.65,1243,13817.1,"2019-04-03",17,"INE105C01023"]
["5PAISA","EQ",232.95,236.55,229.25,233.1,230.55,229.95,7244,1681505.75,"2019-04-03",256,"INE618L01018"]
["63MOONS","EQ",82.9,83.3,80.3,80.8,80.7,82.4,88969,7291917.15,"2019-04-03",1843,"INE111B01023"]
["8KMILES","EQ",104.2,104.5,100,100.3,100.95,102.55,146122,14891138.2,"2019-04-03",2111,"INE650K01021"]
["A2ZINFRA","EQ",18.2,18.2,17.15,17.25,17.2,17.9,193260,3400930.5,"2019-04-03",439,"INE619I01012"]
["AARTIDRUGS","EQ",619.55,629,618.95,621.5,621,618.95,9848,6135257.3,"2019-04-03",902,"INE767A01016"]
["AARTIIND","EQ",1580,1595,1565,1579.6,1580,1589.2,131922,208661829.05,"2019-04-03",5968,"INE769A01020"]
["AARVEEDEN","EQ",23.85,23.85,23.15,23.45,23.45,23.4,2030,47521.25,"2019-04-03",42,"INE273D01019"]
["AAVAS","EQ",1155,1172,1115,1159.6,1160,1160.1,43959,49801640.95,"2019-04-03",4128,"INE216P01012"]
["ABAN","BE",59.85,59.85,58,58.45,58.6,58.8,61356,3597602,"2019-04-03",466,"INE421A01028"]
["ABB","EQ",1328.8,1340,1320.1,1332.15,1330,1322.4,69523,92523540.05,"2019-04-03",6934,"INE117A01022"]
["ABBOTINDIA","EQ",7310.25,7370,7310,7329,7330,7309.2,923,6765979.75,"2019-04-03",326,"INE358A01014"]
["ABCAPITAL","EQ",103,103.8,99.7,100.3,100.3,103,2722460,276738137.8,"2019-04-03",17024,"INE674K01013"]
["ABFRL","EQ",220,221.65,218.1,219.7,219.4,219.95,332435,72936899.55,"2019-04-03",5720,"INE647O01011"]
["ACC","EQ",1627.9,1645,1615.7,1624.6,1620.55,1617.35,680202,1106819788.05,"2019-04-03",34769,"INE012A01025"]
{"$rows_left_out":1622}
{"sheet":"Sheet1","index":7,"n_rows":0,"n_cols":0,"rows_kept":0,"hidden":true}

{"sheet":"Sheet3","index":8,"n_rows":0,"n_cols":0,"rows_kept":0,"hidden":true}

{"sheet":"Sheet4","index":9,"n_rows":0,"n_cols":0,"rows_kept":0,"hidden":true}