{"text_format":"3","workbook":"xlsx","n_sheets":8,"sheets":["Main","Future Intra","Cash Intra","MidCap Intra","Bulk Deals","Call Tracker (Equity & F&O)","Sheet2","Sheet1"],"not_rendered":{"images":4,"defined_names":4},"read":"whole","date_system":"1900"}

{"sheet":"Main","index":0,"n_rows":17,"n_cols":4,"rows_kept":17}
[null,"                                                                                                 "]
{"$rows_empty":8}
[null,"2019-01-04"]
[]
[null,"Sheet No.","Template Name","Summary"]
[null,1,"Future Intra","For Intraday trading in F&O segment"]
[null,2,"Cash Intra","For Intraday trading in cash market segment"]
[null,3,"Mid-cap Intra","For Intraday trading in Mid-cap stocks"]
[null,4,"Bulk Deals","Reveals Bulk Deals carried on NSE & BSE"]
[null,5,"Call Tracker"]

{"sheet":"Future Intra","index":1,"n_rows":240,"n_cols":15,"rows_kept":240,"merged":[[8,0,9,0],[8,1,9,1],[8,2,9,2],[8,5,8,7],[8,8,8,10]]}
[]
[]
[]
[]
[{"$nulls":12},"Back to Main Page"]
["FOR INTRA DAY TRADING",{"$nulls":10},{"$f":"Main!B10","v":"2019-01-04"}]
[]
[]
["Sr.no","Sector","Scrip","CLOSE RATE","Pivot Point","Supports",null,null,"Resistances"]
[null,"Sector",null,"Point","Point","S1","S2","S3","R1","R2","R3","HIGH","LOW","OI","% Change in OI"]
[1,"Index","BANKNIFTY",27097.45,{"v":27159.71666666667,"d":"27159.72"},{"v":27000.03333333334,"d":"27000.03"},{"v":26902.61666666667,"d":"26902.62"},{"v":26742.933333333338,"d":"26742.93"},{"v":27257.133333333342,"d":"27257.13"},{"v":27416.81666666667,"d":"27416.82"},{"v":27514.233333333344,"d":"27514.23"},27319.4,27062.3,1419500,{"v":-0.0853029873443823,"d":"-8.53%"}]
[2,"Index","NIFTY",{"v":10718.5,"d":"10718.50"},{"v":10762.833333333334,"d":"10762.83"},{"v":10665.716666666667,"d":"10665.72"},{"v":10612.933333333332,"d":"10612.93"},{"v":10515.816666666666,"d":"10515.82"},{"v":10815.616666666669,"d":"10815.62"},{"v":10912.733333333334,"d":"10912.73"},{"v":10965.51666666667,"d":"10965.52"},10859.95,10710.05,26150850,{"v":0.04816701988546693,"d":"4.82%"}]
[3,"Index","NIFTYIT",{"v":14355,"d":"14355.00"},{"v":14417.333333333334,"d":"14417.33"},{"v":14257.666666666668,"d":"14257.67"},{"v":14160.333333333334,"d":"14160.33"},{"v":14000.666666666668,"d":"14000.67"},{"v":14514.666666666668,"d":"14514.67"},{"v":14674.333333333336,"d":"14674.33"},{"v":14771.666666666668,"d":"14771.67"},14577,14320,22650,{"v":0.1325,"d":"13.25%"}]
[4,"Cement","ACC",1456.85,{"v":1469.1833333333334,"d":"1469.18"},{"v":1439.4666666666667,"d":"1439.47"},{"v":1422.0833333333333,"d":"1422.08"},{"v":1392.3666666666666,"d":"1392.37"},{"v":1486.5666666666668,"d":"1486.57"},{"v":1516.2833333333335,"d":"1516.28"},{"v":1533.666666666667,"d":"1533.67"},1498.9,1451.8,1299600,{"v":0.016265248670628715,"d":"1.63%"}]
[5,"Others","ADANIENT",152.95,{"v":153.46666666666667,"d":"153.47"},{"v":150.18333333333334,"d":"150.18"},{"v":147.41666666666666,"d":"147.42"},{"v":144.13333333333333,"d":"144.13"},{"v":156.23333333333335,"d":"156.23"},{"v":159.5166666666667,"d":"159.52"},{"v":162.28333333333336,"d":"162.28"},156.75,150.7,34768000,{"v":0.011403304631138002,"d":"1.14%"}]
[6,"Others","ADANIPORTS",{"v":380.4,"d":"380.40"},382.25,{"v":377.3,"d":"377.30"},{"v":374.2,"d":"374.20"},369.25,385.35,{"v":390.30000000000007,"d":"390.30"},{"v":393.40000000000003,"d":"393.40"},387.2,379.15,22955000,{"v":4.3582479843103073E-4,"d":"0.04%"}]
[7,"Power","ADANIPOWER",{"v":50.9,"d":"50.90"},{"v":50.48333333333333,"d":"50.48"},{"v":49.41666666666666,"d":"49.42"},{"v":47.93333333333333,"d":"47.93"},{"v":46.86666666666666,"d":"46.87"},{"v":51.966666666666654,"d":"51.97"},{"v":53.03333333333333,"d":"53.03"},{"v":54.51666666666665,"d":"54.52"},51.55,49,160240000,{"v":-3.7429819089207733E-4,"d":"-0.04%"}]
[8,"Pharma","AJANTPHARM",{"v":1154,"d":"1154.00"},{"v":1160.3833333333334,"d":"1160.38"},{"v":1143.716666666667,"d":"1143.72"},{"v":1133.4333333333334,"d":"1133.43"},{"v":1116.7666666666669,"d":"1116.77"},{"v":1170.666666666667,"d":"1170.67"},{"v":1187.3333333333335,"d":"1187.33"},{"v":1197.616666666667,"d":"1197.62"},1177.05,1150.1,606000,{"v":0.05117085862966175,"d":"5.12%"}]
[9,"Banking","ALBK",44.85,{"v":45.1,"d":"45.10"},{"v":44.400000000000006,"d":"44.40"},43.95,{"v":43.25000000000001,"d":"43.25"},{"v":45.550000000000004,"d":"45.55"},{"v":46.25000000000001,"d":"46.25"},{"v":46.7,"d":"46.70"},45.8,44.65,18915000,{"v":1.3764624913971094E-3,"d":"0.14%"}]
[10,"Automobile","AMARAJABAT",717.55,{"v":721.9,"d":"721.90"},{"v":707.8,"d":"707.80"},698.05,{"v":683.9499999999999,"d":"683.95"},731.65,{"v":745.7500000000001,"d":"745.75"},{"v":755.5,"d":"755.50"},736,712.15,1027600,{"v":-0.042400521852576645,"d":"-4.24%"}]
{"$rows_left_out":211}
{"sheet":"Cash Intra","index":2,"n_rows":247,"n_cols":13,"rows_kept":247,"merged":[[7,0,8,0],[7,1,8,1],[7,2,8,2],[7,3,8,3],[7,4,7,6],[7,7,7,9]]}
[]
[]
[]
[]
[{"$nulls":12},"Back to Main Page"]
["FOR INTRA DAY TRADING",{"$nulls":9},{"$f":"Main!B10","v":"2019-01-04"}]
[]
["Sr.no","Scrip","CLOSE RATE","Pivot Point","Supports",null,null,"Resistances"]
[null,null,"Point",null,"S1","S2","S3","R1","R2","R3","HIGH","LOW","Total Trade Quanity in Lakhs"]
[1,"Nifty 50",10672.25,10715.85,{"v":10617.650000000001,"d":"10617.65"},{"v":10563.050000000001,"d":"10563.05"},{"v":10464.850000000002,"d":"10464.85"},10770.45,{"v":10868.650000000001,"d":"10868.65"},10923.25,10814.05,10661.25]
[2,"Nifty Bank",26959.85,{"v":27029.933333333334,"d":"27029.93"},{"v":26853.666666666668,"d":"26853.67"},{"v":26747.483333333334,"d":"26747.48"},{"v":26571.216666666667,"d":"26571.22"},{"v":27136.11666666667,"d":"27136.12"},{"v":27312.38333333333,"d":"27312.38"},{"v":27418.56666666667,"d":"27418.57"},27206.2,26923.75]
[3,"Nifty CPSE",2004.1,{"v":2014.0666666666666,"d":"2014.07"},{"v":1991.2333333333331,"d":"1991.23"},{"v":1978.3666666666666,"d":"1978.37"},{"v":1955.533333333333,"d":"1955.53"},{"v":2026.9333333333332,"d":"2026.93"},{"v":2049.7666666666664,"d":"2049.77"},{"v":2062.633333333333,"d":"2062.63"},2036.9,2001.2]
[4,"Nifty Infra",3104.05,{"v":3118.5166666666664,"d":"3118.52"},{"v":3085.183333333333,"d":"3085.18"},{"v":3066.3166666666666,"d":"3066.32"},{"v":3032.983333333333,"d":"3032.98"},{"v":3137.3833333333328,"d":"3137.38"},{"v":3170.7166666666667,"d":"3170.72"},{"v":3189.5833333333326,"d":"3189.58"},3151.85,3099.65]
[5,"Nifty IT",14322.15,{"v":14380.316666666666,"d":"14380.32"},{"v":14218.333333333332,"d":"14218.33"},{"v":14114.516666666666,"d":"14114.52"},{"v":13952.533333333333,"d":"13952.53"},{"v":14484.133333333331,"d":"14484.13"},{"v":14646.116666666665,"d":"14646.12"},{"v":14749.93333333333,"d":"14749.93"},14542.3,14276.5]
[6,"Nifty PSE",3290,{"v":3303.8000000000006,"d":"3303.80"},{"v":3271.2500000000014,"d":"3271.25"},{"v":3252.500000000001,"d":"3252.50"},{"v":3219.9500000000016,"d":"3219.95"},{"v":3322.550000000001,"d":"3322.55"},{"v":3355.1000000000004,"d":"3355.10"},{"v":3373.850000000001,"d":"3373.85"},3336.35,3285.05]
[7,"Nifty Midcap 50",4806,{"v":4829.599999999999,"d":"4829.60"},{"v":4774.899999999999,"d":"4774.90"},{"v":4743.799999999999,"d":"4743.80"},{"v":4689.0999999999985,"d":"4689.10"},{"v":4860.699999999999,"d":"4860.70"},{"v":4915.4,"d":"4915.40"},{"v":4946.499999999999,"d":"4946.50"},4884.3,4798.5]
[8,"ABB",1308.95,{"v":1313.7166666666665,"d":"1313.72"},{"v":1297.433333333333,"d":"1297.43"},{"v":1285.9166666666665,"d":"1285.92"},{"v":1269.633333333333,"d":"1269.63"},{"v":1325.233333333333,"d":"1325.23"},{"v":1341.5166666666662,"d":"1341.52"},{"v":1353.0333333333328,"d":"1353.03"},1330,1302.2,0.51343]
[9,"ACC",1452.25,1463.45,{"v":1434.2,"d":"1434.20"},1416.15,{"v":1386.9,"d":"1386.90"},{"v":1481.5,"d":"1481.50"},1510.75,{"v":1528.8,"d":"1528.80"},1492.7,1445.4,4.5197]
[10,"AIAENG",1677.6,{"v":1672.0166666666667,"d":"1672.02"},{"v":1645.0833333333333,"d":"1645.08"},{"v":1612.5666666666666,"d":"1612.57"},{"v":1585.6333333333332,"d":"1585.63"},{"v":1704.5333333333333,"d":"1704.53"},{"v":1731.4666666666667,"d":"1731.47"},{"v":1763.9833333333333,"d":"1763.98"},1698.95,1639.5,0.24721]
[11,"AUBANK",621.35,{"v":621.9333333333334,"d":"621.93"},{"v":615.5666666666668,"d":"615.57"},{"v":609.7833333333334,"d":"609.78"},{"v":603.4166666666669,"d":"603.42"},{"v":627.7166666666668,"d":"627.72"},{"v":634.0833333333334,"d":"634.08"},{"v":639.8666666666668,"d":"639.87"},628.3,616.15,1.33626]
{"$rows_left_out":228}
{"sheet":"MidCap Intra","index":3,"n_rows":510,"n_cols":13,"rows_kept":510,"merged":[[0,0,0,1],[8,0,9,0],[8,1,9,1],[8,2,9,2],[8,3,9,3],[8,4,8,6],[8,7,8,9]]}
[]
[]
[]
[]
[{"$nulls":11},"Back To Main Page"]
["FOR INTRA DAY TRADING",{"$nulls":9},{"$f":"Main!B10","v":"2019-01-04"}]
[null,null," "]
[]
["Sr.no","Scrip","CLOSE RATE","Pivot Point","Supports",null,null,"Resistances"]
[null,null,"Point",null,"S1","S2","S3","R1","R2","R3","HIGH","LOW","Total Trade Quanity in Lakhs"]
[1,"3MINDIA",19990.25,{"v":20020.6,"d":"20020.60"},{"v":19771.249999999996,"d":"19771.25"},{"v":19552.249999999996,"d":"19552.25"},{"v":19302.899999999994,"d":"19302.90"},{"v":20239.6,"d":"20239.60"},{"v":20488.950000000004,"d":"20488.95"},20707.95,20269.95,19801.6,0.02402]
[2,"8KMILES",133.9,{"v":135.53333333333333,"d":"135.53"},{"v":131.16666666666666,"d":"131.17"},{"v":128.43333333333334,"d":"128.43"},{"v":124.06666666666666,"d":"124.07"},{"v":138.26666666666665,"d":"138.27"},{"v":142.63333333333333,"d":"142.63"},{"v":145.36666666666665,"d":"145.37"},139.9,132.8,1.8523]
[3,"AARTIIND",1429.15,{"v":1433.5166666666667,"d":"1433.52"},{"v":1417.6333333333332,"d":"1417.63"},{"v":1406.1166666666666,"d":"1406.12"},{"v":1390.2333333333331,"d":"1390.23"},{"v":1445.0333333333333,"d":"1445.03"},{"v":1460.916666666667,"d":"1460.92"},{"v":1472.4333333333334,"d":"1472.43"},1449.4,1422,0.20952]
[4,"ABAN",73.5,{"v":73.86666666666666,"d":"73.87"},{"v":72.73333333333332,"d":"72.73"},{"v":71.96666666666665,"d":"71.97"},{"v":70.83333333333331,"d":"70.83"},{"v":74.63333333333333,"d":"74.63"},{"v":75.76666666666668,"d":"75.77"},{"v":76.53333333333333,"d":"76.53"},75,73.1,3.78438]
[5,"ABB",1308.95,{"v":1313.7166666666665,"d":"1313.72"},{"v":1297.433333333333,"d":"1297.43"},{"v":1285.9166666666665,"d":"1285.92"},{"v":1269.633333333333,"d":"1269.63"},{"v":1325.233333333333,"d":"1325.23"},{"v":1341.5166666666662,"d":"1341.52"},{"v":1353.0333333333328,"d":"1353.03"},1330,1302.2,0.51343]
[6,"ABCAPITAL",98.25,{"v":98.85000000000001,"d":"98.85"},{"v":96.70000000000002,"d":"96.70"},95.15,{"v":93.00000000000001,"d":"93.00"},{"v":100.40000000000002,"d":"100.40"},{"v":102.55000000000003,"d":"102.55"},{"v":104.10000000000002,"d":"104.10"},101,97.3,50.29127]
[7,"ABFRL",197.75,{"v":197.20000000000002,"d":"197.20"},{"v":194.60000000000002,"d":"194.60"},{"v":191.45000000000002,"d":"191.45"},{"v":188.85000000000002,"d":"188.85"},{"v":200.35000000000002,"d":"200.35"},202.95,{"v":206.10000000000002,"d":"206.10"},199.8,194.05,6.37477]
[8,"ACC",1452.25,1463.45,{"v":1434.2,"d":"1434.20"},1416.15,{"v":1386.9,"d":"1386.90"},{"v":1481.5,"d":"1481.50"},1510.75,{"v":1528.8,"d":"1528.80"},1492.7,1445.4,4.5197]
[9,"ADANIPORTS",378.1,{"v":380,"d":"380.00"},{"v":374.7,"d":"374.70"},{"v":371.3,"d":"371.30"},{"v":366,"d":"366.00"},{"v":383.4,"d":"383.40"},{"v":388.69999999999993,"d":"388.70"},{"v":392.09999999999997,"d":"392.10"},385.3,376.6,19.02063]
[10,"ADANIPOWER",50.35,{"v":50,"d":"50.00"},49.15,{"v":47.949999999999996,"d":"47.95"},{"v":47.099999999999994,"d":"47.10"},{"v":51.2,"d":"51.20"},52.05,{"v":53.25000000000001,"d":"53.25"},50.85,48.8,71.13733]
{"$rows_left_out":491}
{"sheet":"Bulk Deals","index":4,"n_rows":60,"n_cols":8,"rows_kept":60,"merged":[[4,0,4,1],[4,2,4,3],[6,1,6,2]]}
[" "]
[]
[]
[]
[]
[{"$nulls":4},"Back To Main Page"]
["Subject :","BULK DEAL",null,{"$f":"Main!B10","v":"2019-01-04"}]
[]
["Date","Scrip code","Scrip Name","Client Name","Buy / Sell","Quantity Traded","Trade Price / Wt.Avg.trade price","Exchange  "]
["2019-01-03",530187,"ATHARVENT","KIRTILAL BABULAL GHANDHI","BUY",{"v":93000,"d":"93,000"},1.75,"BSE"]
["2019-01-03",530187,"ATHARVENT","AMAN SHREE TRADING AND REAL ESTATE PRIVATE LIMITED","SELL",{"v":95000,"d":"95,000"},1.75,"BSE"]
["2019-01-03",537766,"BCP","DIPESH SITARAM GORULE","BUY",{"v":343438,"d":"343,438"},35.34,"BSE"]
["2019-01-03",537766,"BCP","DIPESH SITARAM GORULE","SELL",{"v":343438,"d":"343,438"},35.44,"BSE"]
["2019-01-03",539335,"CHPLIND","RASHMI RAVI SHARMA","SELL",{"v":23280,"d":"23,280"},11.59,"BSE"]
["2019-01-03",539335,"CHPLIND","DIMPLE SURANA","BUY",{"v":43247,"d":"43,247"},11.52,"BSE"]
["2019-01-03",541703,"GFIL","MEHUL HASMUKH SHAH","BUY",{"v":28800,"d":"28,800"},58,"BSE"]
["2019-01-03",539216,"JUNCTION","GOKUL YEEPU","SELL",{"v":16000,"d":"16,000"},23.28,"BSE"]
["2019-01-03",539216,"JUNCTION","YEEPU SIDDARTH GOKUL","BUY",{"v":16000,"d":"16,000"},23.28,"BSE"]
["2019-01-03",540515,"KANUNGO","KEVAL SAVANT","BUY",{"v":103000,"d":"103,000"},12,"BSE"]
["2019-01-03",540515,"KANUNGO","HASMUKH RAJESH VAGHELA","BUY",{"v":30600,"d":"30,600"},12,"BSE"]
{"$rows_left_out":41}
{"sheet":"Call Tracker (Equity & F&O)","index":5,"n_rows":299,"n_cols":18,"rows_kept":299,"merged":[[30,0,31,0],[30,1,31,1],[30,2,31,2],[30,9,31,9],[30,11,31,11],[30,12,31,12],[30,13,31,13],[30,14,31,14],[32,0,33,0],[32,1,33,1],[32,2,33,2],[32,9,33,9],[32,11,33,11],[32,12,33,12],[32,13,33,13],[32,14,33,14]]}
[]
[]
[]
[]
[{"$nulls":12},"Back To Main Page"]
["Retail Research Technical Calls & Fundamental Performance Report for the month of January -2019 "]
[{"$nulls":12},{"$f":"Main!B10","v":"2019-01-04"}]
[null,"Positional  Call"]
["Sr.no","Date",null,"Company","Rec","Rec Price","Stop Loss***","Call Closed At","Target","Remark","Profit / Loss per Share","Gain / Loss  %","Status","Closed Date","NSE Closed Price"]
[1,"2018-12-21",null,"TATAGLOBAL","Buy",217,209,223.5,"235-240","Part Profit of Rs.6.25/-",{"$f":"H10-F10","v":6.5},{"$f":"K10/F10","v":{"v":0.029953917050691243,"d":"3.00%"}},"Successful","2018-12-24",{"$nulls":3},"H"]
[2,"2018-12-24",null,"JSWSTEEL","Buy",299.5,289,285.5,"320-325","Loss of Rs.14/-",-14,{"v":-0.04674457429048414,"d":"-4.67%"},"Unsuccessful","2019-01-03",{"$nulls":3},"H"]
[3,"2018-12-24",null,"TATAPOWER","Buy","77.2-77.4",73.7,null,"83-84","Open",{"$nulls":4},{"$f":"VLOOKUP(D12,Sheet2!A3:M1498,6,0)","v":74.2},null,null,"R"]
[4,"2018-12-27",null,"TVSMOTOR","Buy",552.5,519,571.75,"600-620","Profit of Rs.19.25/-",{"$f":"H13-F13","v":19.25},{"$f":"K13/F13","v":{"v":0.03484162895927602,"d":"3.48%"}},"Successful","2019-01-02",{"$nulls":3},"H"]
[5,"2019-01-01",null,"ASHOKLEY","Buy","100.60-101.60",96,null,"110-112","Open",{"$nulls":4},{"$f":"VLOOKUP(D14,Sheet2!A5:M1500,6,0)","v":98.15},null,null,"R"]
[6,"2019-01-03",null,"PEL","Buy","2340-2350",2222.2,null,"2565-2585","Open",{"$nulls":4},{"$f":"VLOOKUP(D15,Sheet2!A6:M1501,6,0)","v":2286.6},null,null,"R"]
{"$rows_empty":10}
["CLBS = Closing Basis ***",{"$nulls":4},"Reinitiated $"]
["Dividend adjusted <>",{"$nulls":4},"Revised stoploss #"]
["Part book {}"]
["Master Trade High Risk"]
{"$rows_left_out":206}
{"sheet":"Sheet2","index":6,"n_rows":1636,"n_cols":14,"rows_kept":1636,"hidden":true}
["SYMBOL","SERIES","OPEN","HIGH","LOW","CLOSE","LAST","PREVCLOSE","TOTTRDQTY","TOTTRDVAL","TIMESTAMP","TOTALTRADES","ISIN","ISIN"]
["20MICRONS","EQ",44.05,44.1,43.1,43.45,43.4,44.05,15741,684474.85,"2019-01-03",368,"INE144J01027"]
["21STCENMGM","EQ",23.5,23.5,23.5,23.5,23.5,23.8,49,1151.5,"2019-01-03",3,"INE253B01015"]
["3IINFOTECH","EQ",3.7,3.7,3.6,3.6,3.6,3.65,681736,2479912.6,"2019-01-03",373,"INE748C01020"]
["3MINDIA","EQ",20160,20269.95,19801.6,19990.25,19950,19985.75,2402,48003736.4,"2019-01-03",968,"INE470A01017"]
["3PLAND","EQ",11.65,12.8,11.6,11.6,11.6,12,648,7999.45,"2019-01-03",6,"INE105C01023"]
["5PAISA","EQ",280,284.25,273.75,284.25,284.25,270.75,15749,4452756.35,"2019-01-03",653,"INE618L01018"]
["63MOONS","EQ",97.4,98.6,95.6,96.45,96.3,97.2,186566,18112778.45,"2019-01-03",4295,"INE111B01023"]
["8KMILES","EQ",138,139.9,132.8,133.9,133,138.8,185230,25248433.85,"2019-01-03",3093,"INE650K01021"]
["A2ZINFRA","EQ",12.65,13.1,12.65,13.05,13.05,13,174034,2260240.75,"2019-01-03",232,"INE619I01012"]
["AARTIDRUGS","EQ",572.95,578.5,571.6,575.2,575,575.1,3358,1930200.95,"2019-01-03",161,"INE767A01016"]
["AARTIIND","EQ",1444.1,1449.4,1422,1429.15,1430,1450.7,20952,29983915.5,"2019-01-03",3527,"INE769A01020"]
["AARVEEDEN","EQ",26.55,28.8,26.1,28,28.4,27.05,22474,613365.9,"2019-01-03",143,"INE273D01019"]
["AAVAS","EQ",830.2,845.95,830.2,837.65,838,840.65,5728,4796619.75,"2019-01-03",626,"INE216P01012"]
["ABAN","EQ",74.5,75,73.1,73.5,73.3,74.1,378438,27914521.95,"2019-01-03",4519,"INE421A01028"]
["ABB","EQ",1318.9,1330,1302.2,1308.95,1308.9,1319.25,51343,67859534.65,"2019-01-03",4531,"INE117A01022"]
["ABBOTINDIA","EQ",7520.3,7574,7430,7471.95,7470,7527.05,1739,13023432.55,"2019-01-03",630,"INE358A01014"]
["ABCAPITAL","EQ",99.45,101,97.3,98.25,98.2,99.25,5029127,498654896.65,"2019-01-03",15600,"INE674K01013"]
["ABFRL","EQ",195.05,199.8,194.05,197.75,197.6,195.55,637477,126174994.25,"2019-01-03",16695,"INE647O01011"]
["ABMINTLTD","BE",16.45,16.45,16.45,16.45,16.45,16.45,218,3586.1,"2019-01-03",3,"INE251C01017"]
{"$rows_left_out":1617}
{"sheet":"Sheet1","index":7,"n_rows":0,"n_cols":0,"rows_kept":0,"hidden":true}