{"text_format":"3","workbook":"xlsx","n_sheets":8,"sheets":["Main","Future Intra","Cash Intra","MidCap Intra","Bulk Deals","Call Tracker (Equity & F&O)","Sheet2","Sheet1"],"not_rendered":{"images":4,"defined_names":4},"read":"whole","date_system":"1900"}

{"sheet":"Main","index":0,"n_rows":17,"n_cols":4,"rows_kept":17}
[null,"                                                                                                 "]
{"$rows_empty":8}
[null,"2019-01-03"]
[]
[null,"Sheet No.","Template Name","Summary"]
[null,1,"Future Intra","For Intraday trading in F&O segment"]
[null,2,"Cash Intra","For Intraday trading in cash market segment"]
[null,3,"Mid-cap Intra","For Intraday trading in Mid-cap stocks"]
[null,4,"Bulk Deals","Reveals Bulk Deals carried on NSE & BSE"]
[null,5,"Call Tracker"]

{"sheet":"Future Intra","index":1,"n_rows":240,"n_cols":15,"rows_kept":240,"merged":[[8,0,9,0],[8,1,9,1],[8,2,9,2],[8,5,8,7],[8,8,8,10]]}
[]
[]
[]
[]
[{"$nulls":12},"Back to Main Page"]
["FOR INTRA DAY TRADING",{"$nulls":10},{"$f":"Main!B10","v":"2019-01-03"}]
[]
[]
["Sr.no","Sector","Scrip","CLOSE RATE","Pivot Point","Supports",null,null,"Resistances"]
[null,"Sector",null,"Point","Point","S1","S2","S3","R1","R2","R3","HIGH","LOW","OI","% Change in OI"]
[1,"Index","BANKNIFTY",{"v":27268.5,"d":"27268.50"},{"v":27322.2,"d":"27322.20"},{"v":27121.4,"d":"27121.40"},{"v":26974.3,"d":"26974.30"},{"v":26773.5,"d":"26773.50"},{"v":27469.300000000003,"d":"27469.30"},{"v":27670.1,"d":"27670.10"},{"v":27817.200000000004,"d":"27817.20"},27523,27175.1,1551880,{"v":-0.05616036783398815,"d":"-5.62%"}]
[2,"Index","NIFTY",10830.85,{"v":10841.949999999999,"d":"10841.95"},{"v":10745.899999999998,"d":"10745.90"},{"v":10660.949999999999,"d":"10660.95"},{"v":10564.899999999998,"d":"10564.90"},{"v":10926.899999999998,"d":"10926.90"},{"v":11022.949999999997,"d":"11022.95"},{"v":11107.899999999998,"d":"11107.90"},10938,10757,24949125,{"v":0.03960860176072954,"d":"3.96%"}]
[3,"Index","NIFTYIT",{"v":14494,"d":"14494.00"},{"v":14511.333333333334,"d":"14511.33"},{"v":14391.666666666668,"d":"14391.67"},{"v":14289.333333333334,"d":"14289.33"},{"v":14169.666666666668,"d":"14169.67"},{"v":14613.666666666668,"d":"14613.67"},{"v":14733.333333333336,"d":"14733.33"},{"v":14835.666666666668,"d":"14835.67"},14631,14409,20000,{"v":0.36054421768707484,"d":"36.05%"}]
[4,"Cement","ACC",1488.35,{"v":1493.5333333333335,"d":"1493.53"},{"v":1479.066666666667,"d":"1479.07"},{"v":1469.7833333333335,"d":"1469.78"},{"v":1455.316666666667,"d":"1455.32"},{"v":1502.816666666667,"d":"1502.82"},{"v":1517.2833333333338,"d":"1517.28"},{"v":1526.566666666667,"d":"1526.57"},1508,1484.25,1278800,{"v":-0.05358200118413262,"d":"-5.36%"}]
[5,"Others","ADANIENT",155.65,{"v":155.6,"d":"155.60"},152.95,150.25,{"v":147.6,"d":"147.60"},{"v":158.29999999999998,"d":"158.30"},{"v":160.95000000000002,"d":"160.95"},{"v":163.64999999999998,"d":"163.65"},158.25,152.9,34376000,{"v":-0.003940658321743162,"d":"-0.39%"}]
[6,"Others","ADANIPORTS",{"v":383.2,"d":"383.20"},{"v":384.84999999999997,"d":"384.85"},{"v":378.29999999999995,"d":"378.30"},{"v":373.4,"d":"373.40"},{"v":366.84999999999997,"d":"366.85"},{"v":389.74999999999994,"d":"389.75"},{"v":396.3,"d":"396.30"},{"v":401.19999999999993,"d":"401.20"},391.4,379.95,22945000,{"v":-0.009497086121303691,"d":"-0.95%"}]
[7,"Power","ADANIPOWER",51.15,{"v":51.416666666666664,"d":"51.42"},{"v":50.133333333333326,"d":"50.13"},{"v":49.11666666666666,"d":"49.12"},{"v":47.83333333333332,"d":"47.83"},{"v":52.43333333333333,"d":"52.43"},{"v":53.716666666666676,"d":"53.72"},{"v":54.733333333333334,"d":"54.73"},52.7,50.4,160300000,{"v":-2.4946987651241115E-4,"d":"-0.02%"}]
[8,"Pharma","AJANTPHARM",{"v":1168.1,"d":"1168.10"},{"v":1173.9166666666667,"d":"1173.92"},{"v":1152.8333333333335,"d":"1152.83"},{"v":1137.5666666666668,"d":"1137.57"},{"v":1116.4833333333336,"d":"1116.48"},{"v":1189.1833333333334,"d":"1189.18"},{"v":1210.2666666666669,"d":"1210.27"},{"v":1225.5333333333333,"d":"1225.53"},1195,1158.65,576500,{"v":-0.09069400630914827,"d":"-9.07%"}]
[9,"Banking","ALBK",{"v":45.2,"d":"45.20"},{"v":45.800000000000004,"d":"45.80"},{"v":44.400000000000006,"d":"44.40"},{"v":43.6,"d":"43.60"},{"v":42.2,"d":"42.20"},{"v":46.60000000000001,"d":"46.60"},{"v":48,"d":"48.00"},{"v":48.80000000000001,"d":"48.80"},47.2,45,18889000,{"v":0.02108222066057625,"d":"2.11%"}]
[10,"Automobile","AMARAJABAT",{"v":736.1,"d":"736.10"},{"v":738.1166666666667,"d":"738.12"},{"v":731.9833333333333,"d":"731.98"},{"v":727.8666666666667,"d":"727.87"},{"v":721.7333333333333,"d":"721.73"},{"v":742.2333333333333,"d":"742.23"},{"v":748.3666666666668,"d":"748.37"},{"v":752.4833333333333,"d":"752.48"},744.25,734,1073100,{"v":-0.007766990291262136,"d":"-0.78%"}]
{"$rows_left_out":211}
{"sheet":"Cash Intra","index":2,"n_rows":247,"n_cols":13,"rows_kept":247,"merged":[[7,0,8,0],[7,1,8,1],[7,2,8,2],[7,3,8,3],[7,4,7,6],[7,7,7,9]]}
[]
[]
[]
[]
[{"$nulls":12},"Back to Main Page"]
["FOR INTRA DAY TRADING",{"$nulls":9},{"$f":"Main!B10","v":"2019-01-03"}]
[]
["Sr.no","Scrip","CLOSE RATE","Pivot Point","Supports",null,null,"Resistances"]
[null,null,"Point",null,"S1","S2","S3","R1","R2","R3","HIGH","LOW","Total Trade Quanity in Lakhs"]
[1,"Nifty 50",10792.5,{"v":10807.633333333333,"d":"10807.63"},{"v":10719.916666666666,"d":"10719.92"},{"v":10647.333333333332,"d":"10647.33"},{"v":10559.616666666665,"d":"10559.62"},{"v":10880.216666666667,"d":"10880.22"},{"v":10967.933333333334,"d":"10967.93"},{"v":11040.516666666668,"d":"11040.52"},10895.35,10735.05]
[2,"Nifty Bank",27174.7,{"v":27216.61666666667,"d":"27216.62"},{"v":27035.683333333338,"d":"27035.68"},{"v":26896.666666666668,"d":"26896.67"},{"v":26715.733333333337,"d":"26715.73"},{"v":27355.63333333334,"d":"27355.63"},{"v":27536.566666666673,"d":"27536.57"},{"v":27675.58333333334,"d":"27675.58"},27397.55,27077.6]
[3,"Nifty CPSE",2038.95,{"v":2039.0500000000002,"d":"2039.05"},{"v":2022.4500000000003,"d":"2022.45"},2005.95,{"v":1989.3500000000001,"d":"1989.35"},2055.55,{"v":2072.1500000000005,"d":"2072.15"},{"v":2088.6500000000005,"d":"2088.65"},2055.65,2022.55]
[4,"Nifty Infra",3143.95,{"v":3152.3333333333335,"d":"3152.33"},{"v":3118.616666666667,"d":"3118.62"},{"v":3093.2833333333333,"d":"3093.28"},{"v":3059.5666666666666,"d":"3059.57"},{"v":3177.666666666667,"d":"3177.67"},{"v":3211.383333333333,"d":"3211.38"},{"v":3236.716666666667,"d":"3236.72"},3186.05,3127]
[5,"Nifty IT",14447.1,14470.65,{"v":14347.449999999999,"d":"14347.45"},{"v":14247.8,"d":"14247.80"},{"v":14124.599999999999,"d":"14124.60"},{"v":14570.3,"d":"14570.30"},{"v":14693.5,"d":"14693.50"},14793.15,14593.85,14371]
[6,"Nifty PSE",3343.05,{"v":3347.0166666666664,"d":"3347.02"},{"v":3310.833333333333,"d":"3310.83"},{"v":3278.616666666667,"d":"3278.62"},{"v":3242.4333333333334,"d":"3242.43"},{"v":3379.2333333333327,"d":"3379.23"},{"v":3415.416666666666,"d":"3415.42"},{"v":3447.6333333333323,"d":"3447.63"},3383.2,3314.8]
[7,"Nifty Midcap 50",4860.05,{"v":4882.566666666667,"d":"4882.57"},{"v":4826.983333333334,"d":"4826.98"},{"v":4793.916666666667,"d":"4793.92"},{"v":4738.333333333334,"d":"4738.33"},{"v":4915.633333333333,"d":"4915.63"},{"v":4971.216666666667,"d":"4971.22"},{"v":5004.283333333333,"d":"5004.28"},4938.15,4849.5]
[8,"ABB",1319.25,{"v":1320.1833333333334,"d":"1320.18"},{"v":1310.3666666666668,"d":"1310.37"},{"v":1301.4833333333333,"d":"1301.48"},{"v":1291.6666666666667,"d":"1291.67"},{"v":1329.0666666666668,"d":"1329.07"},{"v":1338.8833333333334,"d":"1338.88"},{"v":1347.7666666666669,"d":"1347.77"},1330,1311.3,0.56713]
[9,"ACC",1483.95,{"v":1487.8166666666666,"d":"1487.82"},{"v":1473.6833333333332,"d":"1473.68"},{"v":1463.4166666666665,"d":"1463.42"},{"v":1449.283333333333,"d":"1449.28"},{"v":1498.0833333333333,"d":"1498.08"},{"v":1512.2166666666665,"d":"1512.22"},{"v":1522.4833333333333,"d":"1522.48"},1501.95,1477.55,6.69181]
[10,"AIAENG",1652.55,{"v":1651.8333333333333,"d":"1651.83"},{"v":1629.8166666666666,"d":"1629.82"},{"v":1607.0833333333333,"d":"1607.08"},{"v":1585.0666666666666,"d":"1585.07"},{"v":1674.5666666666666,"d":"1674.57"},{"v":1696.5833333333335,"d":"1696.58"},{"v":1719.3166666666666,"d":"1719.32"},1673.85,1629.1,0.1391]
[11,"AUBANK",620.25,618.95,{"v":613.2500000000001,"d":"613.25"},{"v":606.2500000000001,"d":"606.25"},{"v":600.5500000000002,"d":"600.55"},625.95,{"v":631.6499999999999,"d":"631.65"},638.65,624.65,611.95,1.66148]
{"$rows_left_out":228}
{"sheet":"MidCap Intra","index":3,"n_rows":510,"n_cols":13,"rows_kept":510,"merged":[[0,0,0,1],[8,0,9,0],[8,1,9,1],[8,2,9,2],[8,3,9,3],[8,4,8,6],[8,7,8,9]]}
[]
[]
[]
[]
[{"$nulls":11},"Back To Main Page"]
["FOR INTRA DAY TRADING",{"$nulls":9},{"$f":"Main!B10","v":"2019-01-03"}]
[null,null," "]
[]
["Sr.no","Scrip","CLOSE RATE","Pivot Point","Supports",null,null,"Resistances"]
[null,null,"Point",null,"S1","S2","S3","R1","R2","R3","HIGH","LOW","Total Trade Quanity in Lakhs"]
[1,"3MINDIA",19985.75,{"v":20201.516666666666,"d":"20201.52"},{"v":19736.683333333334,"d":"19736.68"},{"v":19487.61666666667,"d":"19487.62"},{"v":19022.783333333336,"d":"19022.78"},{"v":20450.583333333332,"d":"20450.58"},{"v":20915.416666666668,"d":"20915.42"},{"v":21164.48333333333,"d":"21164.48"},20666.35,19952.45,0.08642]
[2,"8KMILES",138.8,{"v":140.01666666666668,"d":"140.02"},{"v":137.03333333333336,"d":"137.03"},{"v":135.26666666666668,"d":"135.27"},{"v":132.28333333333336,"d":"132.28"},{"v":141.78333333333336,"d":"141.78"},{"v":144.76666666666665,"d":"144.77"},{"v":146.53333333333336,"d":"146.53"},143,138.25,2.15557]
[3,"AARTIIND",1450.7,{"v":1445.2833333333335,"d":"1445.28"},{"v":1436.616666666667,"d":"1436.62"},{"v":1422.5333333333335,"d":"1422.53"},{"v":1413.866666666667,"d":"1413.87"},{"v":1459.366666666667,"d":"1459.37"},{"v":1468.0333333333335,"d":"1468.03"},{"v":1482.116666666667,"d":"1482.12"},1453.95,1431.2,0.27836]
[4,"ABAN",74.1,{"v":74.16666666666666,"d":"74.17"},{"v":73.03333333333332,"d":"73.03"},{"v":71.96666666666665,"d":"71.97"},{"v":70.83333333333331,"d":"70.83"},{"v":75.23333333333332,"d":"75.23"},{"v":76.36666666666665,"d":"76.37"},{"v":77.43333333333332,"d":"77.43"},75.3,73.1,4.13245]
[5,"ABB",1319.25,{"v":1320.1833333333334,"d":"1320.18"},{"v":1310.3666666666668,"d":"1310.37"},{"v":1301.4833333333333,"d":"1301.48"},{"v":1291.6666666666667,"d":"1291.67"},{"v":1329.0666666666668,"d":"1329.07"},{"v":1338.8833333333334,"d":"1338.88"},{"v":1347.7666666666669,"d":"1347.77"},1330,1311.3,0.56713]
[6,"ABCAPITAL",99.25,{"v":99.89999999999999,"d":"99.90"},{"v":98.34999999999998,"d":"98.35"},{"v":97.44999999999999,"d":"97.45"},{"v":95.89999999999998,"d":"95.90"},{"v":100.79999999999998,"d":"100.80"},102.35,{"v":103.24999999999999,"d":"103.25"},101.45,99,17.28162]
[7,"ABFRL",195.55,{"v":196.98333333333335,"d":"196.98"},{"v":193.1166666666667,"d":"193.12"},{"v":190.68333333333337,"d":"190.68"},{"v":186.81666666666672,"d":"186.82"},{"v":199.41666666666669,"d":"199.42"},{"v":203.28333333333336,"d":"203.28"},{"v":205.71666666666667,"d":"205.72"},200.85,194.55,8.54111]
[8,"ACC",1483.95,{"v":1487.8166666666666,"d":"1487.82"},{"v":1473.6833333333332,"d":"1473.68"},{"v":1463.4166666666665,"d":"1463.42"},{"v":1449.283333333333,"d":"1449.28"},{"v":1498.0833333333333,"d":"1498.08"},{"v":1512.2166666666665,"d":"1512.22"},{"v":1522.4833333333333,"d":"1522.48"},1501.95,1477.55,6.69181]
[9,"ADANIPORTS",381.3,382.75,376.55,{"v":371.8,"d":"371.80"},{"v":365.6,"d":"365.60"},{"v":387.5,"d":"387.50"},{"v":393.70000000000005,"d":"393.70"},398.45,388.95,378,15.06543]
[10,"ADANIPOWER",50.55,{"v":50.6,"d":"50.60"},{"v":50.150000000000006,"d":"50.15"},{"v":49.75000000000001,"d":"49.75"},{"v":49.30000000000001,"d":"49.30"},{"v":51,"d":"51.00"},51.45,{"v":51.849999999999994,"d":"51.85"},51.05,50.2,61.7496]
{"$rows_left_out":491}
{"sheet":"Bulk Deals","index":4,"n_rows":56,"n_cols":8,"rows_kept":56,"merged":[[4,0,4,1],[4,2,4,3],[6,1,6,2]]}
[" "]
[]
[]
[]
[]
[{"$nulls":4},"Back To Main Page"]
["Subject :","BULK DEAL",null,{"$f":"Main!B10","v":"2019-01-03"}]
[]
["Date","Scrip code","Scrip Name","Client Name","Buy / Sell","Quantity Traded","Trade Price / Wt.Avg.trade price","Exchange  "]
["2019-01-02",530187,"ATHARVENT","AMAN SHREE TRADING AND REAL ESTATE PRIVATE LIMITED","SELL",{"v":281000,"d":"281,000"},1.72,"BSE"]
["2019-01-02",537766,"BCP","DIPESH SITARAM GORULE","SELL",{"v":328554,"d":"328,554"},33.11,"BSE"]
["2019-01-02",537766,"BCP","DIPESH SITARAM GORULE","BUY",{"v":280554,"d":"280,554"},33.24,"BSE"]
["2019-01-02",539335,"CHPLIND","DIMPLE SURANA","BUY",{"v":18390,"d":"18,390"},10.84,"BSE"]
["2019-01-02",530393,"DBSTOCKBRO","NEW KMS FINANCE PRIVATE LIMITED","BUY",{"v":650000,"d":"650,000"},8.4,"BSE"]
["2019-01-02",530393,"DBSTOCKBRO","GURU KIRPA FINVEST LTD","SELL",{"v":650000,"d":"650,000"},8.4,"BSE"]
["2019-01-02",539009,"GBLIL","HIGHGROWTH VINCOM PRIVATE LIMITED","SELL",{"v":33000,"d":"33,000"},80.27,"BSE"]
["2019-01-02",540614,"GGENG","HANSABEN DIPAKBHAI PUJARA","SELL",{"v":51000,"d":"51,000"},50.98,"BSE"]
["2019-01-02",540266,"GLCL","MAHESH DESAI","SELL",{"v":17000,"d":"17,000"},20.35,"BSE"]
["2019-01-02",540266,"GLCL","GODHAR RAJENDRA GANGARAM","BUY",{"v":17100,"d":"17,100"},20.37,"BSE"]
["2019-01-02",540266,"GLCL","GAUTAM PARSOTAMBHAI BORANA","SELL",{"v":17000,"d":"17,000"},20.37,"BSE"]
{"$rows_left_out":37}
{"sheet":"Call Tracker (Equity & F&O)","index":5,"n_rows":299,"n_cols":18,"rows_kept":299,"merged":[[30,0,31,0],[30,1,31,1],[30,2,31,2],[30,9,31,9],[30,11,31,11],[30,12,31,12],[30,13,31,13],[30,14,31,14],[32,0,33,0],[32,1,33,1],[32,2,33,2],[32,9,33,9],[32,11,33,11],[32,12,33,12],[32,13,33,13],[32,14,33,14]]}
[]
[]
[]
[]
[{"$nulls":12},"Back To Main Page"]
["Retail Research Technical Calls & Fundamental Performance Report for the month of January -2019 "]
[{"$nulls":12},{"$f":"Main!B10","v":"2019-01-03"}]
[null,"Positional  Call"]
["Sr.no","Date",null,"Company","Rec","Rec Price","Stop Loss***","Call Closed At","Target","Remark","Profit / Loss per Share","Gain / Loss  %","Status","Closed Date","NSE Closed Price"]
[1,"2018-12-21",null,"TATAGLOBAL","Buy",217,209,223.5,"235-240","Part Profit of Rs.6.25/-",{"$f":"H10-F10","v":6.5},{"$f":"K10/F10","v":{"v":0.029953917050691243,"d":"3.00%"}},"Successful","2018-12-24",{"$nulls":3},"H"]
[2,"2018-12-24",null,"JSWSTEEL","Buy","299-300",289,null,"320-325","Open",{"$nulls":4},{"$f":"VLOOKUP(D11,Sheet2!A2:M1497,6,0)","v":288.7},null,null,"H"]
[3,"2018-12-24",null,"TATAPOWER","Buy","77.2-77.4",73.7,null,"83-84","Open",{"$nulls":4},{"$f":"VLOOKUP(D12,Sheet2!A3:M1498,6,0)","v":74.85},null,null,"R"]
[4,"2018-12-27",null,"TVSMOTOR","Buy",552.5,519,571.75,"600-620","Part of Rs.19.25/-",{"$f":"H13-F13","v":19.25},{"$f":"K13/F13","v":{"v":0.03484162895927602,"d":"3.48%"}},"Successful","2019-01-02",{"$nulls":3},"H"]
[5,"2019-01-01",null,"ASHOKLEY","Buy","100.60-101.60",96,null,"110-112","Open",{"$nulls":7},"R"]
{"$rows_empty":11}
["CLBS = Closing Basis ***",{"$nulls":4},"Reinitiated $"]
["Dividend adjusted <>",{"$nulls":4},"Revised stoploss #"]
["Part book {}"]
["Master Trade High Risk"]
["Sr.no","Date",null,"Company","Rec","Rec Price","Stop Loss","Call Closed At","Target","Remark","Profit / Loss per share","Gain / Loss  per Lot","Lot","Status","Closed Date"]
{"$rows_left_out":203}
{"sheet":"Sheet2","index":6,"n_rows":1636,"n_cols":14,"rows_kept":1636,"hidden":true}
["SYMBOL","SERIES","OPEN","HIGH","LOW","CLOSE","LAST","PREVCLOSE","TOTTRDQTY","TOTTRDVAL","TIMESTAMP","TOTALTRADES","ISIN","ISIN"]
["20MICRONS","EQ",45.5,45.95,43.8,44.05,44.45,44.25,164131,7414680.5,"2019-01-02",1292,"INE144J01027"]
["21STCENMGM","EQ",24.25,24.3,23.8,23.8,23.8,24.25,2980,71020.5,"2019-01-02",15,"INE253B01015"]
["3IINFOTECH","EQ",3.65,3.7,3.6,3.65,3.7,3.65,1774440,6483473.75,"2019-01-02",554,"INE748C01020"]
["3MINDIA","EQ",20666.35,20666.35,19952.45,19985.75,19980,20666.35,8642,173052211.5,"2019-01-02",2543,"INE470A01017"]
["3PLAND","EQ",11.3,12,11.3,12,12,12,1031,11960,"2019-01-02",6,"INE105C01023"]
["5PAISA","EQ",270.75,270.75,260.6,270.75,270.75,257.9,20081,5405538.5,"2019-01-02",424,"INE618L01018"]
["63MOONS","EQ",98.9,100.4,96.6,97.2,96.65,99.6,183950,18053925.5,"2019-01-02",2948,"INE111B01023"]
["8KMILES","EQ",141.8,143,138.25,138.8,138.6,142.3,215557,30209397.95,"2019-01-02",2986,"INE650K01021"]
["A2ZINFRA","EQ",13.25,13.25,12.9,13,13,13,73069,950587.85,"2019-01-02",232,"INE619I01012"]
["AARTIDRUGS","EQ",577.3,577.3,571.05,575.1,575,575.65,4864,2796277.15,"2019-01-02",179,"INE767A01016"]
["AARTIIND","EQ",1453.95,1453.95,1431.2,1450.7,1450,1448.6,27836,40190296.15,"2019-01-02",4539,"INE769A01020"]
["AARVEEDEN","EQ",25.8,27.15,25.8,27.05,27.15,26.05,23978,636903.75,"2019-01-02",130,"INE273D01019"]
["AAVAS","EQ",840.25,856.75,829.95,840.65,839,845.25,10812,9100405.05,"2019-01-02",1133,"INE216P01012"]
["ABAN","EQ",74,75.3,73.1,74.1,74,74.5,413245,30710032.25,"2019-01-02",4473,"INE421A01028"]
["ABB","EQ",1320,1330,1311.3,1319.25,1315.9,1319.2,56713,74955966.7,"2019-01-02",6648,"INE117A01022"]
["ABBOTINDIA","EQ",7580,7580,7506,7527.05,7517,7580.05,1013,7643031.8,"2019-01-02",359,"INE358A01014"]
["ABCAPITAL","EQ",99.8,101.45,99,99.25,99.05,100.1,1728162,173299262.15,"2019-01-02",14182,"INE674K01013"]
["ABFRL","EQ",198.7,200.85,194.55,195.55,194.8,199.55,854111,168497579.1,"2019-01-02",14965,"INE647O01011"]
["ABSLNN50ET","EQ",277.07,287.99,277.07,280,280,292,74,20835.94,"2019-01-02",8,"INF209KB1B87"]
{"$rows_left_out":1617}
{"sheet":"Sheet1","index":7,"n_rows":0,"n_cols":0,"rows_kept":0,"hidden":true}