{"text_format":"3","workbook":"xlsx","n_sheets":12,"sheets":["Main","Future Intra","Cash Intra","MidCap Intra","Bulk Deals","Call Tracker (Equity & F&O)","Sheet2","Sheet1","Sheet3","Sheet4","Sheet5","Call Tracker (Currency)"],"not_rendered":{"images":4,"defined_names":4},"read":"whole","date_system":"1900"}

{"sheet":"Main","index":0,"n_rows":17,"n_cols":4,"rows_kept":17}
[null,"                                                                                                 "]
{"$rows_empty":8}
[null,"2018-02-02"]
[]
[null,"Sheet No.","Template Name","Summary"]
[null,1,"Future Intra","For Intraday trading in F&O segment"]
[null,2,"Cash Intra","For Intraday trading in cash market segment"]
[null,3,"Mid-cap Intra","For Intraday trading in Mid-cap stocks"]
[null,4,"Bulk Deals","Reveals Bulk Deals carried on NSE & BSE"]
[null,5,"Call Tracker"]

{"sheet":"Future Intra","index":1,"n_rows":252,"n_cols":15,"rows_kept":252,"merged":[[8,0,9,0],[8,1,9,1],[8,2,9,2],[8,5,8,7],[8,8,8,10]]}
[]
[]
[]
[]
[{"$nulls":12},"Back to Main Page"]
["FOR INTRA DAY TRADING",{"$nulls":10},{"$f":"Main!B10","v":"2018-02-02"}]
[]
[]
["Sr.no","Sector","Scrip","CLOSE RATE","Pivot Point","Supports",null,null,"Resistances"]
[null,"Sector",null,"Point","Point","S1","S2","S3","R1","R2","R3","HIGH","LOW","OI","% Change in OI"]
[1,"Index","BANKNIFTY",{"v":27233.2,"d":"27233.20"},{"v":27324.266666666663,"d":"27324.27"},{"v":26987.533333333326,"d":"26987.53"},{"v":26741.86666666666,"d":"26741.87"},{"v":26405.133333333324,"d":"26405.13"},{"v":27569.933333333327,"d":"27569.93"},{"v":27906.666666666664,"d":"27906.67"},{"v":28152.33333333333,"d":"28152.33"},27661,27078.6,2147040,{"v":2.6899798251513113E-3,"d":"0.27%"}]
[2,"Index","NIFTY",{"v":11031.3,"d":"11031.30"},{"v":11017.133333333331,"d":"11017.13"},{"v":10894.866666666663,"d":"10894.87"},{"v":10758.433333333332,"d":"10758.43"},{"v":10636.166666666664,"d":"10636.17"},{"v":11153.566666666662,"d":"11153.57"},{"v":11275.833333333332,"d":"11275.83"},{"v":11412.266666666661,"d":"11412.27"},11139.4,10880.7,24788175,{"v":-0.028297670917932345,"d":"-2.83%"}]
[3,"Index","NIFTYCPSE",2661.05,{"v":887.0166666666668,"d":"887.02"},{"v":1774.0333333333335,"d":"1774.03"},{"v":887.0166666666668,"d":"887.02"},{"v":1774.0333333333335,"d":"1774.03"},{"v":1774.0333333333335,"d":"1774.03"},{"v":887.0166666666668,"d":"887.02"},{"v":1774.0333333333335,"d":"1774.03"},0,0,0,{"v":0,"d":"0.00%"}]
[4,"Index","NIFTYINFRA",{"v":3569.3,"d":"3569.30"},{"v":1189.7666666666667,"d":"1189.77"},{"v":2379.5333333333333,"d":"2379.53"},{"v":1189.7666666666667,"d":"1189.77"},{"v":2379.5333333333333,"d":"2379.53"},{"v":2379.5333333333333,"d":"2379.53"},{"v":1189.7666666666667,"d":"1189.77"},{"v":2379.5333333333333,"d":"2379.53"},0,0,0,{"v":0,"d":"0.00%"}]
[5,"Index","NIFTYIT",{"v":13022,"d":"13022.00"},{"v":13013,"d":"13013.00"},{"v":12859,"d":"12859.00"},{"v":12696,"d":"12696.00"},{"v":12542,"d":"12542.00"},{"v":13176,"d":"13176.00"},{"v":13330,"d":"13330.00"},{"v":13493,"d":"13493.00"},13167,12850,39200,{"v":3.8412291933418692E-3,"d":"0.38%"}]
[6,"Index","NIFTYMID50",{"v":5380,"d":"5380.00"},5351.55,{"v":5245.1,"d":"5245.10"},{"v":5110.2,"d":"5110.20"},5003.75,{"v":5486.450000000001,"d":"5486.45"},{"v":5592.9,"d":"5592.90"},{"v":5727.800000000001,"d":"5727.80"},5458,5216.65,525200,{"v":0,"d":"0.00%"}]
[7,"Index","NIFTYPSE",{"v":4297,"d":"4297.00"},{"v":1432.3333333333333,"d":"1432.33"},{"v":2864.6666666666665,"d":"2864.67"},{"v":1432.3333333333333,"d":"1432.33"},{"v":2864.6666666666665,"d":"2864.67"},{"v":2864.6666666666665,"d":"2864.67"},{"v":1432.3333333333333,"d":"1432.33"},{"v":2864.6666666666665,"d":"2864.67"},0,0,0,{"v":0,"d":"0.00%"}]
[8,"Cement","ACC",{"v":1739.5,"d":"1739.50"},{"v":1730.5166666666667,"d":"1730.52"},{"v":1709.0333333333333,"d":"1709.03"},{"v":1678.5666666666666,"d":"1678.57"},{"v":1657.0833333333333,"d":"1657.08"},{"v":1760.9833333333333,"d":"1760.98"},{"v":1782.4666666666665,"d":"1782.47"},{"v":1812.9333333333334,"d":"1812.93"},1752,1700.05,1391600,{"v":0.03572491813039595,"d":"3.57%"}]
[9,"Others","ADANIENT",214.75,{"v":212.13333333333333,"d":"212.13"},{"v":206.61666666666665,"d":"206.62"},{"v":198.48333333333332,"d":"198.48"},{"v":192.96666666666664,"d":"192.97"},{"v":220.26666666666665,"d":"220.27"},{"v":225.7833333333333,"d":"225.78"},{"v":233.91666666666666,"d":"233.92"},217.65,204,16660000,{"v":0.007255139056831923,"d":"0.73%"}]
[10,"Others","ADANIPORTS",{"v":430.3,"d":"430.30"},{"v":426.7833333333333,"d":"426.78"},{"v":419.0666666666666,"d":"419.07"},{"v":407.8333333333333,"d":"407.83"},{"v":400.1166666666666,"d":"400.12"},{"v":438.0166666666666,"d":"438.02"},{"v":445.7333333333333,"d":"445.73"},{"v":456.9666666666666,"d":"456.97"},434.5,415.55,11062500,{"v":-0.014037433155080214,"d":"-1.40%"}]
{"$rows_left_out":226}
{"sheet":"Cash Intra","index":2,"n_rows":251,"n_cols":13,"rows_kept":251,"merged":[[7,0,8,0],[7,1,8,1],[7,2,8,2],[7,3,8,3],[7,4,7,6],[7,7,7,9]]}
[]
[]
[]
[]
[{"$nulls":12},"Back to Main Page"]
["FOR INTRA DAY TRADING",{"$nulls":9},{"$f":"Main!B10","v":"2018-02-02"}]
[]
["Sr.no","Scrip","CLOSE RATE","Pivot Point","Supports",null,null,"Resistances"]
[null,null,"Point",null,"S1","S2","S3","R1","R2","R3","HIGH","LOW","Total Trade Quanity in Lakhs"]
[1,"Nifty 50",11016.9,11004.35,10891.35,{"v":10765.8,"d":"10765.80"},{"v":10652.8,"d":"10652.80"},{"v":11129.900000000001,"d":"11129.90"},{"v":11242.900000000001,"d":"11242.90"},{"v":11368.450000000003,"d":"11368.45"},11117.35,10878.8]
[2,"Nifty Bank",27220.7,{"v":27293.516666666663,"d":"27293.52"},{"v":26973.533333333326,"d":"26973.53"},{"v":26726.36666666666,"d":"26726.37"},{"v":26406.383333333324,"d":"26406.38"},{"v":27540.683333333327,"d":"27540.68"},{"v":27860.666666666664,"d":"27860.67"},{"v":28107.83333333333,"d":"28107.83"},27613.5,27046.35]
[3,"Nifty CPSE",2720.5,{"v":2741.1333333333337,"d":"2741.13"},{"v":2693.9166666666674,"d":"2693.92"},{"v":2667.333333333334,"d":"2667.33"},{"v":2620.1166666666677,"d":"2620.12"},{"v":2767.716666666667,"d":"2767.72"},{"v":2814.9333333333334,"d":"2814.93"},{"v":2841.516666666667,"d":"2841.52"},2788.35,2714.55]
[4,"Nifty Infra",3648.05,{"v":3624.566666666667,"d":"3624.57"},{"v":3590.4333333333343,"d":"3590.43"},{"v":3532.816666666667,"d":"3532.82"},{"v":3498.6833333333343,"d":"3498.68"},{"v":3682.1833333333343,"d":"3682.18"},{"v":3716.3166666666666,"d":"3716.32"},{"v":3773.9333333333343,"d":"3773.93"},3658.7,3566.95]
[5,"Nifty IT",12964.6,{"v":12973.1,"d":"12973.10"},12804.45,{"v":12644.300000000001,"d":"12644.30"},{"v":12475.650000000001,"d":"12475.65"},13133.25,{"v":13301.899999999998,"d":"13301.90"},13462.05,13141.75,12812.95]
[6,"Nifty PSE",4251.3,{"v":4261.483333333334,"d":"4261.48"},{"v":4209.116666666667,"d":"4209.12"},{"v":4166.933333333333,"d":"4166.93"},{"v":4114.566666666667,"d":"4114.57"},{"v":4303.666666666667,"d":"4303.67"},{"v":4356.033333333334,"d":"4356.03"},{"v":4398.216666666667,"d":"4398.22"},4313.85,4219.3]
[7,"Nifty Midcap 50",5350.05,{"v":5327.666666666667,"d":"5327.67"},{"v":5266.083333333334,"d":"5266.08"},{"v":5182.116666666667,"d":"5182.12"},{"v":5120.533333333334,"d":"5120.53"},{"v":5411.633333333334,"d":"5411.63"},{"v":5473.216666666668,"d":"5473.22"},{"v":5557.183333333334,"d":"5557.18"},5389.25,5243.7]
[8,"ABB",1700.45,1686.45,{"v":1651,"d":"1651.00"},1601.55,{"v":1566.1,"d":"1566.10"},{"v":1735.9,"d":"1735.90"},{"v":1771.3500000000004,"d":"1771.35"},{"v":1820.8000000000002,"d":"1820.80"},1721.9,1637,2.00484]
[9,"ABFRL",163.6,{"v":162.5666666666667,"d":"162.57"},{"v":159.63333333333338,"d":"159.63"},{"v":155.66666666666669,"d":"155.67"},{"v":152.73333333333338,"d":"152.73"},{"v":166.5333333333334,"d":"166.53"},{"v":169.46666666666673,"d":"169.47"},{"v":173.4333333333334,"d":"173.43"},165.5,158.6,3.0368]
[10,"ACC",1737,{"v":1725.6499999999999,"d":"1725.65"},{"v":1706.4499999999998,"d":"1706.45"},{"v":1675.8999999999999,"d":"1675.90"},{"v":1656.6999999999998,"d":"1656.70"},{"v":1756.1999999999998,"d":"1756.20"},{"v":1775.4,"d":"1775.40"},{"v":1805.9499999999998,"d":"1805.95"},1744.85,1695.1,3.00979]
[11,"ADANIENT",214,{"v":211.58333333333334,"d":"211.58"},{"v":206.11666666666667,"d":"206.12"},{"v":198.23333333333332,"d":"198.23"},{"v":192.76666666666665,"d":"192.77"},{"v":219.4666666666667,"d":"219.47"},{"v":224.93333333333334,"d":"224.93"},{"v":232.81666666666672,"d":"232.82"},217.05,203.7,49.05671]
{"$rows_left_out":224}
{"sheet":"MidCap Intra","index":3,"n_rows":500,"n_cols":13,"rows_kept":500,"merged":[[0,0,0,1],[8,0,9,0],[8,1,9,1],[8,2,9,2],[8,3,9,3],[8,4,8,6],[8,7,8,9]]}
[]
[]
[]
[]
[{"$nulls":11},"Back To Main Page"]
["FOR INTRA DAY TRADING",{"$nulls":9},{"$f":"Main!B10","v":"2018-02-02"}]
[null,null," "]
[]
["Sr.no","Scrip","CLOSE RATE","Pivot Point","Supports",null,null,"Resistances"]
[null,null,"Point",null,"S1","S2","S3","R1","R2","R3","HIGH","LOW","Total Trade Quanity in Lakhs"]
[1,"3MINDIA",19282.05,{"v":19181.350000000002,"d":"19181.35"},{"v":18875.700000000004,"d":"18875.70"},{"v":18469.350000000002,"d":"18469.35"},{"v":18163.700000000004,"d":"18163.70"},{"v":19587.700000000004,"d":"19587.70"},{"v":19893.350000000006,"d":"19893.35"},{"v":20299.700000000004,"d":"20299.70"},19487,18775,0.02613]
[2,"8KMILES",718.15,{"v":721.3833333333333,"d":"721.38"},{"v":698.7666666666667,"d":"698.77"},{"v":679.3833333333333,"d":"679.38"},{"v":656.7666666666667,"d":"656.77"},{"v":740.7666666666667,"d":"740.77"},{"v":763.3833333333332,"d":"763.38"},{"v":782.7666666666667,"d":"782.77"},744,702,1.64687]
[3,"AARTIIND",1100.1,1082.45,{"v":1060,"d":"1060.00"},{"v":1019.8999999999999,"d":"1019.90"},{"v":997.4499999999998,"d":"997.45"},{"v":1122.5500000000002,"d":"1122.55"},{"v":1145.0000000000005,"d":"1145.00"},{"v":1185.1000000000004,"d":"1185.10"},1104.9,1042.35,0.60307]
[4,"ABAN",206.6,{"v":208.03333333333333,"d":"208.03"},{"v":203.16666666666666,"d":"203.17"},{"v":199.73333333333332,"d":"199.73"},{"v":194.86666666666665,"d":"194.87"},{"v":211.46666666666667,"d":"211.47"},{"v":216.33333333333334,"d":"216.33"},{"v":219.76666666666668,"d":"219.77"},212.9,204.6,14.13772]
[5,"ABB",1700.45,1686.45,{"v":1651,"d":"1651.00"},1601.55,{"v":1566.1,"d":"1566.10"},{"v":1735.9,"d":"1735.90"},{"v":1771.3500000000004,"d":"1771.35"},{"v":1820.8000000000002,"d":"1820.80"},1721.9,1637,2.00484]
[6,"ABFRL",163.6,{"v":162.5666666666667,"d":"162.57"},{"v":159.63333333333338,"d":"159.63"},{"v":155.66666666666669,"d":"155.67"},{"v":152.73333333333338,"d":"152.73"},{"v":166.5333333333334,"d":"166.53"},{"v":169.46666666666673,"d":"169.47"},{"v":173.4333333333334,"d":"173.43"},165.5,158.6,3.0368]
[7,"ACC",1737,{"v":1725.6499999999999,"d":"1725.65"},{"v":1706.4499999999998,"d":"1706.45"},{"v":1675.8999999999999,"d":"1675.90"},{"v":1656.6999999999998,"d":"1656.70"},{"v":1756.1999999999998,"d":"1756.20"},{"v":1775.4,"d":"1775.40"},{"v":1805.9499999999998,"d":"1805.95"},1744.85,1695.1,3.00979]
[8,"ADANIENT",214,{"v":211.58333333333334,"d":"211.58"},{"v":206.11666666666667,"d":"206.12"},{"v":198.23333333333332,"d":"198.23"},{"v":192.76666666666665,"d":"192.77"},{"v":219.4666666666667,"d":"219.47"},{"v":224.93333333333334,"d":"224.93"},{"v":232.81666666666672,"d":"232.82"},217.05,203.7,49.05671]
[9,"ADANIPORTS",428.75,{"v":425.40000000000003,"d":"425.40"},{"v":417.80000000000007,"d":"417.80"},406.85,{"v":399.25000000000006,"d":"399.25"},{"v":436.3500000000001,"d":"436.35"},{"v":443.9500000000001,"d":"443.95"},{"v":454.9000000000001,"d":"454.90"},433,414.45,16.81704]
[10,"ADANIPOWER",36.75,{"v":36.233333333333334,"d":"36.23"},{"v":35.21666666666667,"d":"35.22"},{"v":33.68333333333334,"d":"33.68"},{"v":32.66666666666667,"d":"32.67"},{"v":37.766666666666666,"d":"37.77"},{"v":38.78333333333333,"d":"38.78"},{"v":40.31666666666666,"d":"40.32"},37.25,34.7,109.04549]
{"$rows_left_out":481}
{"sheet":"Bulk Deals","index":4,"n_rows":72,"n_cols":8,"rows_kept":72,"merged":[[4,0,4,1],[4,2,4,3],[6,1,6,2]]}
[" "]
[]
[]
[]
[]
[{"$nulls":4},"Back To Main Page"]
["Subject :","BULK DEAL",null,{"$f":"Main!B10","v":"2018-02-02"}]
[]
["Date","Scrip code","Scrip Name","Client Name","Buy / Sell","Quantity Traded","Trade Price / Wt.Avg.trade price","Exchange  "]
["2018-02-01",540697,"AMFL","PINALBEN R. SHAH","SELL",{"v":152000,"d":"152,000"},22.76,"BSE"]
["2018-02-01",540697,"AMFL","VIVIDOFFSET PRINTERS PRIVATELIMITED","SELL",{"v":496000,"d":"496,000"},22.8,"BSE"]
["2018-02-01",540697,"AMFL","SAGAR RAJESHBHAI JHAVERI","BUY",{"v":520000,"d":"520,000"},22.74,"BSE"]
["2018-02-01",538716,"ARYACAPM","NIDHI BANSAL","BUY",{"v":70000,"d":"70,000"},25,"BSE"]
["2018-02-01",538716,"ARYACAPM","NAMRATA SAJANKUMAR BAJAJ","SELL",{"v":70000,"d":"70,000"},25,"BSE"]
["2018-02-01",538716,"ARYACAPM","NAMRATA SAJANKUMAR BAJAJ","BUY",{"v":30000,"d":"30,000"},24.8,"BSE"]
["2018-02-01",540361,"DANUBE","RAVIKUMAR SUDHIRKUMAR MAHETA","SELL",{"v":100000,"d":"100,000"},4.07,"BSE"]
["2018-02-01",540361,"DANUBE","S N SHAH (HUF)","BUY",{"v":279000,"d":"279,000"},4.07,"BSE"]
["2018-02-01",540361,"DANUBE","RENUKABEN CHANDRAKANT SHAH","SELL",{"v":100000,"d":"100,000"},4.07,"BSE"]
["2018-02-01",540361,"DANUBE","ASHKA DHVANIT SHAH","SELL",{"v":50000,"d":"50,000"},4.07,"BSE"]
["2018-02-01",539770,"DARJEELING","PALLAVIBEN SHASHIKANT KAPADIA","SELL",{"v":20000,"d":"20,000"},15.83,"BSE"]
{"$rows_left_out":53}
{"sheet":"Call Tracker (Equity & F&O)","index":5,"n_rows":208,"n_cols":19,"rows_kept":208,"merged":[[8,9,8,10],[9,9,9,10],[10,9,10,10],[11,9,11,10],[12,9,12,10],[13,9,13,10],[14,9,14,10],[15,9,15,10],[16,9,16,10],[17,9,17,10],[18,9,18,10],[20,9,20,10],[25,9,25,10],[26,9,26,10],[29,9,29,10],[33,9,33,10],[34,0,35,0],[34,1,35,1],[34,8,35,8],[34,9,35,10],[34,12,35,12],[34,13,35,13],[34,14,35,14],[34,15,35,15],[36,9,36,10],[37,9,37,10],[38,9,38,10],[43,9,43,10],[44,9,44,10],[45,9,45,10],[46,9,46,10],[47,9,47,10],[48,9,48,10],[49,9,49,10],[50,9,50,10],[56,9,56,10],[64,9,64,10],[65,9,65,10],[66,9,66,10],[73,9,73,10],[74,9,74,10],[75,9,75,10],[76,9,76,10],[77,9,77,10],[78,9,78,10],[79,9,79,10],[80,9,80,10],[82,9,82,10],[83,9,83,10],[84,9,84,10],[85,9,85,10],[86,9,86,10],[87,9,87,10],[88,9,88,10],[89,9,89,10],[90,9,90,10],[91,9,91,10],[92,9,92,10],[93,9,93,10],[94,9,94,10],[95,9,95,10],[96,9,96,10],[97,9,97,10],[98,9,98,10],[99,9,99,10],[100,9,100,10],[101,9,101,10],[102,9,102,10],[103,9,103,10],[104,9,104,10],[105,9,105,10],[106,9,106,10],[107,9,107,10],[108,9,108,10],[109,9,109,10],[110,9,110,10],[111,9,111,10],[112,9,112,10],[113,9,113,10],[114,9,114,10],[115,9,115,10],[116,9,116,10],[117,9,117,10],[118,9,118,10],[119,9,119,10],[120,9,120,10],[121,9,121,10],[122,9,122,10],[123,9,123,10],[124,9,124,10],[125,9,125,10],[126,9,126,10],[127,9,127,10],[128,9,128,10],[129,9,129,10],[130,9,130,10],[131,9,131,10],[132,9,132,10],[133,9,133,10],[134,9,134,10],[135,9,135,10],[136,9,136,10],[137,9,137,10],[138,9,138,10],[139,9,139,10],[140,9,140,10],[141,9,141,10],[142,9,142,10],[143,9,143,10],[144,9,144,10],[145,9,145,10],[146,9,146,10],[147,9,147,10],[148,9,148,10],[150,9,150,10],[151,9,151,10],[152,9,152,10],[153,9,153,10],[154,9,154,10],[155,9,155,10],[156,9,156,10],[157,9,157,10],[158,9,158,10],[159,9,159,10],[160,9,160,10],[161,9,161,10],[162,9,162,10],[163,9,163,10],[164,9,164,10],[165,9,165,10],[166,9,166,10],[167,9,167,10],[168,9,168,10],[169,9,169,10],[170,9,170,10],[171,9,171,10],[172,9,172,10],[173,9,173,10],[174,9,174,10],[175,9,175,10],[176,9,176,10],[177,9,177,10],[178,9,178,10],[179,9,179,10],[180,9,180,10],[181,9,181,10],[182,9,182,10],[183,9,183,10],[184,9,184,10],[185,9,185,10],[186,9,186,10],[187,9,187,10],[188,9,188,10],[189,9,189,10],[190,9,190,10],[191,9,191,10],[192,9,192,10],[193,9,193,10],[194,9,194,10],[195,10,195,11]]}
[]
[]
[]
[]
[{"$nulls":13},"Back To Main Page"]
["Retail Research Technical Calls & Fundamental Performance Report for the month of February -2018 "]
[{"$nulls":13},{"$f":"Main!B10","v":"2018-02-02"}]
[null,"Positional  Call"]
["Sr.no","Date",null,"Company","Rec","Rec Price","Stop Loss***","Call Closed At","Target","Remark",null,"Profit / Loss per Share","Gain / Loss  %","Status","Closed Date","NSE Closed Price"]
[1,"2017-12-21",null,"M&M","Sell",750,825,null,600,"Open",{"$nulls":5},{"$f":"VLOOKUP(D10,Sheet2!$A$1:M2036,6,0)","v":798.75},null,null,"P"]
[2,"2018-01-11",null,"SUNPHARMA","Buy",593.5,560,557.5,650,"Loss of Rs.36/-",null,{"$f":"H11-F11-K11","v":{"v":-36,"d":"-36.00"}},{"$f":"L11/F11","v":{"v":-0.060657118786857624,"d":"-6.07%"}},"Unsuccessful","2018-02-01",{"$nulls":3},"R"]
[3,"2018-01-12",null,"GRANULES","Buy$",{"$f":"(145.5+133.5)/2","v":139.5},131,131,"160-162","Loss of Rs.8.5/-",null,{"$f":"H12-F12-K12","v":{"v":-8.5,"d":"-8.50"}},{"$f":"L12/F12","v":{"v":-0.06093189964157706,"d":"-6.09%"}},"Unsuccessful","2018-02-01",{"$nulls":3},"H"]
[4,"2018-01-16",null,"PIDILITIND","Buy","905-908",880,null,965,"Open",{"$nulls":5},{"$f":"VLOOKUP(D13,Sheet2!$A$1:M2071,6,0)","v":899},null,null,"R"]
[5,"2018-01-18",null,"AUROPHARMA","Buy",660.5,634,626,"720-730","Loss of Rs.34.5/-",null,{"$f":"H14-F14-K14","v":{"v":-34.5,"d":"-34.50"}},{"$f":"L14/F14","v":{"v":-0.052233156699470096,"d":"-5.22%"}},"Unsuccessful","2018-02-01",{"$nulls":3},"H"]
[6,"2018-01-19",null,"ENGINERSIN","Buy","179-181",170.5,null,"195-200","Open",{"$nulls":5},{"$f":"VLOOKUP(D15,Sheet2!$A$1:M2077,6,0)","v":172.5},null,null,"H"]
[7,"2018-01-22",null,"LT","Sell",1381.5,1444,1455,1250,"Loss of Rs.73.5/-",null,{"$f":"F16-H16","v":-73.5},{"v":-0.053203040173724216,"d":"-5.32%"},"Unsuccessful","2018-02-01",{"$nulls":3},"R"]
[8,"2018-01-23",null,"ADANIPORTS","Sell",435,455,417.5,390,"Profit  of Rs.17.5/-",null,{"$f":"F17-H17","v":17.5},{"$f":"L17/F17","v":{"v":0.040229885057471264,"d":"4.02%"}},"Successful","2018-02-01",{"$nulls":3},"R"]
[9,"2018-01-30",null,"CESC","Buy","1062-1072",1020,null,1140,"Open",{"$nulls":5},{"$f":"VLOOKUP(D18,Sheet2!$A$1:M2082,6,0)","v":1045.35},null,null,"R"]
[10,"2018-01-30",null,"TATAMOTORS","Buy","399-402",385,null,"430-440","Open",{"$nulls":5},{"$f":"VLOOKUP(D19,Sheet2!$A$1:M2083,6,0)","v":393.65},null,null,"H"]
[]
{"$rows_left_out":183}
{"sheet":"Sheet2","index":6,"n_rows":1384,"n_cols":13,"rows_kept":1384,"hidden":true}
["SYMBOL","SERIES","OPEN","HIGH","LOW","CLOSE","LAST","PREVCLOSE","TOTTRDQTY","TOTTRDVAL","TIMESTAMP","TOTALTRADES","ISIN"]
["20MICRONS","EQ",53,53,50.5,52.15,52.05,52.75,53466,2789881.45,"2018-02-01",549,"INE144J01027"]
["3IINFOTECH","EQ",6.25,6.3,5.9,5.9,5.95,6.15,7116046,43282929,"2018-02-01",3399,"INE748C01020"]
["3MINDIA","EQ",18995,19487,18775,19282.05,19305,18796.15,2613,50184486.15,"2018-02-01",839,"INE470A01017"]
["5PAISA","EQ",287,304.7,287,304.7,304.7,290.2,8463,2559413.9,"2018-02-01",310,"INE618L01018"]
["63MOONS","EQ",105.65,109,100.7,103.45,104.05,104.8,324922,34001319.4,"2018-02-01",4657,"INE111B01023"]
["8KMILES","EQ",741.35,744,702,718.15,717.5,736.85,164687,118730878.95,"2018-02-01",7609,"INE650K01021"]
["A2ZINFRA","EQ",38.1,38.65,37.3,37.5,37.5,37.95,896717,34089625.45,"2018-02-01",3882,"INE619I01012"]
["AARTIDRUGS","EQ",621.25,636,618.05,622.5,621,624.95,6188,3879363.45,"2018-02-01",604,"INE767A01016"]
["AARTIIND","EQ",1065,1104.9,1042.35,1100.1,1100.1,1056.75,60307,65847650.25,"2018-02-01",3761,"INE769A01020"]
["AARVEEDEN","EQ",48.7,50.5,48.5,48.85,49.5,49.6,33294,1635819.6,"2018-02-01",168,"INE273D01019"]
["ABAN","EQ",211.75,212.9,204.6,206.6,206.1,211,1413772,294671339.55,"2018-02-01",15312,"INE421A01028"]
["ABB","EQ",1650,1721.9,1637,1700.45,1700,1653.2,200484,336011229.35,"2018-02-01",7977,"INE117A01022"]
["ABBOTINDIA","EQ",5570.1,5625,5510,5554.5,5550,5625.05,4145,23001766.5,"2018-02-01",738,"INE358A01014"]
["ABCAPITAL","EQ",171,175,169.95,174.2,174.9,170.85,2092606,361783199.35,"2018-02-01",22305,"INE674K01013"]
["ABFRL","EQ",163.8,165.5,158.6,163.6,164.9,163.05,303680,49168205.7,"2018-02-01",2895,"INE647O01011"]
["ACC","EQ",1723,1744.85,1695.1,1737,1730.2,1715.25,300979,518590229.85,"2018-02-01",22783,"INE012A01025"]
["ACCELYA","EQ",1431.65,1459.9,1410,1423,1424.95,1441.65,26868,38402382.55,"2018-02-01",1388,"INE793A01012"]
["ACE","EQ",173.2,184.2,165,176.4,176.5,172.05,1423109,252351889.4,"2018-02-01",15582,"INE731H01025"]
["ADANIENT","EQ",213,217.05,203.7,214,213.6,213.2,4905671,1043896234.35,"2018-02-01",34143,"INE423A01024"]
{"$rows_left_out":1365}
{"sheet":"Sheet1","index":7,"n_rows":0,"n_cols":0,"rows_kept":0,"hidden":true}

{"sheet":"Sheet3","index":8,"n_rows":0,"n_cols":0,"rows_kept":0,"hidden":true}

{"sheet":"Sheet4","index":9,"n_rows":0,"n_cols":0,"rows_kept":0,"hidden":true}

{"sheet":"Sheet5","index":10,"n_rows":0,"n_cols":0,"rows_kept":0,"hidden":true}

{"sheet":"Call Tracker (Currency)","index":11,"n_rows":58,"n_cols":18,"rows_kept":58,"merged":[[1,8,1,9],[2,8,2,9],[3,8,3,9],[4,8,4,9],[5,8,5,9],[6,8,6,9],[7,8,7,9],[8,8,8,9],[9,8,9,9],[10,8,10,9],[11,8,11,9],[12,8,12,9],[13,8,13,9],[14,8,14,9],[15,8,15,9],[16,8,16,9],[17,8,17,9],[18,8,18,9],[19,8,19,9],[20,8,20,9],[21,8,21,9],[22,8,22,9],[23,8,23,9],[24,8,24,9],[25,8,25,9],[26,8,26,9],[27,8,27,9],[28,8,28,9],[29,8,29,9],[30,8,30,9],[31,8,31,9],[32,8,32,9],[33,8,33,9],[34,8,34,9],[35,8,35,9],[36,8,36,9],[37,8,37,9],[38,8,38,9],[39,8,39,9],[40,8,40,9],[41,8,41,9],[42,8,42,9],[43,8,43,9],[44,8,44,9],[45,8,45,9],[46,8,46,9],[47,8,47,9],[48,8,48,9],[49,8,49,9],[50,8,50,9],[51,8,51,9],[52,8,52,9],[53,8,53,9],[54,8,54,9],[55,8,55,9],[56,8,56,9],[57,8,57,9],[58,8,58,9],[59,8,59,9],[60,8,60,9],[61,8,61,9],[62,8,62,9],[63,8,63,9],[64,8,64,9],[65,8,65,9],[66,8,66,9],[67,8,67,9],[68,8,68,9],[69,8,69,9],[70,8,70,9],[71,8,71,9],[72,8,72,9],[73,8,73,9],[74,8,74,9],[75,8,75,9],[76,8,76,9],[77,8,77,9],[78,8,78,9],[79,8,79,9],[80,8,80,9],[81,8,81,9],[82,8,82,9],[83,8,83,9],[84,8,84,9],[85,8,85,9],[86,8,86,9],[87,8,87,9],[88,8,88,9],[89,8,89,9],[90,8,90,9],[91,8,91,9],[92,8,92,9],[93,8,93,9],[94,8,94,9],[95,8,95,9],[96,8,96,9],[97,8,97,9],[98,8,98,9],[99,8,99,9],[100,8,100,9],[101,8,101,9],[102,8,102,9],[103,8,103,9],[104,8,104,9],[105,8,105,9],[106,8,106,9],[107,8,107,9],[108,8,108,9],[109,8,109,9],[110,8,110,9],[111,8,111,9],[112,8,112,9],[113,8,113,9],[114,8,114,9],[115,8,115,9],[116,8,116,9],[117,8,117,9],[118,8,118,9],[119,8,119,9],[120,8,120,9],[121,8,121,9],[122,8,122,9],[123,8,123,9],[124,8,124,9]]}
["Master Trade High Risk"]
["Sr.no","Date","Company","Rec","Rec Price","Stop Loss","Call Closed At","Target","Remark",null,"Profit / Loss per share","Gain / Loss  per Lot","Lot","Status","Closed Date"]
[1,"2017-05-08","USDINR MAY FUT","Buy",64.3935,64.29,64.66,64.59,"Profit of Rs.0.27/-",null,{"v":0.2664999999999935,"d":"0.27"},266.4999999999935,1000,"Successful","2017-05-09",null,null,"P"]
[2,"2017-05-08","USDINR JUN FUT","Buy",64.6535,64.45,64.965,65.05,"Profit of Rs 0.31/-",null,{"v":0.31150000000000944,"d":"0.31"},311.50000000000944,1000,"Successful","2017-05-09",null,null,"P"]
[3,"2017-05-09","EUROINR MAY FUT","Sell",70.65,70.8,70.07,70.4,"Profit of Rs 0.58/-",null,{"v":0.580000000000013,"d":"0.58"},580.00000000001,1000,"Successful","2017-05-12",null,null,"P"]
[4,"2017-05-09","GBPINR MAY FUT","Buy",83.774,83.37,83.37,84.77,"Loss of Rs 0.40/-",null,{"v":-0.40399999999999636,"d":"-0.40"},-403.99999999999636,1000,"Unsuccessful","2017-05-11",null,null,"P"]
[5,"2017-05-11","USDINR MAY FUT","Buy",64.6555,64.55,64.55,64.86,"Loss of Rs.0.1055/-",null,-0.10550000000000637,{"$f":"K7*M7","v":{"v":-105.50000000000637,"d":"-105.50"}},1000,"Unsuccessful","2017-05-11",null,null,"P"]
[6,"2017-05-15","USDINR MAY FUT","Buy",64.2275,64.08,64.46,64.48,"Profit of Rs 0.23/-",null,{"v":0.2324999999999875,"d":"0.23"},232.4999999999875,1000,"Successful","2017-05-18",null,null,"P"]
[7,"2017-05-19","USDINR MAY FUT","Sell",64.83,65,65,64.5,"Loss of Rs.0.17/-",null,{"v":-0.1700000000000017,"d":"-0.17"},-170.0000000000017,1000,"Unsuccessful","2017-05-19",null,null,"P"]
[8,"2017-05-23","USDINR MAY FUT","Buy",64.83,64.62,64.95,65.2,"Profit of Rs 0.12/-",null,{"v":0.12000000000000455,"d":"0.12"},120.00000000000455,1000,"Successful","2017-05-24",null,null,"P"]
[9,"2017-05-25","USDINR MAY FUT","Buy",64.57,64.25,64.56,65,"Loss of Rs.0.01/-",null,-0.009999999999990905,-9.999999999990905,1000,"Neutral","2017-05-29",null,null,"P"]
[10,"2017-05-30","USDINR JUN FUT","Buy",64.9125,64.71,64.71,65.31,"Loss of Rs.0.20/-",null,{"v":-0.20250000000000057,"d":"-0.20"},-202.50000000000057,1000,"Unsuccessful","2017-05-31",null,null,"P"]
[11,"2017-06-01","USDINR JUN FUT","Buy",64.655,64.45,64.45,65.05,"Loss of Rs.0.20/-",null,{"$f":"G13-E13","v":{"v":-0.2049999999999983,"d":"-0.20"}},{"$f":"K13*M13","v":-204.9999999999983},{"v":1000,"d":"1000.00"},"Unsuccessful","2017-06-08",null,null,"P"]
[12,"2017-06-12","USDINR JUN FUT","Buy",64.45,64,64.7625,65.2,"Profit of Rs 0.31/-",null,{"v":0.3125,"d":"0.31"},312.5,1000,"Successful","2017-06-16"]
[13,"2017-06-16","USDINR JUN FUT","Buy",64.51,64.2,64.7,65.11,"Profit of Rs 0.19/-",null,{"v":0.18999999999999773,"d":"0.19"},189.99999999999773,1000,"Successful","2017-06-21"]
[14,"2017-06-22","USDINR JUN FUT","Buy",64.56,64.2,64.2,65.1,"Loss of Rs.0.36/-",null,{"v":-0.35999999999999943,"d":"-0.36"},-359.99999999999943,{"v":1000,"d":"1000.00"},"Unsuccessful","2017-06-30"]
[15,"2017-07-10","USDINR JUL FUT","Buy",64.67,64.4,64.4,65.15,"Loss of Rs.0.27/-",null,{"v":-0.269999999999996,"d":"-0.27"},-269.999999999996,{"v":1000,"d":"1000.00"},"Unsuccessful","2017-07-31"]
[16,"2017-08-02","USDINR AUG FUT","Buy",64.235,63.98,63.98,64.75,"Loss of Rs.0.26/-",null,{"v":-0.25500000000000256,"d":"-0.26"},-255.00000000000256,{"v":1000,"d":"1000.00"},"Unsuccessful","2017-08-02"]
[17,"2017-08-08","USDINR AUG FUT","Buy",63.9425,63.6,64.15,64.5,"Profit of Rs 0.21/-",null,{"v":0.20750000000000313,"d":"0.21"},207.50000000000313,1000,"Successful","2017-08-10"]
[18,"2017-08-22","USDINR AUG FUT","Buy",64.1175,63.9,64.01,64.5,"Loss of Rs.0.11/-",null,{"$f":"G20-E20","v":{"v":-0.1075000000000017,"d":"-0.11"}},{"$f":"K20*M20","v":-107.5000000000017},{"v":1000,"d":"1000.00"},"Unsuccessful","2017-08-29"]
{"$rows_left_out":38}