{"text_format":"3","workbook":"xlsx","n_sheets":10,"sheets":["Main","Future Intra","Cash Intra","MidCap Intra","Bulk Deals","Call Tracker (Equity & F&O)","Call Tracker (Currency)","Sheet2","Sheet1","Sheet3"],"not_rendered":{"images":4,"defined_names":4},"read":"whole","date_system":"1900"}

{"sheet":"Main","index":0,"n_rows":17,"n_cols":4,"rows_kept":17}
[null,"                                                                                                 "]
{"$rows_empty":8}
[null,"2018-06-01"]
[]
[null,"Sheet No.","Template Name","Summary"]
[null,1,"Future Intra","For Intraday trading in F&O segment"]
[null,2,"Cash Intra","For Intraday trading in cash market segment"]
[null,3,"Mid-cap Intra","For Intraday trading in Mid-cap stocks"]
[null,4,"Bulk Deals","Reveals Bulk Deals carried on NSE & BSE"]
[null,5,"Call Tracker"]

{"sheet":"Future Intra","index":1,"n_rows":250,"n_cols":15,"rows_kept":250,"merged":[[8,0,9,0],[8,1,9,1],[8,2,9,2],[8,5,8,7],[8,8,8,10]]}
[]
[]
[]
[]
[{"$nulls":12},"Back to Main Page"]
["FOR INTRA DAY TRADING",{"$nulls":10},{"$f":"Main!B10","v":"2018-06-01"}]
[]
[]
["Sr.no","Sector","Scrip","CLOSE RATE","Pivot Point","Supports",null,null,"Resistances"]
[null,"Sector",null,"Point","Point","S1","S2","S3","R1","R2","R3","HIGH","LOW","OI","% Change in OI"]
[1,"Index","BANKNIFTY",{"v":26726.9,"d":"26726.90"},26623.55,26470.35,{"v":26213.8,"d":"26213.80"},{"v":26060.6,"d":"26060.60"},{"v":26880.1,"d":"26880.10"},{"v":27033.300000000003,"d":"27033.30"},27289.85,26776.75,26367,2878720,{"v":-0.040119504908237305,"d":"-4.01%"}]
[2,"Index","NIFTY",10702.15,{"v":10680.883333333333,"d":"10680.88"},{"v":10646.366666666667,"d":"10646.37"},{"v":10590.583333333334,"d":"10590.58"},{"v":10556.066666666668,"d":"10556.07"},{"v":10736.666666666666,"d":"10736.67"},{"v":10771.183333333332,"d":"10771.18"},{"v":10826.966666666665,"d":"10826.97"},10715.4,10625.1,19587825,{"v":-0.30362756469223695,"d":"-30.36%"}]
[3,"Index","NIFTYCPSE",2463.55,{"v":821.1833333333334,"d":"821.18"},{"v":1642.3666666666668,"d":"1642.37"},{"v":821.1833333333334,"d":"821.18"},{"v":1642.3666666666668,"d":"1642.37"},{"v":1642.3666666666668,"d":"1642.37"},{"v":821.1833333333334,"d":"821.18"},{"v":1642.3666666666668,"d":"1642.37"},0,0,0,{"v":0,"d":"0.00%"}]
[4,"Index","NIFTYINFRA",{"v":3389.3,"d":"3389.30"},{"v":1129.7666666666667,"d":"1129.77"},{"v":2259.5333333333333,"d":"2259.53"},{"v":1129.7666666666667,"d":"1129.77"},{"v":2259.5333333333333,"d":"2259.53"},{"v":2259.5333333333333,"d":"2259.53"},{"v":1129.7666666666667,"d":"1129.77"},{"v":2259.5333333333333,"d":"2259.53"},0,0,0,{"v":0,"d":"0.00%"}]
[5,"Index","NIFTYIT",{"v":13635,"d":"13635.00"},{"v":13584.666666666666,"d":"13584.67"},{"v":13500.333333333332,"d":"13500.33"},{"v":13365.666666666666,"d":"13365.67"},{"v":13281.333333333332,"d":"13281.33"},{"v":13719.333333333332,"d":"13719.33"},{"v":13803.666666666664,"d":"13803.67"},{"v":13938.333333333332,"d":"13938.33"},13669,13450,43500,{"v":-0.16023166023166024,"d":"-16.02%"}]
[6,"Index","NIFTYMID50",5065.85,{"v":1688.6166666666668,"d":"1688.62"},{"v":3377.2333333333336,"d":"3377.23"},{"v":1688.6166666666668,"d":"1688.62"},{"v":3377.2333333333336,"d":"3377.23"},{"v":3377.2333333333336,"d":"3377.23"},{"v":1688.6166666666668,"d":"1688.62"},{"v":3377.2333333333336,"d":"3377.23"},0,0,591400,{"v":-3.3806626098715348E-4,"d":"-0.03%"}]
[7,"Index","NIFTYPSE",{"v":3915.3,"d":"3915.30"},{"v":1305.1000000000001,"d":"1305.10"},{"v":2610.2000000000003,"d":"2610.20"},{"v":1305.1000000000001,"d":"1305.10"},{"v":2610.2000000000003,"d":"2610.20"},{"v":2610.2000000000003,"d":"2610.20"},{"v":1305.1000000000001,"d":"1305.10"},{"v":2610.2000000000003,"d":"2610.20"},0,0,0,{"v":0,"d":"0.00%"}]
[8,"Cement","ACC",{"v":1363.1,"d":"1363.10"},{"v":1348.3166666666666,"d":"1348.32"},{"v":1326.7333333333331,"d":"1326.73"},{"v":1290.3666666666666,"d":"1290.37"},{"v":1268.783333333333,"d":"1268.78"},{"v":1384.6833333333332,"d":"1384.68"},{"v":1406.2666666666667,"d":"1406.27"},{"v":1442.6333333333332,"d":"1442.63"},1369.9,1311.95,3753600,{"v":-0.23533246414602346,"d":"-23.53%"}]
[9,"Others","ADANIENT",{"v":121.9,"d":"121.90"},{"v":122.48333333333333,"d":"122.48"},{"v":120.61666666666667,"d":"120.62"},{"v":119.33333333333334,"d":"119.33"},{"v":117.46666666666668,"d":"117.47"},{"v":123.76666666666667,"d":"123.77"},{"v":125.63333333333331,"d":"125.63"},{"v":126.91666666666666,"d":"126.92"},124.35,121.2,11432000,{"v":-0.09298635353855919,"d":"-9.30%"}]
[10,"Others","ADANIPORTS",{"v":394,"d":"394.00"},388.45,{"v":377.2,"d":"377.20"},{"v":360.4,"d":"360.40"},349.15,405.25,{"v":416.5,"d":"416.50"},{"v":433.3,"d":"433.30"},399.7,371.65,12705000,{"v":-0.3487954894925679,"d":"-34.88%"}]
{"$rows_left_out":224}
{"sheet":"Cash Intra","index":2,"n_rows":248,"n_cols":13,"rows_kept":248,"merged":[[7,0,8,0],[7,1,8,1],[7,2,8,2],[7,3,8,3],[7,4,7,6],[7,7,7,9]]}
[]
[]
[]
[]
[{"$nulls":12},"Back to Main Page"]
["FOR INTRA DAY TRADING",{"$nulls":9},{"$f":"Main!B10","v":"2018-06-01"}]
[]
["Sr.no","Scrip","CLOSE RATE","Pivot Point","Supports",null,null,"Resistances"]
[null,null,"Point",null,"S1","S2","S3","R1","R2","R3","HIGH","LOW","Total Trade Quanity in Lakhs"]
[1,"Nifty 50",10736.15,{"v":10706.783333333333,"d":"10706.78"},{"v":10649.766666666666,"d":"10649.77"},{"v":10563.383333333333,"d":"10563.38"},{"v":10506.366666666667,"d":"10506.37"},{"v":10793.166666666666,"d":"10793.17"},{"v":10850.183333333332,"d":"10850.18"},{"v":10936.566666666666,"d":"10936.57"},10763.8,10620.4]
[2,"Nifty Bank",26956.2,{"v":26825.100000000002,"d":"26825.10"},{"v":26485.650000000005,"d":"26485.65"},{"v":26015.100000000002,"d":"26015.10"},{"v":25675.650000000005,"d":"25675.65"},{"v":27295.650000000005,"d":"27295.65"},{"v":27635.100000000002,"d":"27635.10"},{"v":28105.650000000005,"d":"28105.65"},27164.55,26354.55]
[3,"Nifty CPSE",2426.4,{"v":2420.666666666667,"d":"2420.67"},{"v":2405.0333333333338,"d":"2405.03"},{"v":2383.666666666667,"d":"2383.67"},{"v":2368.0333333333338,"d":"2368.03"},{"v":2442.0333333333338,"d":"2442.03"},{"v":2457.666666666667,"d":"2457.67"},{"v":2479.0333333333338,"d":"2479.03"},2436.3,2399.3]
[4,"Nifty Infra",3336.05,{"v":3330.516666666667,"d":"3330.52"},{"v":3305.1333333333337,"d":"3305.13"},{"v":3274.2166666666667,"d":"3274.22"},{"v":3248.8333333333335,"d":"3248.83"},{"v":3361.433333333334,"d":"3361.43"},{"v":3386.816666666667,"d":"3386.82"},{"v":3417.733333333334,"d":"3417.73"},3355.9,3299.6]
[5,"Nifty IT",13666,{"v":13607.333333333334,"d":"13607.33"},{"v":13519.366666666669,"d":"13519.37"},{"v":13372.733333333335,"d":"13372.73"},{"v":13284.76666666667,"d":"13284.77"},{"v":13753.966666666667,"d":"13753.97"},{"v":13841.93333333333,"d":"13841.93"},{"v":13988.566666666666,"d":"13988.57"},13695.3,13460.7]
[6,"Nifty PSE",3851.55,{"v":3841.283333333333,"d":"3841.28"},{"v":3818.716666666666,"d":"3818.72"},{"v":3785.8833333333328,"d":"3785.88"},{"v":3763.3166666666657,"d":"3763.32"},{"v":3874.116666666666,"d":"3874.12"},{"v":3896.6833333333334,"d":"3896.68"},{"v":3929.516666666666,"d":"3929.52"},3863.85,3808.45]
[7,"Nifty Midcap 50",5013.05,{"v":5027.500000000001,"d":"5027.50"},{"v":4990.4000000000015,"d":"4990.40"},{"v":4967.750000000001,"d":"4967.75"},{"v":4930.6500000000015,"d":"4930.65"},{"v":5050.1500000000015,"d":"5050.15"},{"v":5087.250000000002,"d":"5087.25"},{"v":5109.9000000000015,"d":"5109.90"},5064.6,5004.85]
[8,"ABB",1231.85,{"v":1235.6000000000001,"d":"1235.60"},{"v":1216.2500000000002,"d":"1216.25"},1200.65,{"v":1181.3000000000002,"d":"1181.30"},{"v":1251.2000000000003,"d":"1251.20"},{"v":1270.5500000000002,"d":"1270.55"},{"v":1286.1500000000003,"d":"1286.15"},1254.95,1220,0.41589]
[9,"ACC",1354.6,{"v":1340.3999999999999,"d":"1340.40"},{"v":1316.7999999999997,"d":"1316.80"},{"v":1278.9999999999998,"d":"1279.00"},{"v":1255.3999999999996,"d":"1255.40"},{"v":1378.1999999999998,"d":"1378.20"},{"v":1401.7999999999997,"d":"1401.80"},{"v":1439.6,"d":"1439.60"},1364,1302.6,38.73328]
[10,"AIAENG",1542.25,1559.25,{"v":1519.5,"d":"1519.50"},1496.75,{"v":1457,"d":"1457.00"},{"v":1582,"d":"1582.00"},1621.75,{"v":1644.5,"d":"1644.50"},1599,1536.5,0.3391]
[11,"AUBANK",697.3,{"v":696.3666666666667,"d":"696.37"},{"v":684.9333333333334,"d":"684.93"},{"v":672.5666666666667,"d":"672.57"},{"v":661.1333333333334,"d":"661.13"},{"v":708.7333333333333,"d":"708.73"},{"v":720.1666666666665,"d":"720.17"},{"v":732.5333333333333,"d":"732.53"},707.8,684,1.38884]
{"$rows_left_out":229}
{"sheet":"MidCap Intra","index":3,"n_rows":511,"n_cols":13,"rows_kept":511,"merged":[[0,0,0,1],[8,0,9,0],[8,1,9,1],[8,2,9,2],[8,3,9,3],[8,4,8,6],[8,7,8,9]]}
[]
[]
[]
[]
[{"$nulls":11},"Back To Main Page"]
["FOR INTRA DAY TRADING",{"$nulls":9},{"$f":"Main!B10","v":"2018-06-01"}]
[null,null," "]
[]
["Sr.no","Scrip","CLOSE RATE","Pivot Point","Supports",null,null,"Resistances"]
[null,null,"Point",null,"S1","S2","S3","R1","R2","R3","HIGH","LOW","Total Trade Quanity in Lakhs"]
[1,"3MINDIA",19543.6,{"v":19710.183333333334,"d":"19710.18"},{"v":19320.416666666668,"d":"19320.42"},{"v":19097.233333333334,"d":"19097.23"},{"v":18707.466666666667,"d":"18707.47"},{"v":19933.36666666667,"d":"19933.37"},{"v":20323.13333333333,"d":"20323.13"},{"v":20546.31666666667,"d":"20546.32"},20099.95,19487,0.02512]
[2,"8KMILES",602.2,{"v":610.0666666666667,"d":"610.07"},{"v":588.1333333333334,"d":"588.13"},{"v":574.0666666666667,"d":"574.07"},{"v":552.1333333333334,"d":"552.13"},{"v":624.1333333333334,"d":"624.13"},{"v":646.0666666666666,"d":"646.07"},{"v":660.1333333333334,"d":"660.13"},632,596,1.53913]
[3,"AARTIIND",1244.5,1244.55,1216.75,{"v":1189,"d":"1189.00"},{"v":1161.2,"d":"1161.20"},{"v":1272.3,"d":"1272.30"},{"v":1300.0999999999997,"d":"1300.10"},1327.85,1272.35,1216.8,0.31226]
[4,"ABAN",141.3,{"v":142.91666666666666,"d":"142.92"},{"v":138.38333333333333,"d":"138.38"},{"v":135.46666666666667,"d":"135.47"},{"v":130.93333333333334,"d":"130.93"},{"v":145.83333333333331,"d":"145.83"},{"v":150.36666666666667,"d":"150.37"},{"v":153.2833333333333,"d":"153.28"},147.45,140,12.75349]
[5,"ABB",1231.85,{"v":1235.6000000000001,"d":"1235.60"},{"v":1216.2500000000002,"d":"1216.25"},1200.65,{"v":1181.3000000000002,"d":"1181.30"},{"v":1251.2000000000003,"d":"1251.20"},{"v":1270.5500000000002,"d":"1270.55"},{"v":1286.1500000000003,"d":"1286.15"},1254.95,1220,0.41589]
[6,"ABCAPITAL",146.7,{"v":147.33333333333334,"d":"147.33"},{"v":145.4666666666667,"d":"145.47"},{"v":144.23333333333335,"d":"144.23"},{"v":142.3666666666667,"d":"142.37"},{"v":148.5666666666667,"d":"148.57"},{"v":150.4333333333333,"d":"150.43"},{"v":151.66666666666669,"d":"151.67"},149.2,146.1,9.88712]
[7,"ABFRL",148.3,{"v":147.86666666666667,"d":"147.87"},{"v":146.73333333333335,"d":"146.73"},{"v":145.16666666666669,"d":"145.17"},{"v":144.03333333333336,"d":"144.03"},{"v":149.43333333333334,"d":"149.43"},{"v":150.56666666666666,"d":"150.57"},{"v":152.13333333333333,"d":"152.13"},149,146.3,2.6612]
[8,"ACC",1354.6,{"v":1340.3999999999999,"d":"1340.40"},{"v":1316.7999999999997,"d":"1316.80"},{"v":1278.9999999999998,"d":"1279.00"},{"v":1255.3999999999996,"d":"1255.40"},{"v":1378.1999999999998,"d":"1378.20"},{"v":1401.7999999999997,"d":"1401.80"},{"v":1439.6,"d":"1439.60"},1364,1302.6,38.73328]
[9,"ADANIPORTS",392.15,{"v":386.3333333333333,"d":"386.33"},{"v":375.0666666666666,"d":"375.07"},{"v":357.9833333333333,"d":"357.98"},{"v":346.7166666666666,"d":"346.72"},{"v":403.41666666666663,"d":"403.42"},{"v":414.6833333333334,"d":"414.68"},{"v":431.76666666666665,"d":"431.77"},397.6,369.25,111.33305]
[10,"ADANIPOWER",20.15,{"v":20.183333333333334,"d":"20.18"},{"v":19.866666666666667,"d":"19.87"},{"v":19.583333333333332,"d":"19.58"},{"v":19.266666666666666,"d":"19.27"},{"v":20.46666666666667,"d":"20.47"},{"v":20.78333333333334,"d":"20.78"},{"v":21.06666666666667,"d":"21.07"},20.5,19.9,133.37604]
{"$rows_left_out":492}
{"sheet":"Bulk Deals","index":4,"n_rows":66,"n_cols":8,"rows_kept":66,"merged":[[4,0,4,1],[4,2,4,3],[6,1,6,2]]}
[" "]
[]
[]
[]
[]
[{"$nulls":4},"Back To Main Page"]
["Subject :","BULK DEAL",null,{"$f":"Main!B10","v":"2018-06-01"}]
[]
["Date","Scrip code","Scrip Name","Client Name","Buy / Sell","Quantity Traded","Trade Price / Wt.Avg.trade price","Exchange  "]
["2018-05-31",533260,"CAREERP","BHATIA SURESH HUF","SELL",{"v":157000,"d":"157,000"},108.3,"BSE"]
["2018-05-31",533260,"CAREERP","SURESH BHATIA ASSOCIATES","BUY",{"v":157000,"d":"157,000"},108.3,"BSE"]
["2018-05-31",531502,"ESARIND","PARAG RAMESHCHANDRA MALDE .","BUY",{"v":215000,"d":"215,000"},2.21,"BSE"]
["2018-05-31",531502,"ESARIND","URVASHI MAYUR MEHTA .","SELL",{"v":115000,"d":"115,000"},2.21,"BSE"]
["2018-05-31",531502,"ESARIND","AIGLET SUPPLIERS PVT LTD","SELL",{"v":150000,"d":"150,000"},2.21,"BSE"]
["2018-05-31",538568,"FRUTION","OPTO FABRICS PRIVATE LIMITED","SELL",{"v":44101,"d":"44,101"},9.74,"BSE"]
["2018-05-31",538568,"FRUTION","ELEVATE TRADING PRIVATE LIMITED","BUY",{"v":44101,"d":"44,101"},9.74,"BSE"]
["2018-05-31",532997,"KSK","BP FINTRADE PRIVATE LIMITED","SELL",{"v":637207,"d":"637,207"},3.26,"BSE"]
["2018-05-31",532997,"KSK","BP FINTRADE PRIVATE LIMITED","BUY",{"v":2637207,"d":"2,637,207"},3.26,"BSE"]
["2018-05-31",541337,"MILEFUR","ADROIT TRADELINK PRIVATE LIMITED","BUY",{"v":99000,"d":"99,000"},41.89,"BSE"]
["2018-05-31",541337,"MILEFUR","CHINTAN GIRISHBHAI SHAH","SELL",{"v":99000,"d":"99,000"},41.74,"BSE"]
{"$rows_left_out":47}
{"sheet":"Call Tracker (Equity & F&O)","index":5,"n_rows":307,"n_cols":18,"rows_kept":307,"merged":[[43,0,44,0],[43,1,44,1],[43,9,44,9],[43,12,44,12],[43,13,44,13],[43,14,44,14]]}
[]
[]
[]
[]
[{"$nulls":12},"Back To Main Page"]
["Retail Research Technical Calls & Fundamental Performance Report for the month of May -2018 "]
[{"$nulls":12},{"$f":"Main!B10","v":"2018-06-01"}]
[null,"Positional  Call"]
["Sr.no","Date",null,"Company","Rec","Rec Price","Stop Loss***","Call Closed At","Target","Remark","Profit / Loss per Share","Gain / Loss  %","Status","Closed Date","NSE Closed Price"]
[1,"2018-02-12",null,"ITC","Buy",271.5,250,285,310,"Profit of Rs.13.5/-",{"$f":"H10-F10","v":13.5},{"$f":"K10/F10","v":{"v":0.049723756906077346,"d":"4.97%"}},"Successful","2018-05-02",{"$nulls":3},"P"]
[1,"2018-04-05",null,"RECLTD","Buy",129,122,121,140,"Loss of Rs.8/-",{"$f":"H11-F11","v":-8},{"$f":"K11/F11","v":{"v":-0.06201550387596899,"d":"-6.20%"}},"Unsuccessful","2018-05-10",{"$nulls":3},"R"]
[2,"2018-04-11",null,"FEDERALBNK","Buy",98.75,94,103.45,"106-109","Profit of Rs.4.7/-",{"$f":"H12-F12","v":4.700000000000003},{"$f":"K12/F12","v":{"v":0.04759493670886079,"d":"4.76%"}},"Successful","2019-05-09",{"$nulls":3},"R"]
[4,"2018-04-18",null,"BHEL","Buy$",88.5,79,78.75,100,"Loss of Rs.9.75/-",{"$f":"H13-F13","v":-9.75},{"$f":"K13/F13","v":{"v":-0.11016949152542373,"d":"-11.02%"}},"Unsuccessful","2018-05-14",{"$nulls":3},"A"]
[5,"2018-04-20",null,"HINDZINC","Sell",325.5,340,314.5,"310-305","Profit of Rs.11/-",{"$f":"F14-H14","v":11},{"$f":"K14/F14","v":{"v":0.03379416282642089,"d":"3.38%"}},"Successful","2018-05-02",{"$nulls":3},"H"]
[6,"2018-04-26",null,"HCLTECH","Buy",1060,1018,1015,"1130-1150","Loss of Rs.45/-",{"$f":"H15-F15","v":-45},{"v":-0.04245283018867924,"d":"-4.25%"},"Unsuccessful","2018-05-02",{"$nulls":3},"H"]
[7,"2018-04-27",null,"PFC","Buy",85.8,82.5,89.45,"91-93","Profit of Rs.3.65/-",{"$f":"H16-F16","v":3.6500000000000057},{"v":0.042540792540792606,"d":"4.25%"},"Successful","2018-05-02",{"$nulls":3},"H"]
[8,"2018-04-30",null,"HEXAWARE","Sell",447,464,428.5,"410-400","Profit of Rs.18.5/-",{"$f":"F17-H17","v":18.5},{"v":0.04138702460850112,"d":"4.14%"},"Successful","2018-05-05",{"$nulls":3},"H"]
[9,"2018-05-04",null,"GLENMARK","Buy",544,520,513,"580-585","Loss of Rs.31/-",{"$f":"H18-F18","v":-31},{"v":-0.05698529411764706,"d":"-5.70%"},"Unsuccessful","2018-05-11",{"$nulls":3},"R"]
[10,"2018-05-04",null,"L&TFH","Buy",177.5,169,183.25,"190-195"," Profit of Rs.5.75/-",{"$f":"H19-F19","v":5.75},{"v":0.0323943661971831,"d":"3.24%"},"Successful","2018-05-08",{"$nulls":3},"H"]
[11,"2018-05-04",null,"HCLTECH","Buy","920-930",890,null,"980-990","Open",{"$nulls":4},{"$f":"VLOOKUP(D20,Sheet2!$A$1:M2159,6,0)","v":910.35},null,null,"H"]
{"$rows_left_out":288}
{"sheet":"Call Tracker (Currency)","index":6,"n_rows":58,"n_cols":18,"rows_kept":58,"hidden":true,"merged":[[1,8,1,9],[2,8,2,9],[3,8,3,9],[4,8,4,9],[5,8,5,9],[6,8,6,9],[7,8,7,9],[8,8,8,9],[9,8,9,9],[10,8,10,9],[11,8,11,9],[12,8,12,9],[13,8,13,9],[14,8,14,9],[15,8,15,9],[16,8,16,9],[17,8,17,9],[18,8,18,9],[19,8,19,9],[20,8,20,9],[21,8,21,9],[22,8,22,9],[23,8,23,9],[24,8,24,9],[25,8,25,9],[26,8,26,9],[27,8,27,9],[28,8,28,9],[29,8,29,9],[30,8,30,9],[31,8,31,9],[32,8,32,9],[33,8,33,9],[34,8,34,9],[35,8,35,9],[36,8,36,9],[37,8,37,9],[38,8,38,9],[39,8,39,9],[40,8,40,9],[41,8,41,9],[42,8,42,9],[43,8,43,9],[44,8,44,9],[45,8,45,9],[46,8,46,9],[47,8,47,9],[48,8,48,9],[49,8,49,9],[50,8,50,9],[51,8,51,9],[52,8,52,9],[53,8,53,9],[54,8,54,9],[55,8,55,9],[56,8,56,9],[57,8,57,9],[58,8,58,9],[59,8,59,9],[60,8,60,9],[61,8,61,9],[62,8,62,9],[63,8,63,9],[64,8,64,9],[65,8,65,9],[66,8,66,9],[67,8,67,9],[68,8,68,9],[69,8,69,9],[70,8,70,9],[71,8,71,9],[72,8,72,9],[73,8,73,9],[74,8,74,9],[75,8,75,9],[76,8,76,9],[77,8,77,9],[78,8,78,9],[79,8,79,9],[80,8,80,9],[81,8,81,9],[82,8,82,9],[83,8,83,9],[84,8,84,9],[85,8,85,9],[86,8,86,9],[87,8,87,9],[88,8,88,9],[89,8,89,9],[90,8,90,9],[91,8,91,9],[92,8,92,9],[93,8,93,9],[94,8,94,9],[95,8,95,9],[96,8,96,9],[97,8,97,9],[98,8,98,9],[99,8,99,9],[100,8,100,9],[101,8,101,9],[102,8,102,9],[103,8,103,9],[104,8,104,9],[105,8,105,9],[106,8,106,9],[107,8,107,9],[108,8,108,9],[109,8,109,9],[110,8,110,9],[111,8,111,9],[112,8,112,9],[113,8,113,9],[114,8,114,9],[115,8,115,9],[116,8,116,9],[117,8,117,9],[118,8,118,9],[119,8,119,9],[120,8,120,9],[121,8,121,9],[122,8,122,9],[123,8,123,9],[124,8,124,9]]}
["Master Trade High Risk"]
["Sr.no","Date","Company","Rec","Rec Price","Stop Loss","Call Closed At","Target","Remark",null,"Profit / Loss per share","Gain / Loss  per Lot","Lot","Status","Closed Date"]
[1,"2017-05-08","USDINR MAY FUT","Buy",64.3935,64.29,64.66,64.59,"Profit of Rs.0.27/-",null,{"v":0.2664999999999935,"d":"0.27"},266.4999999999935,1000,"Successful","2017-05-09",null,null,"P"]
[2,"2017-05-08","USDINR JUN FUT","Buy",64.6535,64.45,64.965,65.05,"Profit of Rs 0.31/-",null,{"v":0.31150000000000944,"d":"0.31"},311.50000000000944,1000,"Successful","2017-05-09",null,null,"P"]
[3,"2017-05-09","EUROINR MAY FUT","Sell",70.65,70.8,70.07,70.4,"Profit of Rs 0.58/-",null,{"v":0.580000000000013,"d":"0.58"},580.00000000001,1000,"Successful","2017-05-12",null,null,"P"]
[4,"2017-05-09","GBPINR MAY FUT","Buy",83.774,83.37,83.37,84.77,"Loss of Rs 0.40/-",null,{"v":-0.40399999999999636,"d":"-0.40"},-403.99999999999636,1000,"Unsuccessful","2017-05-11",null,null,"P"]
[5,"2017-05-11","USDINR MAY FUT","Buy",64.6555,64.55,64.55,64.86,"Loss of Rs.0.1055/-",null,-0.10550000000000637,{"$f":"K7*M7","v":{"v":-105.50000000000637,"d":"-105.50"}},1000,"Unsuccessful","2017-05-11",null,null,"P"]
[6,"2017-05-15","USDINR MAY FUT","Buy",64.2275,64.08,64.46,64.48,"Profit of Rs 0.23/-",null,{"v":0.2324999999999875,"d":"0.23"},232.4999999999875,1000,"Successful","2017-05-18",null,null,"P"]
[7,"2017-05-19","USDINR MAY FUT","Sell",64.83,65,65,64.5,"Loss of Rs.0.17/-",null,{"v":-0.1700000000000017,"d":"-0.17"},-170.0000000000017,1000,"Unsuccessful","2017-05-19",null,null,"P"]
[8,"2017-05-23","USDINR MAY FUT","Buy",64.83,64.62,64.95,65.2,"Profit of Rs 0.12/-",null,{"v":0.12000000000000455,"d":"0.12"},120.00000000000455,1000,"Successful","2017-05-24",null,null,"P"]
[9,"2017-05-25","USDINR MAY FUT","Buy",64.57,64.25,64.56,65,"Loss of Rs.0.01/-",null,-0.009999999999990905,-9.999999999990905,1000,"Neutral","2017-05-29",null,null,"P"]
[10,"2017-05-30","USDINR JUN FUT","Buy",64.9125,64.71,64.71,65.31,"Loss of Rs.0.20/-",null,{"v":-0.20250000000000057,"d":"-0.20"},-202.50000000000057,1000,"Unsuccessful","2017-05-31",null,null,"P"]
[11,"2017-06-01","USDINR JUN FUT","Buy",64.655,64.45,64.45,65.05,"Loss of Rs.0.20/-",null,{"$f":"G13-E13","v":{"v":-0.2049999999999983,"d":"-0.20"}},{"$f":"K13*M13","v":-204.9999999999983},{"v":1000,"d":"1000.00"},"Unsuccessful","2017-06-08",null,null,"P"]
[12,"2017-06-12","USDINR JUN FUT","Buy",64.45,64,64.7625,65.2,"Profit of Rs 0.31/-",null,{"v":0.3125,"d":"0.31"},312.5,1000,"Successful","2017-06-16"]
[13,"2017-06-16","USDINR JUN FUT","Buy",64.51,64.2,64.7,65.11,"Profit of Rs 0.19/-",null,{"v":0.18999999999999773,"d":"0.19"},189.99999999999773,1000,"Successful","2017-06-21"]
[14,"2017-06-22","USDINR JUN FUT","Buy",64.56,64.2,64.2,65.1,"Loss of Rs.0.36/-",null,{"v":-0.35999999999999943,"d":"-0.36"},-359.99999999999943,{"v":1000,"d":"1000.00"},"Unsuccessful","2017-06-30"]
[15,"2017-07-10","USDINR JUL FUT","Buy",64.67,64.4,64.4,65.15,"Loss of Rs.0.27/-",null,{"v":-0.269999999999996,"d":"-0.27"},-269.999999999996,{"v":1000,"d":"1000.00"},"Unsuccessful","2017-07-31"]
[16,"2017-08-02","USDINR AUG FUT","Buy",64.235,63.98,63.98,64.75,"Loss of Rs.0.26/-",null,{"v":-0.25500000000000256,"d":"-0.26"},-255.00000000000256,{"v":1000,"d":"1000.00"},"Unsuccessful","2017-08-02"]
[17,"2017-08-08","USDINR AUG FUT","Buy",63.9425,63.6,64.15,64.5,"Profit of Rs 0.21/-",null,{"v":0.20750000000000313,"d":"0.21"},207.50000000000313,1000,"Successful","2017-08-10"]
[18,"2017-08-22","USDINR AUG FUT","Buy",64.1175,63.9,64.01,64.5,"Loss of Rs.0.11/-",null,{"$f":"G20-E20","v":{"v":-0.1075000000000017,"d":"-0.11"}},{"$f":"K20*M20","v":-107.5000000000017},{"v":1000,"d":"1000.00"},"Unsuccessful","2017-08-29"]
{"$rows_left_out":39}
{"sheet":"Sheet2","index":7,"n_rows":1646,"n_cols":14,"rows_kept":1646,"hidden":true}
["SYMBOL","SERIES","OPEN","HIGH","LOW","CLOSE","LAST","PREVCLOSE","TOTTRDQTY","TOTTRDVAL","TIMESTAMP","TOTALTRADES","ISIN","ISIN"]
["20MICRONS","EQ",42.2,43.55,41,43,43,41.65,139193,5885953.4,"2018-05-31",802,"INE144J01027"]
["21STCENMGM","EQ",38,38.5,37.55,38.5,38.5,38.3,2666,100556.25,"2018-05-31",46,"INE253B01015"]
["3IINFOTECH","EQ",4.85,4.85,4.75,4.75,4.75,4.8,1103902,5298891.15,"2018-05-31",579,"INE748C01020"]
["3MINDIA","EQ",20099,20099.95,19487,19543.6,19500.3,20011.75,2512,49400782.15,"2018-05-31",809,"INE470A01017"]
["3PLAND","EQ",13.45,13.75,13.15,13.7,13.75,13.45,1127,15209.7,"2018-05-31",20,"INE105C01023"]
["5PAISA","EQ",440.15,451,408.5,408.7,408.5,429.95,11710,4990547.05,"2018-05-31",566,"INE618L01018"]
["63MOONS","EQ",78.6,79.3,77.1,77.85,77.7,78.4,149159,11669637.6,"2018-05-31",1835,"INE111B01023"]
["8KMILES","EQ",627.5,632,596,602.2,599.5,619.35,153913,94364448.7,"2018-05-31",6696,"INE650K01021"]
["A2ZINFRA","EQ",24.5,25.05,23.2,23.45,23.6,24.25,478728,11533404.8,"2018-05-31",2230,"INE619I01012"]
["AARTIDRUGS","EQ",533.95,533.95,517,519.65,517.1,519.5,3721,1938044.6,"2018-05-31",358,"INE767A01016"]
["AARTIIND","EQ",1242,1272.35,1216.8,1244.5,1263,1240.2,31226,38404008.3,"2018-05-31",3025,"INE769A01020"]
["AARVEEDEN","EQ",37.55,37.95,36.55,36.65,36.55,37.6,50919,1888365.4,"2018-05-31",126,"INE273D01019"]
["ABAN","EQ",146,147.45,140,141.3,141.25,145.8,1275349,182544195.35,"2018-05-31",15310,"INE421A01028"]
["ABB","EQ",1242.25,1254.95,1220,1231.85,1231,1239.45,41589,51405300.95,"2018-05-31",3350,"INE117A01022"]
["ABBOTINDIA","EQ",6760,6810,6651,6674.35,6651,6736.85,5992,40242845.55,"2018-05-31",3360,"INE358A01014"]
["ABCAPITAL","EQ",148.2,149.2,146.1,146.7,146.55,147.5,988712,145785273.1,"2018-05-31",10769,"INE674K01013"]
["ABFRL","EQ",146.35,149,146.3,148.3,148,146.8,266120,39334429.1,"2018-05-31",2866,"INE647O01011"]
["ACC","EQ",1315,1364,1302.6,1354.6,1358,1309.4,3873328,5223620632.6,"2018-05-31",103723,"INE012A01025"]
["ACCELYA","EQ",1185,1185,1150,1166.2,1165.05,1168.8,2632,3045237.65,"2018-05-31",349,"INE793A01012"]
{"$rows_left_out":1627}
{"sheet":"Sheet1","index":8,"n_rows":0,"n_cols":0,"rows_kept":0,"hidden":true}

{"sheet":"Sheet3","index":9,"n_rows":0,"n_cols":0,"rows_kept":0,"hidden":true}