{"text_format":"3","workbook":"xlsx","n_sheets":9,"sheets":["Main","Future Intra","Cash Intra","MidCap Intra","Bulk Deals","Call Tracker (Equity & F&O)","Sheet2","Sheet1","Sheet3"],"not_rendered":{"images":4,"defined_names":4},"read":"whole","date_system":"1900"}

{"sheet":"Main","index":0,"n_rows":17,"n_cols":4,"rows_kept":17}
[null,"                                                                                                 "]
{"$rows_empty":8}
[null,"2019-02-01"]
[]
[null,"Sheet No.","Template Name","Summary"]
[null,1,"Future Intra","For Intraday trading in F&O segment"]
[null,2,"Cash Intra","For Intraday trading in cash market segment"]
[null,3,"Mid-cap Intra","For Intraday trading in Mid-cap stocks"]
[null,4,"Bulk Deals","Reveals Bulk Deals carried on NSE & BSE"]
[null,5,"Call Tracker"]

{"sheet":"Future Intra","index":1,"n_rows":239,"n_cols":15,"rows_kept":239,"merged":[[8,0,9,0],[8,1,9,1],[8,2,9,2],[8,5,8,7],[8,8,8,10]]}
[]
[]
[]
[]
[{"$nulls":12},"Back to Main Page"]
["FOR INTRA DAY TRADING",{"$nulls":10},{"$f":"Main!B10","v":"2019-02-01"}]
[]
[]
["Sr.no","Sector","Scrip","CLOSE RATE","Pivot Point","Supports",null,null,"Resistances"]
[null,"Sector",null,"Point","Point","S1","S2","S3","R1","R2","R3","HIGH","LOW","OI","% Change in OI"]
[1,"Index","BANKNIFTY",{"v":27335.2,"d":"27335.20"},27216.55,{"v":27068.649999999998,"d":"27068.65"},{"v":26802.1,"d":"26802.10"},{"v":26654.199999999997,"d":"26654.20"},{"v":27483.1,"d":"27483.10"},{"v":27631,"d":"27631.00"},27897.55,27364.45,26950,1443860,{"v":-0.20723658924943722,"d":"-20.72%"}]
[2,"Index","NIFTY",{"v":10856.2,"d":"10856.20"},{"v":10810.816666666668,"d":"10810.82"},{"v":10753.533333333335,"d":"10753.53"},{"v":10650.866666666667,"d":"10650.87"},{"v":10593.583333333334,"d":"10593.58"},{"v":10913.483333333335,"d":"10913.48"},{"v":10970.766666666668,"d":"10970.77"},{"v":11073.433333333336,"d":"11073.43"},10868.1,10708.15,18691725,{"v":-0.37177535227244085,"d":"-37.18%"}]
[3,"Index","NIFTYIT",{"v":15570,"d":"15570.00"},{"v":15497,"d":"15497.00"},{"v":15408,"d":"15408.00"},{"v":15246,"d":"15246.00"},{"v":15157,"d":"15157.00"},{"v":15659,"d":"15659.00"},{"v":15748,"d":"15748.00"},{"v":15910,"d":"15910.00"},15586,15335,21900,{"v":-0.020134228187919462,"d":"-2.01%"}]
[4,"Cement","ACC",1429.15,{"v":1420.5333333333335,"d":"1420.53"},{"v":1407.066666666667,"d":"1407.07"},{"v":1384.9833333333336,"d":"1384.98"},{"v":1371.516666666667,"d":"1371.52"},{"v":1442.616666666667,"d":"1442.62"},{"v":1456.0833333333337,"d":"1456.08"},{"v":1478.166666666667,"d":"1478.17"},1434,1398.45,1496800,{"v":-0.07559288537549406,"d":"-7.56%"}]
[5,"Others","ADANIENT",137.85,{"v":139.1,"d":"139.10"},134.85,131.85,{"v":127.6,"d":"127.60"},{"v":142.1,"d":"142.10"},146.35,149.35,143.35,136.1,40084000,{"v":-0.05220845549985813,"d":"-5.22%"}]
[6,"Others","ADANIPORTS",{"v":340.7,"d":"340.70"},338.55,{"v":334,"d":"334.00"},{"v":327.3,"d":"327.30"},322.75,345.25,{"v":349.80000000000007,"d":"349.80"},{"v":356.5,"d":"356.50"},343.1,331.85,22860000,{"v":-0.11728931364031277,"d":"-11.73%"}]
[7,"Power","ADANIPOWER",{"v":45.7,"d":"45.70"},{"v":45.21666666666667,"d":"45.22"},{"v":43.833333333333336,"d":"43.83"},{"v":41.96666666666667,"d":"41.97"},{"v":40.583333333333336,"d":"40.58"},{"v":47.083333333333336,"d":"47.08"},{"v":48.46666666666666,"d":"48.47"},{"v":50.333333333333336,"d":"50.33"},46.6,43.35,150900000,{"v":-0.10561877667140825,"d":"-10.56%"}]
[8,"Pharma","AJANTPHARM",{"v":1025.1,"d":"1025.10"},{"v":1034.0166666666667,"d":"1034.02"},{"v":1003.2333333333333,"d":"1003.23"},{"v":981.3666666666667,"d":"981.37"},{"v":950.5833333333334,"d":"950.58"},{"v":1055.8833333333332,"d":"1055.88"},{"v":1086.6666666666665,"d":"1086.67"},{"v":1108.5333333333333,"d":"1108.53"},1064.8,1012.15,651500,{"v":-0.0397936624907885,"d":"-3.98%"}]
[9,"Banking","ALBK",45.05,{"v":45.083333333333336,"d":"45.08"},{"v":44.51666666666667,"d":"44.52"},{"v":43.983333333333334,"d":"43.98"},{"v":43.41666666666667,"d":"43.42"},{"v":45.616666666666674,"d":"45.62"},{"v":46.18333333333334,"d":"46.18"},{"v":46.716666666666676,"d":"46.72"},45.65,44.55,16458000,{"v":-0.05451829723674384,"d":"-5.45%"}]
[10,"Automobile","AMARAJABAT",{"v":744.4,"d":"744.40"},{"v":745.4499999999999,"d":"745.45"},{"v":738.9999999999999,"d":"739.00"},{"v":733.5999999999999,"d":"733.60"},{"v":727.1499999999999,"d":"727.15"},{"v":750.8499999999999,"d":"750.85"},{"v":757.3,"d":"757.30"},{"v":762.6999999999999,"d":"762.70"},751.9,740.05,941500,{"v":-0.2477628635346756,"d":"-24.78%"}]
{"$rows_left_out":210}
{"sheet":"Cash Intra","index":2,"n_rows":247,"n_cols":13,"rows_kept":247,"merged":[[7,0,8,0],[7,1,8,1],[7,2,8,2],[7,3,8,3],[7,4,7,6],[7,7,7,9]]}
[]
[]
[]
[]
[{"$nulls":12},"Back to Main Page"]
["FOR INTRA DAY TRADING",{"$nulls":9},{"$f":"Main!B10","v":"2019-02-01"}]
[]
["Sr.no","Scrip","CLOSE RATE","Pivot Point","Supports",null,null,"Resistances"]
[null,null,"Point",null,"S1","S2","S3","R1","R2","R3","HIGH","LOW","Total Trade Quanity in Lakhs"]
[1,"Nifty 50",10830.95,{"v":10782.516666666666,"d":"10782.52"},{"v":10726.983333333334,"d":"10726.98"},{"v":10623.016666666666,"d":"10623.02"},{"v":10567.483333333334,"d":"10567.48"},{"v":10886.483333333334,"d":"10886.48"},{"v":10942.016666666666,"d":"10942.02"},{"v":11045.983333333334,"d":"11045.98"},10838.05,10678.55]
[2,"Nifty Bank",27295.45,{"v":27170.516666666666,"d":"27170.52"},{"v":27015.983333333334,"d":"27015.98"},{"v":26736.516666666666,"d":"26736.52"},{"v":26581.983333333334,"d":"26581.98"},{"v":27449.983333333334,"d":"27449.98"},{"v":27604.516666666666,"d":"27604.52"},{"v":27883.983333333334,"d":"27883.98"},27325.05,26891.05]
[3,"Nifty CPSE",1977.3,{"v":1977.4166666666667,"d":"1977.42"},{"v":1964.9833333333336,"d":"1964.98"},{"v":1952.6666666666667,"d":"1952.67"},{"v":1940.2333333333336,"d":"1940.23"},{"v":1989.7333333333336,"d":"1989.73"},{"v":2002.1666666666665,"d":"2002.17"},{"v":2014.4833333333336,"d":"2014.48"},1989.85,1965.1]
[4,"Nifty Infra",2976.85,{"v":2969.5333333333333,"d":"2969.53"},{"v":2956.7166666666667,"d":"2956.72"},{"v":2936.5833333333335,"d":"2936.58"},{"v":2923.766666666667,"d":"2923.77"},{"v":2989.6666666666665,"d":"2989.67"},{"v":3002.483333333333,"d":"3002.48"},{"v":3022.6166666666663,"d":"3022.62"},2982.35,2949.4]
[5,"Nifty IT",15499.3,{"v":15429.6,"d":"15429.60"},15345.75,{"v":15192.199999999999,"d":"15192.20"},{"v":15108.349999999999,"d":"15108.35"},{"v":15583.150000000001,"d":"15583.15"},{"v":15667.000000000004,"d":"15667.00"},{"v":15820.550000000003,"d":"15820.55"},15513.45,15276.05]
[6,"Nifty PSE",3207.7,{"v":3203.5166666666664,"d":"3203.52"},{"v":3185.033333333333,"d":"3185.03"},{"v":3162.3666666666663,"d":"3162.37"},{"v":3143.8833333333328,"d":"3143.88"},{"v":3226.183333333333,"d":"3226.18"},{"v":3244.6666666666665,"d":"3244.67"},{"v":3267.333333333333,"d":"3267.33"},3222,3180.85]
[7,"Nifty Midcap 50",4689.1,{"v":4673.283333333334,"d":"4673.28"},{"v":4643.166666666668,"d":"4643.17"},{"v":4597.2333333333345,"d":"4597.23"},{"v":4567.116666666669,"d":"4567.12"},{"v":4719.216666666667,"d":"4719.22"},{"v":4749.333333333334,"d":"4749.33"},{"v":4795.266666666666,"d":"4795.27"},4703.4,4627.35]
[8,"ABB",1272.3,{"v":1270.5666666666666,"d":"1270.57"},{"v":1253.0333333333333,"d":"1253.03"},{"v":1233.7666666666667,"d":"1233.77"},{"v":1216.2333333333333,"d":"1216.23"},{"v":1289.8333333333333,"d":"1289.83"},{"v":1307.3666666666666,"d":"1307.37"},{"v":1326.6333333333332,"d":"1326.63"},1288.1,1251.3,0.80557]
[9,"ACC",1423.35,{"v":1414.3999999999999,"d":"1414.40"},{"v":1399.9999999999998,"d":"1400.00"},{"v":1376.6499999999999,"d":"1376.65"},{"v":1362.2499999999998,"d":"1362.25"},{"v":1437.7499999999998,"d":"1437.75"},{"v":1452.1499999999999,"d":"1452.15"},{"v":1475.4999999999998,"d":"1475.50"},1428.8,1391.05,8.37929]
[10,"AIAENG",1607.2,{"v":1610.5166666666667,"d":"1610.52"},{"v":1587.1833333333334,"d":"1587.18"},{"v":1567.1666666666667,"d":"1567.17"},{"v":1543.8333333333335,"d":"1543.83"},{"v":1630.5333333333333,"d":"1630.53"},{"v":1653.8666666666668,"d":"1653.87"},{"v":1673.8833333333332,"d":"1673.88"},1633.85,1590.5,0.18963]
[11,"AUBANK",584.25,{"v":586.9,"d":"586.90"},{"v":579,"d":"579.00"},573.75,565.85,592.15,{"v":600.0499999999998,"d":"600.05"},{"v":605.3,"d":"605.30"},594.8,581.65,2.57833]
{"$rows_left_out":228}
{"sheet":"MidCap Intra","index":3,"n_rows":510,"n_cols":13,"rows_kept":510,"merged":[[0,0,0,1],[8,0,9,0],[8,1,9,1],[8,2,9,2],[8,3,9,3],[8,4,8,6],[8,7,8,9]]}
[]
[]
[]
[]
[{"$nulls":11},"Back To Main Page"]
["FOR INTRA DAY TRADING",{"$nulls":9},{"$f":"Main!B10","v":"2019-02-01"}]
[null,null," "]
[]
["Sr.no","Scrip","CLOSE RATE","Pivot Point","Supports",null,null,"Resistances"]
[null,null,"Point",null,"S1","S2","S3","R1","R2","R3","HIGH","LOW","Total Trade Quanity in Lakhs"]
[1,"3MINDIA",20151.6,{"v":20220.833333333332,"d":"20220.83"},{"v":20045.766666666663,"d":"20045.77"},{"v":19939.93333333333,"d":"19939.93"},{"v":19764.86666666666,"d":"19764.87"},{"v":20326.666666666664,"d":"20326.67"},{"v":20501.733333333337,"d":"20501.73"},{"v":20607.566666666666,"d":"20607.57"},20395.9,20115,4.64E-3]
[2,"8KMILES",126,{"v":126,"d":"126.00"},{"v":126,"d":"126.00"},{"v":126,"d":"126.00"},{"v":126,"d":"126.00"},{"v":126,"d":"126.00"},{"v":126,"d":"126.00"},{"v":126,"d":"126.00"},126,126,0.70867]
[3,"AARTIIND",1625.65,{"v":1631.2333333333333,"d":"1631.23"},{"v":1602.9666666666667,"d":"1602.97"},{"v":1580.2833333333333,"d":"1580.28"},{"v":1552.0166666666667,"d":"1552.02"},{"v":1653.9166666666667,"d":"1653.92"},{"v":1682.1833333333336,"d":"1682.18"},{"v":1704.8666666666668,"d":"1704.87"},1659.5,1608.55,0.92067]
[4,"ABAN",67.15,{"v":66.63333333333334,"d":"66.63"},{"v":65.56666666666668,"d":"65.57"},{"v":63.983333333333334,"d":"63.98"},{"v":62.91666666666667,"d":"62.92"},{"v":68.21666666666668,"d":"68.22"},{"v":69.28333333333335,"d":"69.28"},{"v":70.86666666666669,"d":"70.87"},67.7,65.05,3.6156]
[5,"ABB",1272.3,{"v":1270.5666666666666,"d":"1270.57"},{"v":1253.0333333333333,"d":"1253.03"},{"v":1233.7666666666667,"d":"1233.77"},{"v":1216.2333333333333,"d":"1216.23"},{"v":1289.8333333333333,"d":"1289.83"},{"v":1307.3666666666666,"d":"1307.37"},{"v":1326.6333333333332,"d":"1326.63"},1288.1,1251.3,0.80557]
[6,"ABCAPITAL",81,{"v":81.39999999999999,"d":"81.40"},{"v":79.79999999999998,"d":"79.80"},{"v":78.6,"d":"78.60"},{"v":76.99999999999999,"d":"77.00"},{"v":82.59999999999998,"d":"82.60"},{"v":84.19999999999997,"d":"84.20"},{"v":85.39999999999998,"d":"85.40"},83,80.2,22.86803]
[7,"ABFRL",209.5,{"v":209.46666666666667,"d":"209.47"},{"v":205.03333333333333,"d":"205.03"},{"v":200.56666666666666,"d":"200.57"},{"v":196.13333333333333,"d":"196.13"},{"v":213.93333333333334,"d":"213.93"},{"v":218.36666666666667,"d":"218.37"},{"v":222.83333333333334,"d":"222.83"},213.9,205,7.01118]
[8,"ACC",1423.35,{"v":1414.3999999999999,"d":"1414.40"},{"v":1399.9999999999998,"d":"1400.00"},{"v":1376.6499999999999,"d":"1376.65"},{"v":1362.2499999999998,"d":"1362.25"},{"v":1437.7499999999998,"d":"1437.75"},{"v":1452.1499999999999,"d":"1452.15"},{"v":1475.4999999999998,"d":"1475.50"},1428.8,1391.05,8.37929]
[9,"ADANIPORTS",338.65,{"v":336.84999999999997,"d":"336.85"},{"v":331.99999999999994,"d":"332.00"},{"v":325.34999999999997,"d":"325.35"},{"v":320.49999999999994,"d":"320.50"},{"v":343.49999999999994,"d":"343.50"},{"v":348.34999999999997,"d":"348.35"},{"v":354.99999999999994,"d":"355.00"},341.7,330.2,64.03921]
[10,"ADANIPOWER",45.5,{"v":45.01666666666667,"d":"45.02"},{"v":43.533333333333346,"d":"43.53"},{"v":41.56666666666667,"d":"41.57"},{"v":40.08333333333334,"d":"40.08"},{"v":46.98333333333335,"d":"46.98"},{"v":48.46666666666668,"d":"48.47"},{"v":50.43333333333335,"d":"50.43"},46.5,43.05,176.42681]
{"$rows_left_out":491}
{"sheet":"Bulk Deals","index":4,"n_rows":65,"n_cols":8,"rows_kept":65,"merged":[[4,0,4,1],[4,2,4,3],[6,1,6,2]]}
[" "]
[]
[]
[]
[]
[{"$nulls":4},"Back To Main Page"]
["Subject :","BULK DEAL",null,{"$f":"Main!B10","v":"2019-02-01"}]
[]
["Date","Scrip code","Scrip Name","Client Name","Buy / Sell","Quantity Traded","Trade Price / Wt.Avg.trade price","Exchange  "]
["2019-01-31",537766,"BCP","KAMAL BABULAL AGARWAL","SELL",{"v":566641,"d":"566,641"},41.7,"BSE"]
["2019-01-31",537766,"BCP","KAMAL BABULAL AGARWAL","BUY",{"v":556040,"d":"556,040"},42.12,"BSE"]
["2019-01-31",531502,"ESARIND","PRABHA VISHWAMANI TIWARI .","SELL",128619,0.81,"BSE"]
["2019-01-31",539009,"GBLIL","GAURISH SHANTILAL SHAH","SELL",71417,100.59,"BSE"]
["2019-01-31",539009,"GBLIL","GAURISH SHANTILAL SHAH","BUY",86795,100.68,"BSE"]
["2019-01-31",539009,"GBLIL","SUNIL LAXMINARAYAN JHA","SELL",46795,100.45,"BSE"]
["2019-01-31",539009,"GBLIL","SUNIL LAXMINARAYAN JHA","BUY",43732,100.64,"BSE"]
["2019-01-31",539009,"GBLIL","GLORIOUS VINCOM PRIVATE LIMITED","BUY",102000,100.93,"BSE"]
["2019-01-31",539009,"GBLIL","GLORIOUS VINCOM PRIVATE LIMITED","SELL",150000,100.45,"BSE"]
["2019-01-31",532773,"GLOBALVECT","PASHUPATI CAPITAL SERVICE PVT LTD","BUY",75000,57.5,"BSE"]
["2019-01-31",532773,"GLOBALVECT","PASHUPATI CAPITAL SERVICE PVT LTD","SELL",29,56.5,"BSE"]
{"$rows_left_out":46}
{"sheet":"Call Tracker (Equity & F&O)","index":5,"n_rows":453,"n_cols":18,"rows_kept":453,"merged":[[30,0,31,0],[30,1,31,1],[30,2,31,2],[30,9,31,9],[30,11,31,11],[30,12,31,12],[30,13,31,13],[30,14,31,14],[32,0,33,0],[32,1,33,1],[32,2,33,2],[32,9,33,9],[32,11,33,11],[32,12,33,12],[32,13,33,13],[32,14,33,14]]}
[]
[]
[]
[]
[{"$nulls":12},"Back To Main Page"]
["Retail Research Technical Calls & Fundamental Performance Report for the month of January -2019 "]
[{"$nulls":12},{"$f":"Main!B10","v":"2019-02-01"}]
[null,"Positional  Call"]
["Sr.no","Date",null,"Company","Rec","Rec Price","Stop Loss***","Call Closed At","Target","Remark","Profit / Loss per Share","Gain / Loss  %","Status","Closed Date","NSE Closed Price"]
[1,"2018-12-21",null,"TATAGLOBAL","Buy{}",217,209,217,"235-240","Neutral",{"$f":"H10-F10","v":0},{"$f":"K10/F10","v":{"v":0,"d":"0.00%"}},"Neutral","2019-01-25",{"$nulls":3},"H"]
[2,"2018-12-24",null,"JSWSTEEL","Buy",299.5,289,285.5,"320-325","Loss of Rs.14/-",-14,{"v":-0.04674457429048414,"d":"-4.67%"},"Unsuccessful","2019-01-03",{"$nulls":3},"H"]
[3,"2018-12-24",null,"TATAPOWER","Buy",77.3,73.7,73.5,"83-84","Loss of Rs.3.8/-",{"$f":"H12-F12","v":-3.799999999999997},{"$f":"K12/F12","v":{"v":-0.04915912031047862,"d":"-4.92%"}},"Unsuccessful","2019-01-28",{"$nulls":3},"R"]
[4,"2018-12-27",null,"TVSMOTOR","Buy",552.5,519,571.75,"600-620","Profit of Rs.19.25/-",{"$f":"H13-F13","v":19.25},{"$f":"K13/F13","v":{"v":0.03484162895927602,"d":"3.48%"}},"Successful","2019-01-02",{"$nulls":3},"H"]
[5,"2019-01-01",null,"ASHOKLEY","Buy",101,96,94.5,"110-112","Loss of Rs.6.5/-",-6.5,{"v":-0.06435643564356436,"d":"-6.44%"},"Unsuccessful","2019-01-07",{"$nulls":3},"R"]
[6,"2019-01-03",null,"PEL","Buy",2345,2222.2,2210,"2565-2585","Loss of Rs.135/-",{"$f":"H15-F15","v":-135},{"$f":"K15/F15","v":{"v":-0.057569296375266525,"d":"-5.76%"}},"Unsuccessful","2019-01-28",{"$nulls":3},"R"]
[7,"2019-01-04",null,"M&M","Buy",719,688,688,"770-780","Loss of Rs.31/-",{"$f":"H16-F16","v":-31},{"$f":"K16/F16","v":{"v":-0.043115438108484005,"d":"-4.31%"}},"Unsuccessful","2019-01-25",{"$nulls":3},"H"]
[8,"2019-01-16",null,"BHARTIARTL","Sell",339,356.6,324.75,"310-305","Profit of Rs.14.25/-",{"$f":"F17-H17","v":14.25},{"$f":"K17/F17","v":{"v":0.0420353982300885,"d":"4.20%"}},"Successful","2019-01-18",{"$nulls":3},"R"]
[9,"2019-01-18",null,"TORNTPHARM","Sell",1905,1990,1847.5,"1780-1740","Profit of Rs.57.50/-",{"$f":"F18-H18","v":57.5},{"$f":"K18/F18","v":{"v":0.030183727034120734,"d":"3.02%"}},"Successful","2019-01-28",{"$nulls":3},"H"]
[10,"2019-01-24",null,"ITC","Buy","279-281",268,null,305,"Open",{"$nulls":4},{"$f":"VLOOKUP(D19,Sheet2!A10:M1505,6,0)","v":278.65},null,null,"R"]
[11,"2019-01-25",null,"UBL","Sell",1435,1510,1392.5,"1300-1280","Part Profit of Rs.42.50/-",{"$f":"F20-H20","v":42.5},{"$f":"K20/F20","v":{"v":0.029616724738675958,"d":"2.96%"}},"Successful","2019-01-28",{"$nulls":3},"H"]
{"$rows_left_out":301}
{"sheet":"Sheet2","index":6,"n_rows":1630,"n_cols":14,"rows_kept":1630,"hidden":true}
["SYMBOL","SERIES","OPEN","HIGH","LOW","CLOSE","LAST","PREVCLOSE","TOTTRDQTY","TOTTRDVAL","TIMESTAMP","TOTALTRADES","ISIN","ISIN"]
["20MICRONS","EQ",38,39,36.65,37.05,37.2,38,31586,1177024.15,"2019-01-31",429,"INE144J01027"]
["21STCENMGM","EQ",21.55,22,21.55,21.55,21.55,21.95,586,12685.25,"2019-01-31",17,"INE253B01015"]
["3IINFOTECH","EQ",3.35,3.45,3.25,3.35,3.35,3.3,2354456,7824461.3,"2019-01-31",865,"INE748C01020"]
["3MINDIA","EQ",20115,20395.9,20115,20151.6,20125.05,20146.45,464,9372244.55,"2019-01-31",277,"INE470A01017"]
["3PLAND","EQ",10.5,10.5,10.5,10.5,10.5,10.5,90,945,"2019-01-31",1,"INE105C01023"]
["5PAISA","EQ",247,254.05,240.75,242.75,240.75,244.1,1376,339778.15,"2019-01-31",161,"INE618L01018"]
["63MOONS","EQ",92.3,92.3,87.55,88.35,88.1,91.75,312524,27805116.25,"2019-01-31",5577,"INE111B01023"]
["8KMILES","EQ",126,126,126,126,126,120,70867,8929242,"2019-01-31",401,"INE650K01021"]
["A2ZINFRA","EQ",10.35,10.35,10.15,10.35,10.35,9.9,44512,459509.35,"2019-01-31",115,"INE619I01012"]
["AARTIDRUGS","EQ",594.8,609,580,588.95,585.5,591.25,7932,4716436.05,"2019-01-31",762,"INE767A01016"]
["AARTIIND","EQ",1608.55,1659.5,1608.55,1625.65,1625,1600.6,92067,150752048.25,"2019-01-31",12350,"INE769A01020"]
["AARVEEDEN","EQ",23.55,23.95,23.2,23.5,23.5,23.5,3146,73977.2,"2019-01-31",92,"INE273D01019"]
["AAVAS","EQ",843.8,869.85,835.6,853.85,868,830.75,13153,11158448.55,"2019-01-31",1312,"INE216P01012"]
["ABAN","EQ",66.1,67.7,65.05,67.15,66.8,66.25,361560,24024352.65,"2019-01-31",3474,"INE421A01028"]
["ABB","EQ",1260,1288.1,1251.3,1272.3,1270,1264.65,80557,102426595.35,"2019-01-31",5941,"INE117A01022"]
["ABBOTINDIA","EQ",8042.25,8094.95,8012.1,8070.1,8050,8042.25,2640,21289519.3,"2019-01-31",337,"INE358A01014"]
["ABCAPITAL","EQ",82.9,83,80.2,81,80.9,82.3,2286803,185283267.8,"2019-01-31",22656,"INE674K01013"]
["ABFRL","EQ",210,213.9,205,209.5,209.5,208.5,701118,146937842.6,"2019-01-31",12999,"INE647O01011"]
["ABSLNN50ET","EQ",287.33,287.33,287.33,287.33,287.33,289.4,7,2011.31,"2019-01-31",1,"INF209KB1B87"]
{"$rows_left_out":1611}
{"sheet":"Sheet1","index":7,"n_rows":0,"n_cols":0,"rows_kept":0,"hidden":true}

{"sheet":"Sheet3","index":8,"n_rows":0,"n_cols":0,"rows_kept":0,"hidden":true}