{"text_format":"3","workbook":"xlsx","n_sheets":7,"sheets":["Main","Future Intra","Cash Intra","MidCap Intra","Bulk Deals","Call Tracker (Equity & F&O)","Sheet2"],"not_rendered":{"images":4,"defined_names":4},"read":"whole","date_system":"1900"}

{"sheet":"Main","index":0,"n_rows":17,"n_cols":4,"rows_kept":17}
[null,"                                                                                                 "]
{"$rows_empty":8}
[null,"2018-11-30"]
[]
[null,"Sheet No.","Template Name","Summary"]
[null,1,"Future Intra","For Intraday trading in F&O segment"]
[null,2,"Cash Intra","For Intraday trading in cash market segment"]
[null,3,"Mid-cap Intra","For Intraday trading in Mid-cap stocks"]
[null,4,"Bulk Deals","Reveals Bulk Deals carried on NSE & BSE"]
[null,5,"Call Tracker"]

{"sheet":"Future Intra","index":1,"n_rows":242,"n_cols":15,"rows_kept":242,"merged":[[8,0,9,0],[8,1,9,1],[8,2,9,2],[8,5,8,7],[8,8,8,10]]}
[]
[]
[]
[]
[{"$nulls":12},"Back to Main Page"]
["FOR INTRA DAY TRADING",{"$nulls":10},{"$f":"Main!B10","v":"2018-11-30"}]
[]
[]
["Sr.no","Sector","Scrip","CLOSE RATE","Pivot Point","Supports",null,null,"Resistances"]
[null,"Sector",null,"Point","Point","S1","S2","S3","R1","R2","R3","HIGH","LOW","OI","% Change in OI"]
[1,"Index","BANKNIFTY",26900.95,{"v":26813.649999999998,"d":"26813.65"},{"v":26687.299999999996,"d":"26687.30"},{"v":26473.649999999998,"d":"26473.65"},{"v":26347.299999999996,"d":"26347.30"},{"v":27027.299999999996,"d":"27027.30"},{"v":27153.649999999994,"d":"27153.65"},{"v":27367.299999999996,"d":"27367.30"},26940,26600,1952100,{"v":2.6194144838212635E-3,"d":"0.26%"}]
[2,"Index","NIFTY",{"v":10890.4,"d":"10890.40"},{"v":10870.833333333334,"d":"10870.83"},{"v":10831.666666666668,"d":"10831.67"},{"v":10772.933333333334,"d":"10772.93"},{"v":10733.766666666668,"d":"10733.77"},{"v":10929.566666666668,"d":"10929.57"},{"v":10968.733333333335,"d":"10968.73"},{"v":11027.466666666667,"d":"11027.47"},10910,10812.1,19648575,{"v":-0.23491773308957953,"d":"-23.49%"}]
[3,"Index","NIFTYIT",{"v":14527,"d":"14527.00"},{"v":14578.666666666666,"d":"14578.67"},{"v":14458.333333333332,"d":"14458.33"},{"v":14389.666666666666,"d":"14389.67"},{"v":14269.333333333332,"d":"14269.33"},{"v":14647.333333333332,"d":"14647.33"},{"v":14767.666666666664,"d":"14767.67"},{"v":14836.333333333332,"d":"14836.33"},14699,14510,11950,{"v":-0.33053221288515405,"d":"-33.05%"}]
[4,"Index","NIFTYMID50",4819.75,{"v":1606.5833333333333,"d":"1606.58"},{"v":3213.1666666666665,"d":"3213.17"},{"v":1606.5833333333333,"d":"1606.58"},{"v":3213.1666666666665,"d":"3213.17"},{"v":3213.1666666666665,"d":"3213.17"},{"v":1606.5833333333333,"d":"1606.58"},{"v":3213.1666666666665,"d":"3213.17"},0,0,694870,{"v":-3.1650577623041623E-4,"d":"-0.03%"}]
[5,"Cement","ACC",1470.25,1463.75,1450.95,1431.65,{"v":1418.8500000000001,"d":"1418.85"},1483.05,{"v":1495.8500000000001,"d":"1495.85"},{"v":1515.1499999999999,"d":"1515.15"},1476.55,1444.45,1451600,{"v":-0.1324408319387999,"d":"-13.24%"}]
[6,"Others","ADANIENT",170.15,{"v":168.16666666666666,"d":"168.17"},{"v":160.33333333333331,"d":"160.33"},{"v":150.51666666666665,"d":"150.52"},{"v":142.6833333333333,"d":"142.68"},{"v":177.98333333333332,"d":"177.98"},{"v":185.81666666666663,"d":"185.82"},{"v":195.63333333333333,"d":"195.63"},176,158.35,37764000,{"v":-0.10179811625915708,"d":"-10.18%"}]
[7,"Others","ADANIPORTS",371.45,{"v":369.5833333333333,"d":"369.58"},{"v":366.3666666666666,"d":"366.37"},{"v":361.2833333333333,"d":"361.28"},{"v":358.0666666666666,"d":"358.07"},{"v":374.66666666666663,"d":"374.67"},{"v":377.8833333333333,"d":"377.88"},{"v":382.96666666666664,"d":"382.97"},372.8,364.5,16740000,{"v":-0.06467383712809052,"d":"-6.47%"}]
[8,"Power","ADANIPOWER",{"v":56.1,"d":"56.10"},{"v":56.31666666666666,"d":"56.32"},{"v":54.98333333333333,"d":"54.98"},{"v":53.86666666666667,"d":"53.87"},{"v":52.53333333333333,"d":"52.53"},{"v":57.43333333333332,"d":"57.43"},{"v":58.766666666666666,"d":"58.77"},{"v":59.88333333333332,"d":"59.88"},57.65,55.2,146540000,{"v":-0.06232403378551318,"d":"-6.23%"}]
[9,"Pharma","AJANTPHARM",{"v":1126,"d":"1126.00"},{"v":1120.1666666666667,"d":"1120.17"},{"v":1107.0833333333335,"d":"1107.08"},{"v":1088.1666666666667,"d":"1088.17"},{"v":1075.0833333333335,"d":"1075.08"},{"v":1139.0833333333335,"d":"1139.08"},{"v":1152.166666666667,"d":"1152.17"},{"v":1171.0833333333335,"d":"1171.08"},1133.25,1101.25,656000,{"v":-0.1402359108781127,"d":"-14.02%"}]
[10,"Banking","ALBK",47.65,{"v":47.21666666666667,"d":"47.22"},{"v":46.43333333333334,"d":"46.43"},{"v":45.21666666666667,"d":"45.22"},{"v":44.43333333333334,"d":"44.43"},{"v":48.43333333333334,"d":"48.43"},{"v":49.21666666666667,"d":"49.22"},{"v":50.43333333333334,"d":"50.43"},48,46,15599000,{"v":-0.22689200574912027,"d":"-22.69%"}]
{"$rows_left_out":213}
{"sheet":"Cash Intra","index":2,"n_rows":248,"n_cols":13,"rows_kept":248,"merged":[[7,0,8,0],[7,1,8,1],[7,2,8,2],[7,3,8,3],[7,4,7,6],[7,7,7,9]]}
[]
[]
[]
[]
[{"$nulls":12},"Back to Main Page"]
["FOR INTRA DAY TRADING",{"$nulls":9},{"$f":"Main!B10","v":"2018-11-30"}]
[]
["Sr.no","Scrip","CLOSE RATE","Pivot Point","Supports",null,null,"Resistances"]
[null,null,"Point",null,"S1","S2","S3","R1","R2","R3","HIGH","LOW","Total Trade Quanity in Lakhs"]
[1,"Nifty 50",10858.7,{"v":10841.366666666667,"d":"10841.37"},{"v":10799.683333333334,"d":"10799.68"},{"v":10740.666666666668,"d":"10740.67"},{"v":10698.983333333335,"d":"10698.98"},{"v":10900.383333333333,"d":"10900.38"},{"v":10942.066666666664,"d":"10942.07"},{"v":11001.083333333332,"d":"11001.08"},10883.05,10782.35]
[2,"Nifty Bank",26939.6,{"v":26840.166666666668,"d":"26840.17"},{"v":26676.583333333336,"d":"26676.58"},{"v":26413.56666666667,"d":"26413.57"},{"v":26249.983333333337,"d":"26249.98"},{"v":27103.183333333334,"d":"27103.18"},{"v":27266.76666666667,"d":"27266.77"},{"v":27529.783333333333,"d":"27529.78"},27003.75,26577.15]
[3,"Nifty CPSE",1999.45,{"v":2002.4333333333334,"d":"2002.43"},{"v":1971.7166666666667,"d":"1971.72"},{"v":1943.9833333333333,"d":"1943.98"},{"v":1913.2666666666667,"d":"1913.27"},{"v":2030.1666666666667,"d":"2030.17"},{"v":2060.883333333333,"d":"2060.88"},{"v":2088.616666666667,"d":"2088.62"},2033.15,1974.7]
[4,"Nifty Infra",3095.3,{"v":3094.0166666666664,"d":"3094.02"},{"v":3082.033333333333,"d":"3082.03"},{"v":3068.7666666666664,"d":"3068.77"},{"v":3056.783333333333,"d":"3056.78"},{"v":3107.283333333333,"d":"3107.28"},{"v":3119.2666666666664,"d":"3119.27"},{"v":3132.533333333333,"d":"3132.53"},3106,3080.75]
[5,"Nifty IT",14465.25,14543.65,14354.65,14244.05,14055.05,14654.25,14843.25,14953.85,14732.65,14433.05]
[6,"Nifty PSE",3243.55,{"v":3249.2000000000003,"d":"3249.20"},{"v":3220.0000000000005,"d":"3220.00"},{"v":3196.4500000000003,"d":"3196.45"},{"v":3167.2500000000005,"d":"3167.25"},{"v":3272.7500000000005,"d":"3272.75"},{"v":3301.9500000000003,"d":"3301.95"},{"v":3325.5000000000005,"d":"3325.50"},3278.4,3225.65]
[7,"Nifty Midcap 50",4761.25,{"v":4753.816666666667,"d":"4753.82"},{"v":4739.383333333333,"d":"4739.38"},{"v":4717.516666666666,"d":"4717.52"},{"v":4703.083333333333,"d":"4703.08"},{"v":4775.683333333333,"d":"4775.68"},{"v":4790.116666666666,"d":"4790.12"},{"v":4811.983333333334,"d":"4811.98"},4768.25,4731.95]
[8,"ABB",1386.3,1392.95,{"v":1368.3500000000001,"d":"1368.35"},{"v":1350.4,"d":"1350.40"},{"v":1325.8000000000002,"d":"1325.80"},{"v":1410.9,"d":"1410.90"},{"v":1435.5,"d":"1435.50"},1453.45,1417.55,1375,0.87581]
[9,"ACC",1463.8,{"v":1457.0833333333333,"d":"1457.08"},{"v":1442.8666666666666,"d":"1442.87"},{"v":1421.9333333333334,"d":"1421.93"},{"v":1407.7166666666667,"d":"1407.72"},{"v":1478.0166666666664,"d":"1478.02"},{"v":1492.2333333333331,"d":"1492.23"},{"v":1513.1666666666663,"d":"1513.17"},1471.3,1436.15,9.94648]
[10,"AIAENG",1617.7,{"v":1615.0833333333333,"d":"1615.08"},{"v":1602.7166666666665,"d":"1602.72"},{"v":1587.7333333333331,"d":"1587.73"},{"v":1575.3666666666663,"d":"1575.37"},{"v":1630.0666666666666,"d":"1630.07"},{"v":1642.4333333333334,"d":"1642.43"},{"v":1657.4166666666667,"d":"1657.42"},1627.45,1600.1,0.39374]
[11,"AUBANK",585.15,{"v":587.1166666666667,"d":"587.12"},{"v":573.0333333333333,"d":"573.03"},{"v":560.9166666666666,"d":"560.92"},{"v":546.8333333333333,"d":"546.83"},{"v":599.2333333333333,"d":"599.23"},{"v":613.3166666666666,"d":"613.32"},{"v":625.4333333333334,"d":"625.43"},601.2,575,1.7252]
{"$rows_left_out":229}
{"sheet":"MidCap Intra","index":3,"n_rows":510,"n_cols":13,"rows_kept":510,"merged":[[0,0,0,1],[8,0,9,0],[8,1,9,1],[8,2,9,2],[8,3,9,3],[8,4,8,6],[8,7,8,9]]}
[]
[]
[]
[]
[{"$nulls":11},"Back To Main Page"]
["FOR INTRA DAY TRADING",{"$nulls":9},{"$f":"Main!B10","v":"2018-11-30"}]
[null,null," "]
[]
["Sr.no","Scrip","CLOSE RATE","Pivot Point","Supports",null,null,"Resistances"]
[null,null,"Point",null,"S1","S2","S3","R1","R2","R3","HIGH","LOW","Total Trade Quanity in Lakhs"]
[1,"3MINDIA",20845.2,{"v":20834.68333333333,"d":"20834.68"},{"v":20720.61666666666,"d":"20720.62"},{"v":20596.03333333333,"d":"20596.03"},{"v":20481.96666666666,"d":"20481.97"},{"v":20959.266666666663,"d":"20959.27"},{"v":21073.333333333336,"d":"21073.33"},{"v":21197.916666666664,"d":"21197.92"},20948.75,20710.1,0.00783]
[2,"8KMILES",175.1,{"v":175.1,"d":"175.10"},{"v":175.1,"d":"175.10"},{"v":175.1,"d":"175.10"},{"v":175.1,"d":"175.10"},{"v":175.1,"d":"175.10"},{"v":175.1,"d":"175.10"},{"v":175.1,"d":"175.10"},175.1,175.1,0.28139]
[3,"AARTIIND",1455.2,{"v":1461.3999999999999,"d":"1461.40"},{"v":1438.7999999999997,"d":"1438.80"},{"v":1422.3999999999999,"d":"1422.40"},{"v":1399.7999999999997,"d":"1399.80"},{"v":1477.7999999999997,"d":"1477.80"},{"v":1500.3999999999996,"d":"1500.40"},{"v":1516.7999999999997,"d":"1516.80"},1484,1445,0.42002]
[4,"ABAN",74.6,{"v":74.96666666666665,"d":"74.97"},{"v":72.43333333333331,"d":"72.43"},{"v":70.26666666666665,"d":"70.27"},{"v":67.7333333333333,"d":"67.73"},{"v":77.13333333333331,"d":"77.13"},{"v":79.66666666666664,"d":"79.67"},{"v":81.83333333333331,"d":"81.83"},77.5,72.8,5.01475]
[5,"ABB",1386.3,1392.95,{"v":1368.3500000000001,"d":"1368.35"},{"v":1350.4,"d":"1350.40"},{"v":1325.8000000000002,"d":"1325.80"},{"v":1410.9,"d":"1410.90"},{"v":1435.5,"d":"1435.50"},1453.45,1417.55,1375,0.87581]
[6,"ABCAPITAL",104.9,{"v":104.46666666666665,"d":"104.47"},{"v":103.63333333333331,"d":"103.63"},{"v":102.36666666666666,"d":"102.37"},{"v":101.53333333333332,"d":"101.53"},{"v":105.7333333333333,"d":"105.73"},{"v":106.56666666666665,"d":"106.57"},{"v":107.8333333333333,"d":"107.83"},105.3,103.2,11.47666]
[7,"ABFRL",185.8,{"v":186.66666666666666,"d":"186.67"},{"v":184.33333333333331,"d":"184.33"},{"v":182.86666666666665,"d":"182.87"},{"v":180.5333333333333,"d":"180.53"},{"v":188.13333333333333,"d":"188.13"},{"v":190.46666666666664,"d":"190.47"},{"v":191.93333333333334,"d":"191.93"},189,185.2,5.55549]
[8,"ACC",1463.8,{"v":1457.0833333333333,"d":"1457.08"},{"v":1442.8666666666666,"d":"1442.87"},{"v":1421.9333333333334,"d":"1421.93"},{"v":1407.7166666666667,"d":"1407.72"},{"v":1478.0166666666664,"d":"1478.02"},{"v":1492.2333333333331,"d":"1492.23"},{"v":1513.1666666666663,"d":"1513.17"},1471.3,1436.15,9.94648]
[9,"ADANIPORTS",369.8,{"v":368.11666666666673,"d":"368.12"},{"v":364.88333333333344,"d":"364.88"},{"v":359.9666666666667,"d":"359.97"},{"v":356.7333333333334,"d":"356.73"},{"v":373.0333333333335,"d":"373.03"},{"v":376.2666666666667,"d":"376.27"},{"v":381.1833333333335,"d":"381.18"},371.35,363.2,34.25961]
[10,"ADANIPOWER",55.45,{"v":55.81666666666666,"d":"55.82"},{"v":54.133333333333326,"d":"54.13"},{"v":52.81666666666666,"d":"52.82"},{"v":51.133333333333326,"d":"51.13"},{"v":57.133333333333326,"d":"57.13"},{"v":58.81666666666666,"d":"58.82"},{"v":60.133333333333326,"d":"60.13"},57.5,54.5,391.17988]
{"$rows_left_out":491}
{"sheet":"Bulk Deals","index":4,"n_rows":75,"n_cols":8,"rows_kept":75,"merged":[[4,0,4,1],[4,2,4,3],[6,1,6,2]]}
[" "]
[]
[]
[]
[]
[{"$nulls":4},"Back To Main Page"]
["Subject :","BULK DEAL",null,{"$f":"Main!B10","v":"2018-11-30"}]
[]
["Date","Scrip code","Scrip Name","Client Name","Buy / Sell","Quantity Traded","Trade Price / Wt.Avg.trade price","Exchange  "]
["2018-11-29",539523,"ALKEM","PRASID UNO FAMILY TRUST","SELL",{"v":1290000,"d":"1,290,000"},1828.32,"BSE"]
["2018-11-29",542057,"BCPL","PARAG RAMESHCHANDRA MALDE .","BUY",{"v":100000,"d":"100,000"},35,"BSE"]
["2018-11-29",542057,"BCPL","SHERWOOD SECURITIES PVT LTD","SELL",{"v":240000,"d":"240,000"},35.04,"BSE"]
["2018-11-29",542057,"BCPL","SHERWOOD SECURITIES PVT LTD","BUY",{"v":32000,"d":"32,000"},35.05,"BSE"]
["2018-11-29",542057,"BCPL","BHARATI ARVIND SHAH","BUY",{"v":100000,"d":"100,000"},35,"BSE"]
["2018-11-29",540064,"FRETAIL","BHARTI ENTERPRISES (HOLDING) PRIVATE LIMITED","SELL",{"v":5693587,"d":"5,693,587"},525.9,"BSE"]
["2018-11-29",540064,"FRETAIL","EDELWEISS SPECIAL OPPORTUNITIES FUND","BUY",{"v":4043272,"d":"4,043,272"},525.9,"BSE"]
["2018-11-29",539009,"GBLIL","HIGHGROWTH VINCOM PRIVATE LIMITED","BUY",{"v":80000,"d":"80,000"},62.7,"BSE"]
["2018-11-29",539009,"GBLIL","POPATBHAI RAMJIBHAI PARMAR","SELL",{"v":80000,"d":"80,000"},62.7,"BSE"]
["2018-11-29",536709,"INDRENEW","DIPESH AMBALAL JAIN","BUY",{"v":42944,"d":"42,944"},18,"BSE"]
["2018-11-29",536709,"INDRENEW","JITENDRA KANTILAL VAKHARIA HUF","SELL",{"v":100000,"d":"100,000"},18,"BSE"]
{"$rows_left_out":56}
{"sheet":"Call Tracker (Equity & F&O)","index":5,"n_rows":340,"n_cols":18,"rows_kept":340,"merged":[[34,0,35,0],[34,1,35,1],[34,9,35,9],[34,11,35,11],[34,12,35,12],[34,13,35,13],[34,14,35,14],[34,17,35,17],[36,0,37,0],[36,1,37,1],[36,9,37,9],[36,11,37,11],[36,12,37,12],[36,13,37,13],[36,14,37,14],[36,17,37,17],[38,0,39,0],[38,1,39,1],[38,9,39,9],[38,11,39,11],[38,12,39,12],[38,13,39,13],[38,14,39,14],[38,17,39,17],[40,0,41,0],[40,1,41,1],[40,2,41,2],[40,9,41,9],[40,11,41,11],[40,12,41,12],[40,13,41,13],[40,14,41,14],[45,0,46,0],[45,1,46,1],[45,2,46,2],[45,9,46,9],[45,11,46,11],[45,12,46,12],[45,13,46,13],[45,14,46,14],[47,0,48,0],[47,1,48,1],[47,9,48,9],[47,11,48,11],[47,12,48,12],[47,13,48,13],[47,14,48,14],[47,17,48,17],[59,0,60,0],[59,1,60,1],[59,2,60,2],[59,9,60,9],[59,11,60,11],[59,12,60,12],[59,13,60,13],[59,14,60,14],[61,0,62,0],[61,1,62,1],[61,2,62,2],[61,9,62,9],[61,11,62,11],[61,12,62,12],[61,13,62,13],[61,14,62,14]]}
[]
[]
[]
[]
[{"$nulls":12},"Back To Main Page"]
["Retail Research Technical Calls & Fundamental Performance Report for the month of November -2018 "]
[{"$nulls":12},{"$f":"Main!B10","v":"2018-11-30"}]
[null,"Positional  Call"]
["Sr.no","Date",null,"Company","Rec","Rec Price","Stop Loss***","Call Closed At","Target","Remark","Profit / Loss per Share","Gain / Loss  %","Status","Closed Date","NSE Closed Price"]
[1,"2018-10-25",null,"SUNPHARMA","Buy{}",569,528,587.5,"620-630","Profit of Rs.18.5/-",{"$f":"H10-F10","v":18.5},{"$f":"K10/F10","v":{"v":0.03251318101933216,"d":"3.25%"}},"Successful","2018-11-09",{"$nulls":3},"H"]
[2,"2018-11-02",null,"MARUTI","Buy{}",6860,6580,7140,"7300-7500","Profit of Rs.280/-",{"$f":"H11-F11","v":280},{"$f":"K11/F11","v":{"v":0.04081632653061224,"d":"4.08%"}},"Successful","2018-11-05",{"$nulls":3},"H"]
[3,"2018-11-09",null,"RECLTD","Buy{}",122.5,116.3,120,"133-137","Loss of Rs.2.50/-",{"$f":"H12-F12","v":-2.5},{"$f":"K12/F12","v":{"v":-0.02040816326530612,"d":"-2.04%"}},"Unuccessful","2018-11-28",{"$nulls":3},"R"]
[4,"2018-11-12",null,"SRF","Buy{}",2040,1940,2110,"2200-2250","Profit of Rs.70/-",{"$f":"H13-F13","v":70},{"$f":"K13/F13","v":{"v":0.03431372549019608,"d":"3.43%"}},"Successful","2018-11-28",{"$nulls":3},"H"]
[5,"2018-11-12",null,"GAIL","Buy",363.5,348,346,"385-395","Loss of Rs.17.50/-",{"$f":"H14-F14","v":-17.5},{"$f":"K14/F14","v":{"v":-0.048143053645116916,"d":"-4.81%"}},"Unuccessful","2018-11-16",{"$nulls":3},"H"]
[6,"2018-11-13",null,"IOC","Buy",137.5,134,142.25,"146-150","Profit of Rs.4.75/-",{"$f":"H15-F15","v":4.75},{"$f":"K15/F15","v":{"v":0.034545454545454546,"d":"3.45%"}},"Successful","2018-11-13",{"$nulls":3},"H"]
[7,"2018-11-13",null,"NIITTECH","Buy",1195,1144.4,1144.4,"1300-1310","Loss of Rs.50.6/-",{"$f":"H16-F16","v":-50.59999999999991},{"$f":"K16/F16","v":{"v":-0.04234309623430955,"d":"-4.23%"}},"Unuccessful","2018-11-17",{"$nulls":3},"R"]
[8,"2018-11-14",null,"ASHOKLEY","Buy","107.5-108.5",100.7,null,"122-125","Open",{"$nulls":4},{"$f":"VLOOKUP(D17,Sheet2!A6:M1642,6,0)","v":110.15},null,null,"R"]
[9,"2018-11-16",null,"JSWSTEEL","Buy",338,324,321.5,"365-375","Loss of Rs.16.50/-",{"$f":"H18-F18","v":-16.5},{"$f":"K18/F18","v":{"v":-0.04881656804733728,"d":"-4.88%"}},"Unuccessful","2018-11-22",{"$nulls":3},"H"]
[10,"2018-11-20",null,"GLENMARK","Buy{}",627.5,598.7,651,"700-710","Profit of Rs.23.5/-",{"$f":"H19-F19","v":23.5},{"$f":"K19/F19","v":{"v":0.03745019920318725,"d":"3.75%"}},"Successful","2018-11-27",{"$nulls":3},"R"]
[11,"2018-11-20",null,"NIITTECH","Buy",1123.5,1078,1078,"1180-1200","Loss of Rs.45.50/-",-45.5,{"v":-0.040498442367601244,"d":"-4.05%"},"Unuccessful","2018-11-22",{"$nulls":3},"H"]
{"$rows_left_out":309}
{"sheet":"Sheet2","index":6,"n_rows":1638,"n_cols":14,"rows_kept":1638,"hidden":true}
["SYMBOL","SERIES","OPEN","HIGH","LOW","CLOSE","LAST","PREVCLOSE","TOTTRDQTY","TOTTRDVAL","TIMESTAMP","TOTALTRADES","ISIN","ISIN"]
["20MICRONS","EQ",44,44.1,42.8,43,43,43.3,25935,1121942.1,"2018-11-29",337,"INE144J01027"]
["21STCENMGM","EQ",22.5,22.5,22,22,22,22.1,150,3350,"2018-11-29",4,"INE253B01015"]
["3IINFOTECH","EQ",3.75,4,3.65,3.95,3.95,3.7,4109468,15928605.65,"2018-11-29",1471,"INE748C01020"]
["3MINDIA","EQ",20948.65,20948.75,20710.1,20845.2,20854,20775.65,783,16331441.75,"2018-11-29",234,"INE470A01017"]
["3PLAND","BE",10.75,11.85,10.75,11.85,11.85,11.3,1520,16351,"2018-11-29",6,"INE105C01023"]
["5PAISA","EQ",197,197.95,190.25,193.25,193,196.05,1485,290239.95,"2018-11-29",83,"INE618L01018"]
["63MOONS","EQ",104,105.4,96.1,98.1,97,103.95,773819,77066325.8,"2018-11-29",9412,"INE111B01023"]
["8KMILES","EQ",175.1,175.1,175.1,175.1,175.1,166.8,28139,4927138.9,"2018-11-29",241,"INE650K01021"]
["A2ZINFRA","EQ",13.65,13.9,13.4,13.7,13.65,13.7,252077,3437185.85,"2018-11-29",520,"INE619I01012"]
["AARTIDRUGS","EQ",562.45,564.95,550,552.75,553,559.75,58417,32430943.45,"2018-11-29",789,"INE767A01016"]
["AARTIIND","EQ",1484,1484,1445,1455.2,1456.65,1480.3,42002,61199322.55,"2018-11-29",7116,"INE769A01020"]
["AARVEEDEN","EQ",24.55,24.75,24.55,24.55,24.55,24.55,7553,185540,"2018-11-29",34,"INE273D01019"]
["AAVAS","EQ",762.2,782.05,757,762.4,759.25,774.7,9773,7525275.2,"2018-11-29",1667,"INE216P01012"]
["ABAN","EQ",77.1,77.5,72.8,74.6,74.4,77.05,501475,37438017.95,"2018-11-29",6939,"INE421A01028"]
["ABB","EQ",1407.5,1417.55,1375,1386.3,1377.1,1399.1,87581,122480916.4,"2018-11-29",6675,"INE117A01022"]
["ABBOTINDIA","EQ",7262.15,7379,7198.15,7365.45,7350,7190.25,3257,23804385.75,"2018-11-29",608,"INE358A01014"]
["ABCAPITAL","EQ",104.3,105.3,103.2,104.9,105,104.25,1147666,119936678.75,"2018-11-29",32147,"INE674K01013"]
["ABFRL","EQ",187.25,189,185.2,185.8,185.5,186.75,555549,103508629.5,"2018-11-29",3609,"INE647O01011"]
["ACC","EQ",1448.9,1471.3,1436.15,1463.8,1468.25,1436.95,994648,1451093061.75,"2018-11-29",24022,"INE012A01025"]
{"$rows_left_out":1618}