{"text_format":"3","workbook":"xlsx","n_sheets":10,"sheets":["Main","Future Intra","Cash Intra","MidCap Intra","Bulk Deals","Call Tracker (Equity & F&O)","Sheet2","Sheet1","Sheet3","Sheet4"],"not_rendered":{"images":4,"defined_names":4},"read":"whole","date_system":"1900"}

{"sheet":"Main","index":0,"n_rows":27,"n_cols":11,"rows_kept":27}
[null,"                                                                                                 "]
{"$rows_empty":8}
[null,"2019-05-27"]
[]
[null,"Sheet No.","Template Name","Summary"]
[null,1,"Future Intra","For Intraday trading in F&O segment"]
[null,2,"Cash Intra","For Intraday trading in cash market segment"]
[null,3,"Mid-cap Intra","For Intraday trading in Mid-cap stocks"]
[null,4,"Bulk Deals","Reveals Bulk Deals carried on NSE & BSE"]
[null,5,"Call Tracker"]
{"$rows_empty":9}
[{"$nulls":10},"`"]

{"sheet":"Future Intra","index":1,"n_rows":236,"n_cols":15,"rows_kept":236,"merged":[[8,0,9,0],[8,1,9,1],[8,2,9,2],[8,5,8,7],[8,8,8,10]]}
[]
[]
[]
[]
[{"$nulls":12},"Back to Main Page"]
["FOR INTRA DAY TRADING",{"$nulls":10},{"$f":"Main!B10","v":"2019-05-27"}]
[]
[]
["Sr.no","Sector","Scrip","CLOSE RATE","Pivot Point","Supports",null,null,"Resistances"]
[null,"Sector",null,"Point","Point","S1","S2","S3","R1","R2","R3","HIGH","LOW","OI","% Change in OI"]
[1,"Index","BANKNIFTY",{"v":31222.8,"d":"31222.80"},{"v":31039.283333333336,"d":"31039.28"},{"v":30763.566666666673,"d":"30763.57"},{"v":30304.333333333336,"d":"30304.33"},{"v":30028.616666666672,"d":"30028.62"},{"v":31498.516666666674,"d":"31498.52"},{"v":31774.23333333334,"d":"31774.23"},{"v":32233.466666666674,"d":"32233.47"},31315,30580.05,2049600,{"v":0.1548994196202175,"d":"15.49%"}]
[2,"Index","NIFTY",{"v":11869.4,"d":"11869.40"},{"v":11812.5,"d":"11812.50"},{"v":11735,"d":"11735.00"},{"v":11600.6,"d":"11600.60"},{"v":11523.1,"d":"11523.10"},{"v":11946.9,"d":"11946.90"},{"v":12024.4,"d":"12024.40"},{"v":12158.8,"d":"12158.80"},11890,11678.1,22755000,{"v":0.03683250063221494,"d":"3.68%"}]
[3,"Index","NIFTYIT",{"v":15614,"d":"15614.00"},{"v":15578.333333333334,"d":"15578.33"},{"v":15515.666666666668,"d":"15515.67"},{"v":15417.333333333334,"d":"15417.33"},{"v":15354.666666666668,"d":"15354.67"},{"v":15676.666666666668,"d":"15676.67"},{"v":15739.333333333336,"d":"15739.33"},{"v":15837.666666666668,"d":"15837.67"},15641,15480,25050,{"v":0.04158004158004158,"d":"4.16%"}]
[4,"Cement","ACC",{"v":1709.9,"d":"1709.90"},{"v":1689.6499999999999,"d":"1689.65"},{"v":1664.2999999999997,"d":"1664.30"},{"v":1618.6999999999998,"d":"1618.70"},{"v":1593.3499999999997,"d":"1593.35"},{"v":1735.2499999999998,"d":"1735.25"},{"v":1760.5999999999997,"d":"1760.60"},{"v":1806.1999999999998,"d":"1806.20"},1715,1644.05,2794000,{"v":0.11992945326278659,"d":"11.99%"}]
[5,"Others","ADANIENT",{"v":157.3,"d":"157.30"},{"v":157.66666666666669,"d":"157.67"},{"v":151.68333333333337,"d":"151.68"},{"v":146.0666666666667,"d":"146.07"},{"v":140.08333333333337,"d":"140.08"},{"v":163.28333333333336,"d":"163.28"},{"v":169.2666666666667,"d":"169.27"},{"v":174.88333333333335,"d":"174.88"},163.65,152.05,31708000,{"v":6.3115374905326936E-4,"d":"0.06%"}]
[6,"Others","ADANIPORTS",{"v":411.3,"d":"411.30"},409.25,{"v":402.6,"d":"402.60"},{"v":393.90000000000003,"d":"393.90"},{"v":387.25000000000006,"d":"387.25"},417.95,{"v":424.59999999999997,"d":"424.60"},{"v":433.29999999999995,"d":"433.30"},415.9,400.55,19657500,{"v":2.5442055718102023E-4,"d":"0.03%"}]
[7,"Power","ADANIPOWER",{"v":46.9,"d":"46.90"},{"v":46.349999999999994,"d":"46.35"},{"v":45.39999999999999,"d":"45.40"},{"v":43.9,"d":"43.90"},{"v":42.949999999999996,"d":"42.95"},{"v":47.84999999999999,"d":"47.85"},{"v":48.79999999999999,"d":"48.80"},{"v":50.29999999999998,"d":"50.30"},47.3,44.85,166600000,{"v":-0.008451374836329009,"d":"-0.85%"}]
[8,"Pharma","AJANTPHARM",{"v":1043.9,"d":"1043.90"},{"v":1034.4166666666667,"d":"1034.42"},{"v":1019.8833333333334,"d":"1019.88"},{"v":995.8666666666667,"d":"995.87"},{"v":981.3333333333334,"d":"981.33"},{"v":1058.4333333333334,"d":"1058.43"},{"v":1072.9666666666667,"d":"1072.97"},{"v":1096.9833333333336,"d":"1096.98"},1048.95,1010.4,564500,{"v":0.14503042596348883,"d":"14.50%"}]
[9,"Banking","ALBK",{"v":47.6,"d":"47.60"},{"v":46.96666666666666,"d":"46.97"},{"v":46.18333333333332,"d":"46.18"},{"v":44.76666666666666,"d":"44.77"},{"v":43.98333333333332,"d":"43.98"},{"v":48.383333333333326,"d":"48.38"},{"v":49.16666666666667,"d":"49.17"},{"v":50.58333333333333,"d":"50.58"},47.75,45.55,17784000,{"v":0.02318623784592371,"d":"2.32%"}]
[10,"Automobile","AMARAJABAT",{"v":641.1,"d":"641.10"},{"v":631.7666666666667,"d":"631.77"},{"v":619.5333333333333,"d":"619.53"},{"v":597.9666666666667,"d":"597.97"},{"v":585.7333333333333,"d":"585.73"},{"v":653.3333333333333,"d":"653.33"},{"v":665.5666666666666,"d":"665.57"},{"v":687.1333333333332,"d":"687.13"},644,610.2,1484000,{"v":-0.03767589650476623,"d":"-3.77%"}]
{"$rows_left_out":207}
{"sheet":"Cash Intra","index":2,"n_rows":247,"n_cols":13,"rows_kept":247,"merged":[[7,0,8,0],[7,1,8,1],[7,2,8,2],[7,3,8,3],[7,4,7,6],[7,7,7,9]]}
[]
[]
[]
[]
[{"$nulls":12},"Back to Main Page"]
["FOR INTRA DAY TRADING",{"$nulls":9},{"$f":"Main!B10","v":"2019-05-27"}]
[]
["Sr.no","Scrip","CLOSE RATE","Pivot Point","Supports",null,null,"Resistances"]
[null,null,"Point",null,"S1","S2","S3","R1","R2","R3","HIGH","LOW","Total Trade Quanity in Lakhs"]
[1,"Nifty 50",11844.1,{"v":11787.066666666666,"d":"11787.07"},{"v":11715.133333333331,"d":"11715.13"},{"v":11586.166666666666,"d":"11586.17"},{"v":11514.233333333332,"d":"11514.23"},{"v":11916.033333333331,"d":"11916.03"},{"v":11987.966666666665,"d":"11987.97"},{"v":12116.93333333333,"d":"12116.93"},11859,11658.1]
[2,"Nifty Bank",31212.55,31017.45,{"v":30759.5,"d":"30759.50"},30306.45,{"v":30048.5,"d":"30048.50"},{"v":31470.5,"d":"31470.50"},{"v":31728.450000000004,"d":"31728.45"},{"v":32181.5,"d":"32181.50"},31275.4,30564.4]
[3,"Nifty CPSE",2290.1,2277.85,{"v":2261.5,"d":"2261.50"},{"v":2232.9,"d":"2232.90"},2216.55,2306.45,{"v":2322.7999999999993,"d":"2322.80"},{"v":2351.3999999999996,"d":"2351.40"},2294.2,2249.25]
[4,"Nifty Infra",3305.9,3283.85,3253.45,{"v":3201,"d":"3201.00"},{"v":3170.6,"d":"3170.60"},{"v":3336.2999999999997,"d":"3336.30"},{"v":3366.7000000000003,"d":"3366.70"},{"v":3419.1499999999996,"d":"3419.15"},3314.25,3231.4]
[5,"Nifty IT",15569.85,{"v":15552.683333333334,"d":"15552.68"},{"v":15479.016666666668,"d":"15479.02"},{"v":15388.183333333334,"d":"15388.18"},{"v":15314.516666666668,"d":"15314.52"},{"v":15643.516666666668,"d":"15643.52"},{"v":15717.183333333332,"d":"15717.18"},{"v":15808.016666666668,"d":"15808.02"},15626.35,15461.85]
[6,"Nifty PSE",3550.85,{"v":3534.183333333333,"d":"3534.18"},{"v":3512.616666666666,"d":"3512.62"},{"v":3474.3833333333328,"d":"3474.38"},{"v":3452.8166666666657,"d":"3452.82"},{"v":3572.416666666666,"d":"3572.42"},{"v":3593.9833333333327,"d":"3593.98"},{"v":3632.2166666666662,"d":"3632.22"},3555.75,3495.95]
[7,"Nifty Midcap 50",4909.6,{"v":4875.099999999999,"d":"4875.10"},{"v":4830.949999999999,"d":"4830.95"},{"v":4752.299999999999,"d":"4752.30"},{"v":4708.149999999999,"d":"4708.15"},{"v":4953.749999999999,"d":"4953.75"},{"v":4997.899999999999,"d":"4997.90"},{"v":5076.549999999999,"d":"5076.55"},4919.25,4796.45]
[8,"ABB",1496.95,{"v":1480.5999999999997,"d":"1480.60"},{"v":1461.1999999999994,"d":"1461.20"},{"v":1425.4499999999996,"d":"1425.45"},{"v":1406.0499999999993,"d":"1406.05"},{"v":1516.3499999999995,"d":"1516.35"},{"v":1535.7499999999995,"d":"1535.75"},{"v":1571.4999999999995,"d":"1571.50"},1500,1444.85,0.76994]
[9,"ACC",1704.9,{"v":1684.0833333333333,"d":"1684.08"},{"v":1658.8166666666666,"d":"1658.82"},{"v":1612.7333333333333,"d":"1612.73"},{"v":1587.4666666666667,"d":"1587.47"},{"v":1730.1666666666665,"d":"1730.17"},{"v":1755.4333333333334,"d":"1755.43"},{"v":1801.5166666666664,"d":"1801.52"},1709.35,1638,8.94742]
[10,"AUBANK",681.9,{"v":687.3333333333334,"d":"687.33"},{"v":674.5666666666667,"d":"674.57"},{"v":667.2333333333333,"d":"667.23"},{"v":654.4666666666667,"d":"654.47"},{"v":694.6666666666667,"d":"694.67"},{"v":707.4333333333334,"d":"707.43"},{"v":714.7666666666668,"d":"714.77"},700.1,680,0.75103]
[11,"ADANIPORTS",410.25,{"v":408.2,"d":"408.20"},{"v":401.54999999999995,"d":"401.55"},{"v":392.84999999999997,"d":"392.85"},{"v":386.19999999999993,"d":"386.20"},{"v":416.9,"d":"416.90"},{"v":423.54999999999995,"d":"423.55"},432.25,414.85,399.5,92.7257]
{"$rows_left_out":228}
{"sheet":"MidCap Intra","index":3,"n_rows":546,"n_cols":13,"rows_kept":546,"merged":[[0,0,0,1],[8,0,9,0],[8,1,9,1],[8,2,9,2],[8,3,9,3],[8,4,8,6],[8,7,8,9]]}
[]
[]
[]
[]
[{"$nulls":11},"Back To Main Page"]
["FOR INTRA DAY TRADING",{"$nulls":9},{"$f":"Main!B10","v":"2019-05-27"}]
[null,null," "]
[]
["Sr.no","Scrip","CLOSE RATE","Pivot Point","Supports",null,null,"Resistances"]
[null,null,"Point",null,"S1","S2","S3","R1","R2","R3","HIGH","LOW","Total Trade Quanity in Lakhs"]
[1,"3MINDIA",23836.1,{"v":23607.86666666667,"d":"23607.87"},{"v":23279.733333333337,"d":"23279.73"},{"v":22723.36666666667,"d":"22723.37"},{"v":22395.233333333337,"d":"22395.23"},{"v":24164.233333333337,"d":"24164.23"},{"v":24492.36666666667,"d":"24492.37"},{"v":25048.733333333337,"d":"25048.73"},23936,23051.5,0.01058]
[2,"ABB",1496.95,{"v":1480.5999999999997,"d":"1480.60"},{"v":1461.1999999999994,"d":"1461.20"},{"v":1425.4499999999996,"d":"1425.45"},{"v":1406.0499999999993,"d":"1406.05"},{"v":1516.3499999999995,"d":"1516.35"},{"v":1535.7499999999995,"d":"1535.75"},{"v":1571.4999999999995,"d":"1571.50"},1500,1444.85,0.76994]
[3,"ACC",1704.9,{"v":1684.0833333333333,"d":"1684.08"},{"v":1658.8166666666666,"d":"1658.82"},{"v":1612.7333333333333,"d":"1612.73"},{"v":1587.4666666666667,"d":"1587.47"},{"v":1730.1666666666665,"d":"1730.17"},{"v":1755.4333333333334,"d":"1755.43"},{"v":1801.5166666666664,"d":"1801.52"},1709.35,1638,8.94742]
[4,"AIAENG",1755.35,{"v":1747.8333333333333,"d":"1747.83"},{"v":1727.6666666666665,"d":"1727.67"},{"v":1699.9833333333333,"d":"1699.98"},{"v":1679.8166666666666,"d":"1679.82"},{"v":1775.5166666666664,"d":"1775.52"},{"v":1795.683333333333,"d":"1795.68"},{"v":1823.3666666666663,"d":"1823.37"},1768,1720.15,0.07341]
[5,"APLAPOLLO",1638.8,{"v":1643.4666666666665,"d":"1643.47"},{"v":1598.983333333333,"d":"1598.98"},{"v":1559.1666666666665,"d":"1559.17"},{"v":1514.683333333333,"d":"1514.68"},{"v":1683.2833333333328,"d":"1683.28"},{"v":1727.7666666666664,"d":"1727.77"},{"v":1767.5833333333328,"d":"1767.58"},1687.95,1603.65,0.39683]
[6,"AUBANK",681.9,{"v":687.3333333333334,"d":"687.33"},{"v":674.5666666666667,"d":"674.57"},{"v":667.2333333333333,"d":"667.23"},{"v":654.4666666666667,"d":"654.47"},{"v":694.6666666666667,"d":"694.67"},{"v":707.4333333333334,"d":"707.43"},{"v":714.7666666666668,"d":"714.77"},700.1,680,0.75103]
[7,"AAVAS",1430.6,1437.05,{"v":1404.1,"d":"1404.10"},{"v":1377.6,"d":"1377.60"},{"v":1344.6499999999999,"d":"1344.65"},1463.55,{"v":1496.5000000000002,"d":"1496.50"},{"v":1523,"d":"1523.00"},1470,1410.55,0.42529]
[8,"ADANIGREEN",42.3,{"v":42.699999999999996,"d":"42.70"},{"v":41.099999999999994,"d":"41.10"},{"v":39.9,"d":"39.90"},{"v":38.3,"d":"38.30"},{"v":43.89999999999999,"d":"43.90"},{"v":45.5,"d":"45.50"},{"v":46.69999999999999,"d":"46.70"},44.3,41.5,8.36545]
[9,"ADANIPORTS",410.25,{"v":408.2,"d":"408.20"},{"v":401.54999999999995,"d":"401.55"},{"v":392.84999999999997,"d":"392.85"},{"v":386.19999999999993,"d":"386.20"},{"v":416.9,"d":"416.90"},{"v":423.54999999999995,"d":"423.55"},432.25,414.85,399.5,92.7257]
[10,"ADANIPOWER",46.8,{"v":46.383333333333326,"d":"46.38"},{"v":45.466666666666654,"d":"45.47"},{"v":44.133333333333326,"d":"44.13"},{"v":43.216666666666654,"d":"43.22"},{"v":47.716666666666654,"d":"47.72"},{"v":48.633333333333326,"d":"48.63"},{"v":49.966666666666654,"d":"49.97"},47.3,45.05,193.6594]
{"$rows_left_out":513}
{"sheet":"Bulk Deals","index":4,"n_rows":62,"n_cols":8,"rows_kept":62,"merged":[[4,0,4,1],[4,2,4,3],[6,1,6,2]]}
[" "]
[]
[]
[]
[]
[{"$nulls":4},"Back To Main Page"]
["Subject :","BULK DEAL",null,{"$f":"Main!B10","v":"2019-05-27"}]
[]
["Date","Scrip code","Scrip Name","Client Name","Buy / Sell","Quantity Traded","Trade Price / Wt.Avg.trade price","Exchange  "]
["2019-05-24",539661,"ACEMEN","HARDIK HARISH GUDHKA","SELL",{"v":22900,"d":"22,900"},19.42,"BSE"]
["2019-05-24",537766,"BCP","HARSHIT PROMOTERS PRIVATE LTD","SELL",{"v":510000,"d":"510,000"},37.11,"BSE"]
["2019-05-24",537766,"BCP","ACHINTYA SECURITIES PVT. LTD.","BUY",{"v":1092734,"d":"1,092,734"},37.38,"BSE"]
["2019-05-24",537766,"BCP","ACHINTYA SECURITIES PVT. LTD.","SELL",{"v":1092734,"d":"1,092,734"},37.1,"BSE"]
["2019-05-24",542678,"CHCL","INDIACREDIT RISK MANAGEMENT LLP","BUY",{"v":652000,"d":"652,000"},61.61,"BSE"]
["2019-05-24",542678,"CHCL","AMRAPALI FINCAP PVT LTD","SELL",{"v":160000,"d":"160,000"},61.5,"BSE"]
["2019-05-24",539770,"DARJEELING","HIMANSHU SHAH","SELL",{"v":88417,"d":"88,417"},89.98,"BSE"]
["2019-05-24",539770,"DARJEELING","YOGENDRA SRIKRISHAN BAGREE","BUY",{"v":35000,"d":"35,000"},{"v":90.5,"d":"90.50"},"BSE"]
["2019-05-24",539770,"DARJEELING","RAMNARESH DASHADEEN NIRMAL","BUY",{"v":20000,"d":"20,000"},89.55,"BSE"]
["2019-05-24",530393,"DBSTOCKBRO","MOHAN LEASING LTD","SELL",{"v":450000,"d":"450,000"},{"v":9.5,"d":"9.50"},"BSE"]
["2019-05-24",542155,"DGL","DHIRAJ JAIN","SELL",{"v":60000,"d":"60,000"},26.3,"BSE"]
{"$rows_left_out":43}
{"sheet":"Call Tracker (Equity & F&O)","index":5,"n_rows":345,"n_cols":18,"rows_kept":345,"merged":[[40,0,41,0],[40,1,41,1],[40,2,41,2],[40,9,41,9],[40,11,41,11],[40,12,41,12],[40,13,41,13],[40,14,41,14],[42,0,43,0],[42,1,43,1],[42,2,43,2],[42,9,43,9],[42,11,43,11],[42,12,43,12],[42,13,43,13],[42,14,43,14],[44,0,45,0],[44,1,45,1],[44,2,45,2],[44,9,45,9],[44,11,45,11],[44,12,45,12],[44,13,45,13],[44,14,45,14],[46,0,47,0],[46,1,47,1],[46,2,47,2],[46,9,47,9],[46,11,47,11],[46,12,47,12],[46,13,47,13],[46,14,47,14],[48,0,49,0],[48,1,49,1],[48,2,49,2],[48,9,49,9],[48,11,49,11],[48,12,49,12],[48,13,49,13],[48,14,49,14],[51,0,52,0],[51,1,52,1],[51,2,52,2],[51,9,52,9],[51,11,52,11],[51,12,52,12],[51,13,52,13],[51,14,52,14],[53,0,54,0],[53,1,54,1],[53,2,54,2],[53,9,54,9],[53,11,54,11],[53,12,54,12],[53,13,54,13],[53,14,54,14],[55,0,56,0],[55,1,56,1],[55,2,56,2],[55,9,56,9],[55,11,56,11],[55,12,56,12],[55,13,56,13],[55,14,56,14],[57,0,58,0],[57,1,58,1],[57,2,58,2],[57,9,58,9],[57,11,58,11],[57,12,58,12],[57,13,58,13],[57,14,58,14],[59,0,60,0],[59,1,60,1],[59,2,60,2],[59,9,60,9],[59,11,60,11],[59,12,60,12],[59,13,60,13],[59,14,60,14],[69,0,70,0],[69,1,70,1],[69,2,70,2],[69,9,70,9],[69,11,70,11],[69,12,70,12],[69,13,70,13],[69,14,70,14],[72,0,73,0],[72,1,73,1],[72,2,73,2],[72,9,73,9],[72,11,73,11],[72,12,73,12],[72,13,73,13],[72,14,73,14],[74,0,75,0],[74,1,75,1],[74,2,75,2],[74,9,75,9],[74,11,75,11],[74,12,75,12],[74,13,75,13],[74,14,75,14],[76,0,77,0],[76,1,77,1],[76,2,77,2],[76,9,77,9],[76,11,77,11],[76,12,77,12],[76,13,77,13],[76,14,77,14],[80,0,81,0],[80,1,81,1],[80,2,81,2],[80,9,81,9],[80,11,81,11],[80,12,81,12],[80,13,81,13],[80,14,81,14],[87,0,88,0],[87,1,88,1],[87,2,88,2],[87,9,88,9],[87,11,88,11],[87,12,88,12],[87,13,88,13],[87,14,88,14],[91,0,92,0],[91,1,92,1],[91,2,92,2],[91,9,92,9],[91,11,92,11],[91,12,92,12],[91,13,92,13],[91,14,92,14]]}
[]
[]
[]
[]
[{"$nulls":12},"Back To Main Page"]
["Retail Research Technical Calls & Fundamental Performance Report for the month of May-2019 "]
[{"$nulls":12},{"$f":"Main!B10","v":"2019-05-27"}]
[null,"Positional  Call"]
["Sr.no","Date",null,"Company","Rec","Rec Price","Stop Loss***","Call Closed At","Target","Remark","Profit / Loss per Share","Gain / Loss  %","Status","Closed Date","NSE Closed Price"]
[1,"2019-04-03",null,"BOSCHLTD","Buy",17975,16850,16800,"19500-20000","Loss of Rs.1175/-",{"$f":"H10-F10","v":-1175},{"$f":"K10/F10","v":{"v":-0.06536856745479833,"d":"-6.54%"}},"Unsuccessful","2019-05-14",{"$nulls":3},"R"]
[2,"2019-04-08",null,"BAJFINANCE","Sell",3005,3166.6,3038,"2750-2700","Loss of Rs.33/-",{"$f":"F11-H11","v":-33},{"$f":"K11/F11","v":{"v":-0.010981697171381031,"d":"-1.10%"}},"Unsuccessful","2019-05-17",{"$nulls":3},"R"]
[3,"2019-04-23",null,"DMART","Buy",1305,1212,1350,"1470-1500","Part Profit of Rs.45/-",{"$f":"H12-F12","v":45},{"$f":"K12/F12","v":{"v":0.034482758620689655,"d":"3.45%"}},"Successful","2019-05-24",{"$nulls":3},"R"]
[4,"2019-04-24",null,"VEDL","Buy",173,164,164,"190-195","Loss of Rs.9/-",{"$f":"H13-F13","v":-9},{"$f":"K13/F13","v":{"v":-0.05202312138728324,"d":"-5.20%"}},"Unsuccessful","2019-05-07",{"$nulls":3},"H"]
[5,"2019-04-25",null,"GRASIM","Sell",900.5,945.6,856,"820-810"," Profit of Rs.44.5",{"$f":"F14-H14","v":44.5},{"v":0.05,"d":"5.00%"},"Successful","2019-05-07",{"$nulls":3},"R"]
[6,"2019-05-02",null,"BAJAJFINSV","Sell",7620,7880,7305,7200,"Profit of Rs.315/-",{"$f":"F15-H15","v":315},{"$f":"K15/F15","v":{"v":0.04133858267716536,"d":"4.13%"}},"Successful","2019-05-14",{"$nulls":3},"H"]
[7,"2019-05-02",null,"IDFCFIRSTB","Buy",50.45,48,47.75,"55-56","Loss of Rs.2.7/-",{"$f":"H16-F16","v":-2.700000000000003},{"$f":"K16/F16","v":{"v":-0.05351833498513385,"d":"-5.35%"}},"Unsuccessful","2019-05-13",{"$nulls":3},"H"]
[8,"2019-05-03",null,"APOLLOTYRE","Buy",203,189,189,"225-230","Loss of Rs.14/-",{"$f":"H17-F17","v":-14},{"$f":"K17/F17","v":{"v":-0.06896551724137931,"d":"-6.90%"}},"Unsuccessful","2019-05-09",{"$nulls":3},"H"]
[9,"2019-05-03",null,"M&M","Buy",644,615,615,"690-700","Loss of Rs.29/-",{"$f":"H18-F18","v":-29},{"$f":"K18/F18","v":{"v":-0.04503105590062112,"d":"-4.50%"}},"Unsuccessful","2019-05-15",{"$nulls":3},"H"]
[10,"2019-05-06",null,"MARUTI","Buy",6675,6400,7115,"7200-7300","Profit of Rs.440/-",{"$f":"H19-F19","v":440},{"$f":"K19/F19","v":{"v":0.06591760299625468,"d":"6.59%"}},"Successful","2019-05-20",{"$nulls":3},"H"]
[11,"2019-05-08",null,"COLPAL","Buy","1140-1150",1089,null,"1240-1260","Open",{"$nulls":4},{"$f":"VLOOKUP(D20,Sheet2!A38:M1833,6,0)","v":1161.6},null,null,"H"]
{"$rows_left_out":314}
{"sheet":"Sheet2","index":6,"n_rows":1648,"n_cols":14,"rows_kept":1648,"hidden":true}
["SYMBOL","SERIES","OPEN","HIGH","LOW","CLOSE","LAST","PREVCLOSE","TOTTRDQTY","TOTTRDVAL","TIMESTAMP","TOTALTRADES","ISIN","ISIN"]
["20MICRONS","EQ",38,41.9,37.5,39.7,39.6,37.3,66155,2604305.1,"2019-05-24",570,"INE144J01027"]
["21STCENMGM","EQ",18,18.5,18,18.5,18.5,18.3,329,6080.5,"2019-05-24",5,"INE253B01015"]
["3IINFOTECH","EQ",3.55,3.6,3.45,3.55,3.55,3.5,1572197,5536583.4,"2019-05-24",664,"INE748C01020"]
["3MINDIA","EQ",23284.65,23936,23051.5,23836.1,23800,23122.85,1058,25009920.7,"2019-05-24",501,"INE470A01017"]
["3PLAND","BE",10.85,10.9,10.85,10.85,10.85,10.9,6000,65175,"2019-05-24",17,"INE105C01023"]
["5PAISA","EQ",326,359.45,326,351.65,354.05,326.8,51395,18044723.65,"2019-05-24",1610,"INE618L01018"]
["63MOONS","EQ",138.1,143.65,137.2,143.65,143.65,136.85,157230,22395592.9,"2019-05-24",1423,"INE111B01023"]
["8KMILES","EQ",100.6,105.8,100,105.45,105.8,100.8,227550,23608958.45,"2019-05-24",2219,"INE650K01021"]
["A2ZINFRA","EQ",17.6,18.2,16.8,17.35,17.35,17.05,376233,6592364.4,"2019-05-24",1068,"INE619I01012"]
["AARTIDRUGS","EQ",562.25,569,555.9,566,563.05,562.2,9108,5102681.55,"2019-05-24",720,"INE767A01016"]
["AARTIIND","EQ",1728,1805.25,1728,1798.55,1802.15,1728.1,205098,363315601.15,"2019-05-24",19328,"INE769A01020"]
["AARVEEDEN","EQ",22.7,23.95,22.6,23.25,23.65,22.85,5332,122932.5,"2019-05-24",135,"INE273D01019"]
["AAVAS","EQ",1464,1470,1410.55,1430.6,1428.1,1449.3,42529,60772135,"2019-05-24",12408,"INE216P01012"]
["ABAN","BE",49.4,49.9,47.3,49.2,49.9,47.85,43847,2126659.45,"2019-05-24",466,"INE421A01028"]
["ABB","EQ",1463.85,1500,1444.85,1496.95,1497.95,1437.7,76994,113599353.3,"2019-05-24",6310,"INE117A01022"]
["ABBOTINDIA","EQ",7770,7941,7709.95,7909.15,7910,7665.35,5151,40601227.7,"2019-05-24",1095,"INE358A01014"]
["ABCAPITAL","EQ",98,98.5,96,97.6,97.85,95.85,2130586,207527497.9,"2019-05-24",16846,"INE674K01013"]
["ABFRL","EQ",196,203.45,194.05,202.6,203.35,193.8,320065,63798636.75,"2019-05-24",7485,"INE647O01011"]
["ABSLNN50ET","EQ",273,275.68,269.21,273.57,275.68,267.32,250,68065.26,"2019-05-24",10,"INF209KB1B87"]
{"$rows_left_out":1629}
{"sheet":"Sheet1","index":7,"n_rows":0,"n_cols":0,"rows_kept":0,"hidden":true}

{"sheet":"Sheet3","index":8,"n_rows":0,"n_cols":0,"rows_kept":0,"hidden":true}

{"sheet":"Sheet4","index":9,"n_rows":0,"n_cols":0,"rows_kept":0,"hidden":true}